openjpa-commits mailing list archives

Site index · List index
Message view « Date » · « Thread »
Top « Date » · « Thread »
From Apache Jenkins Server <jenk...@builds.apache.org>
Subject Build failed in Jenkins: OpenJPA-trunk #938
Date Tue, 14 Oct 2014 20:03:16 GMT
See <https://builds.apache.org/job/OpenJPA-trunk/938/changes>

Changes:

[hthomann] OPENJPA-2535: Fixed issue with DBCS characters in identifiers - merged from 2.2.x
commit.

------------------------------------------
[...truncated 6464 lines...]
Tests run: 3, Failures: 0, Errors: 0, Skipped: 0, Time elapsed: 0.013 sec
Running org.apache.openjpa.enhance.TestPCSubclassNameConversion
Tests run: 1, Failures: 0, Errors: 0, Skipped: 0, Time elapsed: 0.033 sec
Running org.apache.openjpa.meta.TestJavaTypes
Tests run: 1, Failures: 0, Errors: 0, Skipped: 0, Time elapsed: 0.009 sec
Running org.apache.openjpa.meta.TestAccessCode
Tests run: 8, Failures: 0, Errors: 0, Skipped: 0, Time elapsed: 0.012 sec
Running org.apache.openjpa.enhance.TestGetDeclaredMethod
Tests run: 3, Failures: 0, Errors: 0, Skipped: 0, Time elapsed: 0.015 sec
Running org.apache.openjpa.util.TestProxyManager
Tests run: 44, Failures: 0, Errors: 0, Skipped: 0, Time elapsed: 0.273 sec
Running org.apache.openjpa.ee.TestOSGiManagedRuntime
Tests run: 4, Failures: 0, Errors: 0, Skipped: 0, Time elapsed: 0.012 sec
Running org.apache.openjpa.util.TestResultShape
Tests run: 8, Failures: 0, Errors: 0, Skipped: 0, Time elapsed: 0.012 sec
Running org.apache.openjpa.ee.TestWASManagedRuntime
Tests run: 1, Failures: 0, Errors: 0, Skipped: 0, Time elapsed: 0.003 sec

Results :

Tests run: 75, Failures: 0, Errors: 0, Skipped: 0

[JENKINS] Recording test results
[INFO] [jar:jar {execution: default-jar}]
[INFO] Building jar: <https://builds.apache.org/job/OpenJPA-trunk/ws/trunk/openjpa-kernel/target/openjpa-kernel-2.4.0-SNAPSHOT.jar>
[INFO] [jar:jar {execution: default-jar}]
[INFO] [jar:test-jar {execution: attach-tests}]
[INFO] Building jar: <https://builds.apache.org/job/OpenJPA-trunk/ws/trunk/openjpa-kernel/target/openjpa-kernel-2.4.0-SNAPSHOT-tests.jar>
[INFO] [ianal:verify-legal-files {execution: default}]
[INFO] Checking legal files in: openjpa-kernel-2.4.0-SNAPSHOT.jar
[INFO] Checking legal files in: openjpa-kernel-2.4.0-SNAPSHOT-tests.jar
[INFO] [apache-rat:check {execution: default}]
[INFO] Exclude: **/.*/**
[INFO] Exclude: **/target/**/*
[INFO] [install:install {execution: default-install}]
[INFO] Installing <https://builds.apache.org/job/OpenJPA-trunk/ws/trunk/openjpa-kernel/target/openjpa-kernel-2.4.0-SNAPSHOT.jar>
to /home/jenkins/jenkins-slave/maven-repositories/0/org/apache/openjpa/openjpa-kernel/2.4.0-SNAPSHOT/openjpa-kernel-2.4.0-SNAPSHOT.jar
[INFO] Installing <https://builds.apache.org/job/OpenJPA-trunk/ws/trunk/openjpa-kernel/target/openjpa-kernel-2.4.0-SNAPSHOT-tests.jar>
to /home/jenkins/jenkins-slave/maven-repositories/0/org/apache/openjpa/openjpa-kernel/2.4.0-SNAPSHOT/openjpa-kernel-2.4.0-SNAPSHOT-tests.jar
[INFO] ------------------------------------------------------------------------
[INFO] Building OpenJPA JDBC
[INFO]    task-segment: [clean, install]
[INFO] ------------------------------------------------------------------------
[INFO] [clean:clean {execution: default-clean}]
[INFO] [buildnumber:create {execution: default}]
[INFO] [enforcer:enforce {execution: default}]
[INFO] [checkstyle:checkstyle {execution: default}]
[INFO] Starting audit...
Audit done.

[WARNING] Unable to locate Source XRef to link to - DISABLED
[INFO] [remote-resources:process {execution: default}]
[WARNING] org.apache.velocity.runtime.exception.ReferenceException: reference : template =
META-INF/DEPENDENCIES.vm [line 40,column 14] : $license.name is not a valid reference.
[WARNING] org.apache.velocity.runtime.exception.ReferenceException: reference : template =
META-INF/DEPENDENCIES.vm [line 40,column 14] : $license.name is not a valid reference.
[INFO] [resources:resources {execution: default-resources}]
[INFO] Using 'UTF-8' encoding to copy filtered resources.
[INFO] Copying 14 resources
[INFO] Copying 3 resources
[INFO] [compiler:compile {execution: default-compile}]
[INFO] Compiling 359 source files to <https://builds.apache.org/job/OpenJPA-trunk/ws/trunk/openjpa-jdbc/target/classes>
[INFO] [compiler:testCompile {execution: test-source-compile}]
[INFO] Compiling 8 source files to <https://builds.apache.org/job/OpenJPA-trunk/ws/trunk/openjpa-jdbc/target/test-classes>
[INFO] [resources:testResources {execution: default-testResources}]
[INFO] Using 'UTF-8' encoding to copy filtered resources.
[INFO] skip non existing resourceDirectory <https://builds.apache.org/job/OpenJPA-trunk/ws/trunk/openjpa-jdbc/src/test/resources>
[INFO] Copying 3 resources
[INFO] [compiler:testCompile {execution: default-testCompile}]
[INFO] Nothing to compile - all classes are up to date
[WARNING] DEPRECATED [systemProperties]: Use systemPropertyVariables instead.
[INFO] [surefire:test {execution: default-test}]
[INFO] Surefire report directory: <https://builds.apache.org/job/OpenJPA-trunk/ws/trunk/openjpa-jdbc/target/surefire-reports>

-------------------------------------------------------
 T E S T S
-------------------------------------------------------
Running org.apache.openjpa.jdbc.sql.identifier.TestDBIdentifiers
Tests run: 5, Failures: 0, Errors: 0, Skipped: 0, Time elapsed: 0.051 sec
Running org.apache.openjpa.jdbc.sql.TestDBDictionaryGeneratedSQL
Tests run: 5, Failures: 0, Errors: 0, Skipped: 0, Time elapsed: 0.246 sec
Running org.apache.openjpa.jdbc.meta.TestMappingDefaultsImpl
4  INFO   [main] openjpa.jdbc.JDBC - Using dictionary class "org.apache.openjpa.jdbc.sql.OracleDictionary".
Tests run: 1, Failures: 0, Errors: 0, Skipped: 0, Time elapsed: 0.158 sec
Running org.apache.openjpa.jdbc.sql.TestDB2Dictionary
Tests run: 5, Failures: 0, Errors: 0, Skipped: 0, Time elapsed: 0.139 sec
Running org.apache.openjpa.jdbc.sql.TestMySQLDictionary
Tests run: 3, Failures: 0, Errors: 0, Skipped: 0, Time elapsed: 0.09 sec
Running org.apache.openjpa.jdbc.kernel.TestSQLStoreParamsSubstitution
Tests run: 1, Failures: 0, Errors: 0, Skipped: 0, Time elapsed: 0.007 sec
Running org.apache.openjpa.jdbc.kernel.TestUpdateManagerFlushException
Tests run: 1, Failures: 0, Errors: 0, Skipped: 0, Time elapsed: 0.006 sec
Running org.apache.openjpa.jdbc.sql.TestDictionaryFactory
Tests run: 1, Failures: 0, Errors: 0, Skipped: 0, Time elapsed: 0.005 sec

Results :

Tests run: 22, Failures: 0, Errors: 0, Skipped: 0

[JENKINS] Recording test results
[INFO] [jar:jar {execution: default-jar}]
[INFO] Building jar: <https://builds.apache.org/job/OpenJPA-trunk/ws/trunk/openjpa-jdbc/target/openjpa-jdbc-2.4.0-SNAPSHOT.jar>
[INFO] [jar:jar {execution: default-jar}]
[INFO] [jar:test-jar {execution: attach-tests}]
[INFO] Building jar: <https://builds.apache.org/job/OpenJPA-trunk/ws/trunk/openjpa-jdbc/target/openjpa-jdbc-2.4.0-SNAPSHOT-tests.jar>
[INFO] [ianal:verify-legal-files {execution: default}]
[INFO] Checking legal files in: openjpa-jdbc-2.4.0-SNAPSHOT.jar
[INFO] Checking legal files in: openjpa-jdbc-2.4.0-SNAPSHOT-tests.jar
[INFO] [apache-rat:check {execution: default}]
[INFO] Exclude: **/.*/**
[INFO] Exclude: **/target/**/*
[INFO] [install:install {execution: default-install}]
[INFO] Installing <https://builds.apache.org/job/OpenJPA-trunk/ws/trunk/openjpa-jdbc/target/openjpa-jdbc-2.4.0-SNAPSHOT.jar>
to /home/jenkins/jenkins-slave/maven-repositories/0/org/apache/openjpa/openjpa-jdbc/2.4.0-SNAPSHOT/openjpa-jdbc-2.4.0-SNAPSHOT.jar
[INFO] Installing <https://builds.apache.org/job/OpenJPA-trunk/ws/trunk/openjpa-jdbc/target/openjpa-jdbc-2.4.0-SNAPSHOT-tests.jar>
to /home/jenkins/jenkins-slave/maven-repositories/0/org/apache/openjpa/openjpa-jdbc/2.4.0-SNAPSHOT/openjpa-jdbc-2.4.0-SNAPSHOT-tests.jar
[INFO] ------------------------------------------------------------------------
[INFO] Building OpenJPA Persistence
[INFO]    task-segment: [clean, install]
[INFO] ------------------------------------------------------------------------
[INFO] [clean:clean {execution: default-clean}]
[INFO] [buildnumber:create {execution: default}]
[INFO] [enforcer:enforce {execution: default}]
[INFO] [checkstyle:checkstyle {execution: default}]
[INFO] Starting audit...
Audit done.

[WARNING] Unable to locate Source XRef to link to - DISABLED
[INFO] [remote-resources:process {execution: default}]
[WARNING] org.apache.velocity.runtime.exception.ReferenceException: reference : template =
META-INF/DEPENDENCIES.vm [line 40,column 14] : $license.name is not a valid reference.
[WARNING] org.apache.velocity.runtime.exception.ReferenceException: reference : template =
META-INF/DEPENDENCIES.vm [line 40,column 14] : $license.name is not a valid reference.
[INFO] [resources:resources {execution: default-resources}]
[INFO] Using 'UTF-8' encoding to copy filtered resources.
[INFO] Copying 14 resources
[INFO] Copying 3 resources
[INFO] [compiler:compile {execution: default-compile}]
[INFO] Compiling 234 source files to <https://builds.apache.org/job/OpenJPA-trunk/ws/trunk/openjpa-persistence/target/classes>
[INFO] [compiler:testCompile {execution: test-source-compile}]
[INFO] Compiling 2 source files to <https://builds.apache.org/job/OpenJPA-trunk/ws/trunk/openjpa-persistence/target/test-classes>
[INFO] [resources:testResources {execution: default-testResources}]
[INFO] Using 'UTF-8' encoding to copy filtered resources.
[INFO] Copying 3 resources
[INFO] Copying 3 resources
[INFO] [compiler:testCompile {execution: default-testCompile}]
[INFO] Nothing to compile - all classes are up to date
[WARNING] DEPRECATED [systemProperties]: Use systemPropertyVariables instead.
[INFO] [surefire:test {execution: default-test}]
[INFO] Surefire report directory: <https://builds.apache.org/job/OpenJPA-trunk/ws/trunk/openjpa-persistence/target/surefire-reports>

-------------------------------------------------------
 T E S T S
-------------------------------------------------------
Running org.apache.openjpa.persistence.TestEnumToKernelConstantMappings
Tests run: 7, Failures: 0, Errors: 0, Skipped: 0, Time elapsed: 0.043 sec
Running org.apache.openjpa.persistence.TestPersistenceProductDerivation
Tests run: 5, Failures: 0, Errors: 0, Skipped: 0, Time elapsed: 0.307 sec

Results :

Tests run: 12, Failures: 0, Errors: 0, Skipped: 0

[JENKINS] Recording test results
[INFO] [jar:jar {execution: default-jar}]
[INFO] Building jar: <https://builds.apache.org/job/OpenJPA-trunk/ws/trunk/openjpa-persistence/target/openjpa-persistence-2.4.0-SNAPSHOT.jar>
[INFO] [jar:jar {execution: default-jar}]
[INFO] [jar:test-jar {execution: attach-tests}]
[INFO] Building jar: <https://builds.apache.org/job/OpenJPA-trunk/ws/trunk/openjpa-persistence/target/openjpa-persistence-2.4.0-SNAPSHOT-tests.jar>
[INFO] [ianal:verify-legal-files {execution: default}]
[INFO] Checking legal files in: openjpa-persistence-2.4.0-SNAPSHOT.jar
[INFO] Checking legal files in: openjpa-persistence-2.4.0-SNAPSHOT-tests.jar
[INFO] [apache-rat:check {execution: default}]
[INFO] Exclude: **/.*/**
[INFO] Exclude: **/target/**/*
[INFO] [install:install {execution: default-install}]
[INFO] Installing <https://builds.apache.org/job/OpenJPA-trunk/ws/trunk/openjpa-persistence/target/openjpa-persistence-2.4.0-SNAPSHOT.jar>
to /home/jenkins/jenkins-slave/maven-repositories/0/org/apache/openjpa/openjpa-persistence/2.4.0-SNAPSHOT/openjpa-persistence-2.4.0-SNAPSHOT.jar
[INFO] Installing <https://builds.apache.org/job/OpenJPA-trunk/ws/trunk/openjpa-persistence/target/openjpa-persistence-2.4.0-SNAPSHOT-tests.jar>
to /home/jenkins/jenkins-slave/maven-repositories/0/org/apache/openjpa/openjpa-persistence/2.4.0-SNAPSHOT/openjpa-persistence-2.4.0-SNAPSHOT-tests.jar
[INFO] ------------------------------------------------------------------------
[INFO] Building OpenJPA Persistence JDBC
[INFO]    task-segment: [clean, install]
[INFO] ------------------------------------------------------------------------
[INFO] [clean:clean {execution: default-clean}]
[INFO] [buildnumber:create {execution: default}]
[INFO] [enforcer:enforce {execution: default}]
[INFO] [checkstyle:checkstyle {execution: default}]
[INFO] Starting audit...
<https://builds.apache.org/job/OpenJPA-trunk/ws/trunk/openjpa-persistence-jdbc/src/test/java/org/apache/openjpa/persistence/jdbc/dbcs/MyDBCSEntity.java>:32:24:
Got an exception - Unexpected character 0xa1 in identifier
Audit done.

[INFO] ------------------------------------------------------------------------
[ERROR] BUILD ERROR
[INFO] ------------------------------------------------------------------------
[INFO] An error has occurred in Checkstyle report generation.

Embedded error: Failed during checkstyle execution
There are 1 checkstyle errors.
[INFO] ------------------------------------------------------------------------
[INFO] For more information, run Maven with the -e switch
[INFO] ------------------------------------------------------------------------
[INFO] Total time: 1 minute 20 seconds
[INFO] Finished at: Tue Oct 14 20:02:58 UTC 2014
[INFO] Final Memory: 99M/522M
[INFO] ------------------------------------------------------------------------
[JENKINS] Archiving <https://builds.apache.org/job/OpenJPA-trunk/ws/trunk/openjpa-lib/pom.xml>
to org.apache.openjpa/openjpa-lib/2.4.0-SNAPSHOT/openjpa-lib-2.4.0-SNAPSHOT.pom
[JENKINS] Archiving <https://builds.apache.org/job/OpenJPA-trunk/ws/trunk/openjpa-lib/target/openjpa-lib-2.4.0-SNAPSHOT.jar>
to org.apache.openjpa/openjpa-lib/2.4.0-SNAPSHOT/openjpa-lib-2.4.0-SNAPSHOT.jar
[JENKINS] Archiving <https://builds.apache.org/job/OpenJPA-trunk/ws/trunk/openjpa-lib/target/openjpa-lib-2.4.0-SNAPSHOT-tests.jar>
to org.apache.openjpa/openjpa-lib/2.4.0-SNAPSHOT/openjpa-lib-2.4.0-SNAPSHOT-tests.jar
Sending artifact delta relative to OpenJPA-trunk » OpenJPA Utilities Library #937
Archived 3 artifacts
Archive block size is 32768
Received 0 blocks and 582710 bytes
Compression is 0.0%
Took 0.73 sec
[JENKINS] Archiving <https://builds.apache.org/job/OpenJPA-trunk/ws/trunk/openjpa-kernel/pom.xml>
to org.apache.openjpa/openjpa-kernel/2.4.0-SNAPSHOT/openjpa-kernel-2.4.0-SNAPSHOT.pom
[JENKINS] Archiving <https://builds.apache.org/job/OpenJPA-trunk/ws/trunk/openjpa-kernel/target/openjpa-kernel-2.4.0-SNAPSHOT.jar>
to org.apache.openjpa/openjpa-kernel/2.4.0-SNAPSHOT/openjpa-kernel-2.4.0-SNAPSHOT.jar
[JENKINS] Archiving <https://builds.apache.org/job/OpenJPA-trunk/ws/trunk/openjpa-kernel/target/openjpa-kernel-2.4.0-SNAPSHOT-tests.jar>
to org.apache.openjpa/openjpa-kernel/2.4.0-SNAPSHOT/openjpa-kernel-2.4.0-SNAPSHOT-tests.jar
Sending artifact delta relative to OpenJPA-trunk » OpenJPA Kernel #937
Archived 3 artifacts
Archive block size is 32768
Received 1 blocks and 1487874 bytes
Compression is 2.2%
Took 0.49 sec
[JENKINS] Archiving <https://builds.apache.org/job/OpenJPA-trunk/ws/trunk/openjpa-persistence-jdbc/pom.xml>
to org.apache.openjpa/openjpa-persistence-jdbc/2.4.0-SNAPSHOT/openjpa-persistence-jdbc-2.4.0-SNAPSHOT.pom
Sending artifact delta relative to OpenJPA-trunk » OpenJPA Persistence JDBC #937
Archived 1 artifacts
Archive block size is 32768
Received 1 blocks and 26649 bytes
Compression is 55.1%
Took 1.6 sec
[JENKINS] Archiving /home/jenkins/jenkins-slave/maven-repositories/0/org/apache/openjpa/openjpa-parent/2.4.0-SNAPSHOT/openjpa-parent-2.4.0-SNAPSHOT.pom
to org.apache.openjpa/openjpa-parent/2.4.0-SNAPSHOT/openjpa-parent-2.4.0-SNAPSHOT.pom
/home/jenkins/jenkins-slave/maven-repositories/0/org/apache/openjpa/openjpa-parent/2.4.0-SNAPSHOT/openjpa-parent-2.4.0-SNAPSHOT.pom
is not inside <https://builds.apache.org/job/OpenJPA-trunk/ws/trunk/;> will archive
in a separate pass
Sending artifact delta relative to OpenJPA-trunk » OpenJPA Parent POM #937
Archived 1 artifacts
Archive block size is 32768
Received 1 blocks and 21444 bytes
Compression is 60.4%
Took 48 ms
[JENKINS] Archiving <https://builds.apache.org/job/OpenJPA-trunk/ws/trunk/openjpa-persistence/pom.xml>
to org.apache.openjpa/openjpa-persistence/2.4.0-SNAPSHOT/openjpa-persistence-2.4.0-SNAPSHOT.pom
[JENKINS] Archiving <https://builds.apache.org/job/OpenJPA-trunk/ws/trunk/openjpa-persistence/target/openjpa-persistence-2.4.0-SNAPSHOT.jar>
to org.apache.openjpa/openjpa-persistence/2.4.0-SNAPSHOT/openjpa-persistence-2.4.0-SNAPSHOT.jar
[JENKINS] Archiving <https://builds.apache.org/job/OpenJPA-trunk/ws/trunk/openjpa-persistence/target/openjpa-persistence-2.4.0-SNAPSHOT-tests.jar>
to org.apache.openjpa/openjpa-persistence/2.4.0-SNAPSHOT/openjpa-persistence-2.4.0-SNAPSHOT-tests.jar
Sending artifact delta relative to OpenJPA-trunk » OpenJPA Persistence #937
Archived 3 artifacts
Archive block size is 32768
Received 0 blocks and 864920 bytes
Compression is 0.0%
Took 0.27 sec
[JENKINS] Archiving <https://builds.apache.org/job/OpenJPA-trunk/ws/trunk/openjpa-jdbc/pom.xml>
to org.apache.openjpa/openjpa-jdbc/2.4.0-SNAPSHOT/openjpa-jdbc-2.4.0-SNAPSHOT.pom
[JENKINS] Archiving <https://builds.apache.org/job/OpenJPA-trunk/ws/trunk/openjpa-jdbc/target/openjpa-jdbc-2.4.0-SNAPSHOT.jar>
to org.apache.openjpa/openjpa-jdbc/2.4.0-SNAPSHOT/openjpa-jdbc-2.4.0-SNAPSHOT.jar
[JENKINS] Archiving <https://builds.apache.org/job/OpenJPA-trunk/ws/trunk/openjpa-jdbc/target/openjpa-jdbc-2.4.0-SNAPSHOT-tests.jar>
to org.apache.openjpa/openjpa-jdbc/2.4.0-SNAPSHOT/openjpa-jdbc-2.4.0-SNAPSHOT-tests.jar
Sending artifact delta relative to OpenJPA-trunk » OpenJPA JDBC #937
Archived 3 artifacts
Archive block size is 32768
Received 1 blocks and 1457149 bytes
Compression is 2.2%
Took 0.46 sec
Sending e-mails to: commits@openjpa.apache.org
channel stopped

Mime
View raw message