openjpa-commits mailing list archives

Site index · List index
Message view « Date » · « Thread »
Top « Date » · « Thread »
From Apache Jenkins Server <jenk...@builds.apache.org>
Subject Build failed in Jenkins: OpenJPA-22x-deploy #61
Date Wed, 15 Oct 2014 06:49:28 GMT
See <https://builds.apache.org/job/OpenJPA-22x-deploy/61/changes>

Changes:

[hthomann] OPENJPA-2535: Fixed issue with DBCS characters in identifiers.

------------------------------------------
[...truncated 424 lines...]
[INFO] Deleting file set: <https://builds.apache.org/job/OpenJPA-22x-deploy/ws/2.2.x/openjpa-jdbc/target>
(included: [**], excluded: [])
[INFO] [buildnumber:create {execution: default}]
[INFO] [enforcer:enforce {execution: default}]
[INFO] [checkstyle:checkstyle {execution: default}]
[INFO] Starting audit...
Audit done.

[WARNING] Unable to locate Source XRef to link to - DISABLED
[INFO] [remote-resources:process {execution: default}]
[INFO] [resources:resources {execution: default-resources}]
[INFO] Using 'UTF-8' encoding to copy filtered resources.
[INFO] Copying 14 resources
[INFO] Copying 3 resources
[INFO] [compiler:compile {execution: default-compile}]
[INFO] Compiling 358 source files to <https://builds.apache.org/job/OpenJPA-22x-deploy/ws/2.2.x/openjpa-jdbc/target/classes>
[INFO] [compiler:testCompile {execution: test-source-compile}]
[INFO] Compiling 8 source files to <https://builds.apache.org/job/OpenJPA-22x-deploy/ws/2.2.x/openjpa-jdbc/target/test-classes>
[INFO] [resources:testResources {execution: default-testResources}]
[INFO] Using 'UTF-8' encoding to copy filtered resources.
[INFO] skip non existing resourceDirectory <https://builds.apache.org/job/OpenJPA-22x-deploy/ws/2.2.x/openjpa-jdbc/src/test/resources>
[INFO] Copying 3 resources
[INFO] [compiler:testCompile {execution: default-testCompile}]
[INFO] Nothing to compile - all classes are up to date
[WARNING] DEPRECATED [systemProperties]: Use systemPropertyVariables instead.
[INFO] [surefire:test {execution: default-test}]
[INFO] Surefire report directory: <https://builds.apache.org/job/OpenJPA-22x-deploy/ws/2.2.x/openjpa-jdbc/target/surefire-reports>

-------------------------------------------------------
 T E S T S
-------------------------------------------------------
Running org.apache.openjpa.jdbc.sql.identifier.TestDBIdentifiers
Tests run: 5, Failures: 0, Errors: 0, Skipped: 0, Time elapsed: 0.05 sec
Running org.apache.openjpa.jdbc.sql.TestDBDictionaryGeneratedSQL
Tests run: 5, Failures: 0, Errors: 0, Skipped: 0, Time elapsed: 0.269 sec
Running org.apache.openjpa.jdbc.meta.TestMappingDefaultsImpl
6  INFO   [main] openjpa.jdbc.JDBC - Using dictionary class "org.apache.openjpa.jdbc.sql.OracleDictionary".
Tests run: 1, Failures: 0, Errors: 0, Skipped: 0, Time elapsed: 0.152 sec
Running org.apache.openjpa.jdbc.sql.TestDB2Dictionary
Tests run: 5, Failures: 0, Errors: 0, Skipped: 0, Time elapsed: 0.131 sec
Running org.apache.openjpa.jdbc.sql.TestMySQLDictionary
Tests run: 3, Failures: 0, Errors: 0, Skipped: 0, Time elapsed: 0.099 sec
Running org.apache.openjpa.jdbc.kernel.TestSQLStoreParamsSubstitution
Tests run: 1, Failures: 0, Errors: 0, Skipped: 0, Time elapsed: 0.007 sec
Running org.apache.openjpa.jdbc.kernel.TestUpdateManagerFlushException
Tests run: 1, Failures: 0, Errors: 0, Skipped: 0, Time elapsed: 0.006 sec
Running org.apache.openjpa.jdbc.sql.TestDictionaryFactory
Tests run: 1, Failures: 0, Errors: 0, Skipped: 0, Time elapsed: 0.004 sec

Results :

Tests run: 22, Failures: 0, Errors: 0, Skipped: 0

[JENKINS] Recording test results
[INFO] [jar:jar {execution: default-jar}]
[INFO] Building jar: <https://builds.apache.org/job/OpenJPA-22x-deploy/ws/2.2.x/openjpa-jdbc/target/openjpa-jdbc-2.2.3-SNAPSHOT.jar>
[INFO] [jar:jar {execution: default-jar}]
[INFO] [jar:test-jar {execution: attach-tests}]
[INFO] Building jar: <https://builds.apache.org/job/OpenJPA-22x-deploy/ws/2.2.x/openjpa-jdbc/target/openjpa-jdbc-2.2.3-SNAPSHOT-tests.jar>
[INFO] [ianal:verify-legal-files {execution: default}]
[INFO] Checking legal files in: openjpa-jdbc-2.2.3-SNAPSHOT.jar
[INFO] Checking legal files in: openjpa-jdbc-2.2.3-SNAPSHOT-tests.jar
[INFO] [apache-rat:check {execution: default}]
[INFO] Exclude: **/.*/**
[INFO] Exclude: **/target/**/*
[INFO] [install:install {execution: default-install}]
[INFO] Installing <https://builds.apache.org/job/OpenJPA-22x-deploy/ws/2.2.x/openjpa-jdbc/target/openjpa-jdbc-2.2.3-SNAPSHOT.jar>
to /home/jenkins/jenkins-slave/maven-repositories/1/org/apache/openjpa/openjpa-jdbc/2.2.3-SNAPSHOT/openjpa-jdbc-2.2.3-SNAPSHOT.jar
[INFO] Installing <https://builds.apache.org/job/OpenJPA-22x-deploy/ws/2.2.x/openjpa-jdbc/target/openjpa-jdbc-2.2.3-SNAPSHOT-tests.jar>
to /home/jenkins/jenkins-slave/maven-repositories/1/org/apache/openjpa/openjpa-jdbc/2.2.3-SNAPSHOT/openjpa-jdbc-2.2.3-SNAPSHOT-tests.jar
[INFO] [deploy:deploy {execution: default-deploy}]
[INFO] Retrieving previous build number from apache.snapshots.https
[WARNING] *** CHECKSUM FAILED - Checksum failed on download: local = '4be84a85106ebbe70223faddc1dcfe68a2b943c4';
remote = 'ae5f65a9cfac9d92069c56ec8c016c381aed2544' - RETRYING
[WARNING] *** CHECKSUM FAILED - Checksum failed on download: local = '4be84a85106ebbe70223faddc1dcfe68a2b943c4';
remote = 'ae5f65a9cfac9d92069c56ec8c016c381aed2544' - IGNORING
Uploading: https://repository.apache.org/content/repositories/snapshots/org/apache/openjpa/openjpa-jdbc/2.2.3-SNAPSHOT/openjpa-jdbc-2.2.3-20141015.064650-39.jar
1396K uploaded  (openjpa-jdbc-2.2.3-20141015.064650-39.jar)
[INFO] Retrieving previous metadata from apache.snapshots.https
[WARNING] *** CHECKSUM FAILED - Checksum failed on download: local = '4be84a85106ebbe70223faddc1dcfe68a2b943c4';
remote = 'ae5f65a9cfac9d92069c56ec8c016c381aed2544' - RETRYING
[WARNING] *** CHECKSUM FAILED - Checksum failed on download: local = '4be84a85106ebbe70223faddc1dcfe68a2b943c4';
remote = 'ae5f65a9cfac9d92069c56ec8c016c381aed2544' - IGNORING
[INFO] Uploading repository metadata for: 'snapshot org.apache.openjpa:openjpa-jdbc:2.2.3-SNAPSHOT'
[INFO] Uploading project information for openjpa-jdbc 2.2.3-20141015.064650-39
[INFO] Retrieving previous metadata from apache.snapshots.https
[INFO] Uploading repository metadata for: 'artifact org.apache.openjpa:openjpa-jdbc'
[INFO] Retrieving previous build number from apache.snapshots.https
Uploading: https://repository.apache.org/content/repositories/snapshots/org/apache/openjpa/openjpa-jdbc/2.2.3-SNAPSHOT/openjpa-jdbc-2.2.3-20141015.064650-39-tests.jar
42K uploaded  (openjpa-jdbc-2.2.3-20141015.064650-39-tests.jar)
[INFO] ------------------------------------------------------------------------
[INFO] Building OpenJPA Persistence
[INFO]    task-segment: [clean, deploy]
[INFO] ------------------------------------------------------------------------
[INFO] [clean:clean {execution: default-clean}]
[INFO] Deleting file set: <https://builds.apache.org/job/OpenJPA-22x-deploy/ws/2.2.x/openjpa-persistence/target>
(included: [**], excluded: [])
[INFO] [buildnumber:create {execution: default}]
[INFO] [enforcer:enforce {execution: default}]
[INFO] [checkstyle:checkstyle {execution: default}]
[INFO] Starting audit...
Audit done.

[WARNING] Unable to locate Source XRef to link to - DISABLED
[INFO] [remote-resources:process {execution: default}]
[INFO] [resources:resources {execution: default-resources}]
[INFO] Using 'UTF-8' encoding to copy filtered resources.
[INFO] Copying 14 resources
[INFO] Copying 3 resources
[INFO] [compiler:compile {execution: default-compile}]
[INFO] Compiling 233 source files to <https://builds.apache.org/job/OpenJPA-22x-deploy/ws/2.2.x/openjpa-persistence/target/classes>
[INFO] [compiler:testCompile {execution: test-source-compile}]
[INFO] Compiling 2 source files to <https://builds.apache.org/job/OpenJPA-22x-deploy/ws/2.2.x/openjpa-persistence/target/test-classes>
[INFO] [resources:testResources {execution: default-testResources}]
[INFO] Using 'UTF-8' encoding to copy filtered resources.
[INFO] Copying 3 resources
[INFO] Copying 3 resources
[INFO] [compiler:testCompile {execution: default-testCompile}]
[INFO] Nothing to compile - all classes are up to date
[WARNING] DEPRECATED [systemProperties]: Use systemPropertyVariables instead.
[INFO] [surefire:test {execution: default-test}]
[INFO] Surefire report directory: <https://builds.apache.org/job/OpenJPA-22x-deploy/ws/2.2.x/openjpa-persistence/target/surefire-reports>

-------------------------------------------------------
 T E S T S
-------------------------------------------------------
Running org.apache.openjpa.persistence.TestEnumToKernelConstantMappings
Tests run: 7, Failures: 0, Errors: 0, Skipped: 0, Time elapsed: 0.032 sec
Running org.apache.openjpa.persistence.TestPersistenceProductDerivation
Tests run: 5, Failures: 0, Errors: 0, Skipped: 0, Time elapsed: 0.28 sec

Results :

Tests run: 12, Failures: 0, Errors: 0, Skipped: 0

[JENKINS] Recording test results
[INFO] [jar:jar {execution: default-jar}]
[INFO] Building jar: <https://builds.apache.org/job/OpenJPA-22x-deploy/ws/2.2.x/openjpa-persistence/target/openjpa-persistence-2.2.3-SNAPSHOT.jar>
[INFO] [jar:jar {execution: default-jar}]
[INFO] [jar:test-jar {execution: attach-tests}]
[INFO] Building jar: <https://builds.apache.org/job/OpenJPA-22x-deploy/ws/2.2.x/openjpa-persistence/target/openjpa-persistence-2.2.3-SNAPSHOT-tests.jar>
[INFO] [ianal:verify-legal-files {execution: default}]
[INFO] Checking legal files in: openjpa-persistence-2.2.3-SNAPSHOT.jar
[INFO] Checking legal files in: openjpa-persistence-2.2.3-SNAPSHOT-tests.jar
[INFO] [apache-rat:check {execution: default}]
[INFO] Exclude: **/.*/**
[INFO] Exclude: **/target/**/*
[INFO] [install:install {execution: default-install}]
[INFO] Installing <https://builds.apache.org/job/OpenJPA-22x-deploy/ws/2.2.x/openjpa-persistence/target/openjpa-persistence-2.2.3-SNAPSHOT.jar>
to /home/jenkins/jenkins-slave/maven-repositories/1/org/apache/openjpa/openjpa-persistence/2.2.3-SNAPSHOT/openjpa-persistence-2.2.3-SNAPSHOT.jar
[INFO] Installing <https://builds.apache.org/job/OpenJPA-22x-deploy/ws/2.2.x/openjpa-persistence/target/openjpa-persistence-2.2.3-SNAPSHOT-tests.jar>
to /home/jenkins/jenkins-slave/maven-repositories/1/org/apache/openjpa/openjpa-persistence/2.2.3-SNAPSHOT/openjpa-persistence-2.2.3-SNAPSHOT-tests.jar
[INFO] [deploy:deploy {execution: default-deploy}]
[INFO] Retrieving previous build number from apache.snapshots.https
[WARNING] *** CHECKSUM FAILED - Checksum failed on download: local = '7e71c0196ca5a82199c7bf0917a20c5cf848e196';
remote = '6d0a17002c44d22e6913676cbaabfa906cdf5b19' - RETRYING
[WARNING] *** CHECKSUM FAILED - Checksum failed on download: local = '7e71c0196ca5a82199c7bf0917a20c5cf848e196';
remote = '6d0a17002c44d22e6913676cbaabfa906cdf5b19' - IGNORING
Uploading: https://repository.apache.org/content/repositories/snapshots/org/apache/openjpa/openjpa-persistence/2.2.3-SNAPSHOT/openjpa-persistence-2.2.3-20141015.064650-39.jar
809K uploaded  (openjpa-persistence-2.2.3-20141015.064650-39.jar)
[INFO] Retrieving previous metadata from apache.snapshots.https
[WARNING] *** CHECKSUM FAILED - Checksum failed on download: local = '7e71c0196ca5a82199c7bf0917a20c5cf848e196';
remote = '6d0a17002c44d22e6913676cbaabfa906cdf5b19' - RETRYING
[WARNING] *** CHECKSUM FAILED - Checksum failed on download: local = '7e71c0196ca5a82199c7bf0917a20c5cf848e196';
remote = '6d0a17002c44d22e6913676cbaabfa906cdf5b19' - IGNORING
[INFO] Uploading repository metadata for: 'snapshot org.apache.openjpa:openjpa-persistence:2.2.3-SNAPSHOT'
[INFO] Uploading project information for openjpa-persistence 2.2.3-20141015.064650-39
[INFO] Retrieving previous metadata from apache.snapshots.https
[INFO] Uploading repository metadata for: 'artifact org.apache.openjpa:openjpa-persistence'
[INFO] Retrieving previous build number from apache.snapshots.https
Uploading: https://repository.apache.org/content/repositories/snapshots/org/apache/openjpa/openjpa-persistence/2.2.3-SNAPSHOT/openjpa-persistence-2.2.3-20141015.064650-39-tests.jar
29K uploaded  (openjpa-persistence-2.2.3-20141015.064650-39-tests.jar)
[INFO] ------------------------------------------------------------------------
[INFO] Building OpenJPA Persistence JDBC
[INFO]    task-segment: [clean, deploy]
[INFO] ------------------------------------------------------------------------
[INFO] [clean:clean {execution: default-clean}]
[INFO] Deleting file set: <https://builds.apache.org/job/OpenJPA-22x-deploy/ws/2.2.x/openjpa-persistence-jdbc/target>
(included: [**], excluded: [])
[INFO] [buildnumber:create {execution: default}]
Downloading: http://repo1.maven.org/maven2/simple-jndi/simple-jndi/0.11.4/simple-jndi-0.11.4.pom
4K downloaded  (simple-jndi-0.11.4.pom)
Downloading: http://repo1.maven.org/maven2/simple-jndi/simple-jndi/0.11.4/simple-jndi-0.11.4.jar
41K downloaded  (simple-jndi-0.11.4.jar)
[INFO] [enforcer:enforce {execution: default}]
[INFO] [checkstyle:checkstyle {execution: default}]
[INFO] Starting audit...
<https://builds.apache.org/job/OpenJPA-22x-deploy/ws/2.2.x/openjpa-persistence-jdbc/src/test/java/org/apache/openjpa/persistence/jdbc/dbcs/MyDBCSEntity.java>:32:24:
Got an exception - Unexpected character 0xa1 in identifier
Audit done.

[INFO] ------------------------------------------------------------------------
[ERROR] BUILD ERROR
[INFO] ------------------------------------------------------------------------
[INFO] An error has occurred in Checkstyle report generation.

Embedded error: Failed during checkstyle execution
There are 1 checkstyle errors.
[INFO] ------------------------------------------------------------------------
[INFO] For more information, run Maven with the -e switch
[INFO] ------------------------------------------------------------------------
[INFO] Total time: 2 minutes 
[INFO] Finished at: Wed Oct 15 06:48:28 UTC 2014
[INFO] Final Memory: 100M/534M
[INFO] ------------------------------------------------------------------------
[JENKINS] Archiving <https://builds.apache.org/job/OpenJPA-22x-deploy/ws/2.2.x/openjpa-lib/pom.xml>
to org.apache.openjpa/openjpa-lib/2.2.3-SNAPSHOT/openjpa-lib-2.2.3-SNAPSHOT.pom
[JENKINS] Archiving <https://builds.apache.org/job/OpenJPA-22x-deploy/ws/2.2.x/openjpa-lib/target/openjpa-lib-2.2.3-SNAPSHOT.jar>
to org.apache.openjpa/openjpa-lib/2.2.3-20141015.064650-40/openjpa-lib-2.2.3-20141015.064650-40.jar
[JENKINS] Archiving <https://builds.apache.org/job/OpenJPA-22x-deploy/ws/2.2.x/openjpa-lib/target/openjpa-lib-2.2.3-SNAPSHOT-tests.jar>
to org.apache.openjpa/openjpa-lib/2.2.3-20141015.064650-40/openjpa-lib-2.2.3-20141015.064650-40-tests.jar
Sending artifact delta relative to OpenJPA-22x-deploy » OpenJPA Utilities Library #60
Archived 3 artifacts
Archive block size is 32768
Received 0 blocks and 589114 bytes
Compression is 0.0%
Took 2.6 sec
[JENKINS] Archiving <https://builds.apache.org/job/OpenJPA-22x-deploy/ws/2.2.x/openjpa-kernel/pom.xml>
to org.apache.openjpa/openjpa-kernel/2.2.3-SNAPSHOT/openjpa-kernel-2.2.3-SNAPSHOT.pom
[JENKINS] Archiving <https://builds.apache.org/job/OpenJPA-22x-deploy/ws/2.2.x/openjpa-kernel/target/openjpa-kernel-2.2.3-SNAPSHOT.jar>
to org.apache.openjpa/openjpa-kernel/2.2.3-20141015.064650-40/openjpa-kernel-2.2.3-20141015.064650-40.jar
[JENKINS] Archiving <https://builds.apache.org/job/OpenJPA-22x-deploy/ws/2.2.x/openjpa-kernel/target/openjpa-kernel-2.2.3-SNAPSHOT-tests.jar>
to org.apache.openjpa/openjpa-kernel/2.2.3-20141015.064650-40/openjpa-kernel-2.2.3-20141015.064650-40-tests.jar
Sending artifact delta relative to OpenJPA-22x-deploy » OpenJPA Kernel #60
Archived 3 artifacts
Archive block size is 32768
Received 1 blocks and 1481649 bytes
Compression is 2.2%
Took 0.63 sec
[JENKINS] Archiving <https://builds.apache.org/job/OpenJPA-22x-deploy/ws/2.2.x/openjpa-persistence-jdbc/pom.xml>
to org.apache.openjpa/openjpa-persistence-jdbc/2.2.3-SNAPSHOT/openjpa-persistence-jdbc-2.2.3-SNAPSHOT.pom
Sending artifact delta relative to OpenJPA-22x-deploy » OpenJPA Persistence JDBC #60
Archived 1 artifacts
Archive block size is 32768
Received 1 blocks and 25225 bytes
Compression is 56.5%
Took 2.6 sec
[JENKINS] Archiving <https://builds.apache.org/job/OpenJPA-22x-deploy/ws/2.2.x/pom.xml>
to org.apache.openjpa/openjpa-parent/2.2.3-SNAPSHOT/openjpa-parent-2.2.3-SNAPSHOT.pom
[JENKINS] Archiving /home/jenkins/jenkins-slave/maven-repositories/1/org/apache/openjpa/openjpa-parent/2.2.3-SNAPSHOT/openjpa-parent-2.2.3-SNAPSHOT.pom
to org.apache.openjpa/openjpa-parent/2.2.3-20141015.064650-40/openjpa-parent-2.2.3-20141015.064650-40.pom
/home/jenkins/jenkins-slave/maven-repositories/1/org/apache/openjpa/openjpa-parent/2.2.3-SNAPSHOT/openjpa-parent-2.2.3-SNAPSHOT.pom
is not inside <https://builds.apache.org/job/OpenJPA-22x-deploy/ws/2.2.x/;> will archive
in a separate pass
Sending artifact delta relative to OpenJPA-22x-deploy » OpenJPA Parent POM #60
Archived 1 artifacts
Archive block size is 32768
Received 1 blocks and 21272 bytes
Compression is 60.6%
Took 76 ms
Sending artifact delta relative to OpenJPA-22x-deploy » OpenJPA Parent POM #60
Archived 1 artifacts
Archive block size is 32768
Received 1 blocks and 21292 bytes
Compression is 60.6%
Took 58 ms
[JENKINS] Archiving <https://builds.apache.org/job/OpenJPA-22x-deploy/ws/2.2.x/openjpa-persistence/pom.xml>
to org.apache.openjpa/openjpa-persistence/2.2.3-SNAPSHOT/openjpa-persistence-2.2.3-SNAPSHOT.pom
[JENKINS] Archiving <https://builds.apache.org/job/OpenJPA-22x-deploy/ws/2.2.x/openjpa-persistence/target/openjpa-persistence-2.2.3-SNAPSHOT.jar>
to org.apache.openjpa/openjpa-persistence/2.2.3-20141015.064650-39/openjpa-persistence-2.2.3-20141015.064650-39.jar
[JENKINS] Archiving <https://builds.apache.org/job/OpenJPA-22x-deploy/ws/2.2.x/openjpa-persistence/target/openjpa-persistence-2.2.3-SNAPSHOT-tests.jar>
to org.apache.openjpa/openjpa-persistence/2.2.3-20141015.064650-39/openjpa-persistence-2.2.3-20141015.064650-39-tests.jar
Sending artifact delta relative to OpenJPA-22x-deploy » OpenJPA Persistence #60
Archived 3 artifacts
Archive block size is 32768
Received 0 blocks and 861663 bytes
Compression is 0.0%
Took 0.76 sec
[JENKINS] Archiving <https://builds.apache.org/job/OpenJPA-22x-deploy/ws/2.2.x/openjpa-jdbc/pom.xml>
to org.apache.openjpa/openjpa-jdbc/2.2.3-SNAPSHOT/openjpa-jdbc-2.2.3-SNAPSHOT.pom
[JENKINS] Archiving <https://builds.apache.org/job/OpenJPA-22x-deploy/ws/2.2.x/openjpa-jdbc/target/openjpa-jdbc-2.2.3-SNAPSHOT.jar>
to org.apache.openjpa/openjpa-jdbc/2.2.3-20141015.064650-39/openjpa-jdbc-2.2.3-20141015.064650-39.jar
[JENKINS] Archiving <https://builds.apache.org/job/OpenJPA-22x-deploy/ws/2.2.x/openjpa-jdbc/target/openjpa-jdbc-2.2.3-SNAPSHOT-tests.jar>
to org.apache.openjpa/openjpa-jdbc/2.2.3-20141015.064650-39/openjpa-jdbc-2.2.3-20141015.064650-39-tests.jar
Sending artifact delta relative to OpenJPA-22x-deploy » OpenJPA JDBC #60
Archived 3 artifacts
Archive block size is 32768
Received 0 blocks and 1476772 bytes
Compression is 0.0%
Took 2.7 sec
Sending e-mails to: commits@openjpa.apache.org
channel stopped

Mime
View raw message