openjpa-commits mailing list archives

Site index · List index
Message view « Date » · « Thread »
Top « Date » · « Thread »
From Apache Jenkins Server <jenk...@builds.apache.org>
Subject Build failed in Jenkins: OpenJPA-21x-deploy #156
Date Thu, 15 Jan 2015 07:33:50 GMT
See <https://builds.apache.org/job/OpenJPA-21x-deploy/156/changes>

Changes:

[hthomann] OPENJPA-2547: When two threads attempt to get a Pessimistic Lock, one thread gets
a 'false' lock.  Applied fix to 2.1.x.

------------------------------------------
[...truncated 17010 lines...]
[WARNING] We have a duplicate org/apache/bval/jsr303/resolver/CachingRelevant.class in /home/jenkins/jenkins-slave/maven-repositories/1/org/apache/bval/bval-jsr303/0.2-incubating/bval-jsr303-0.2-incubating.jar
[WARNING] We have a duplicate org/apache/bval/jsr303/resolver/DefaultTraversableResolver.class
in /home/jenkins/jenkins-slave/maven-repositories/1/org/apache/bval/bval-jsr303/0.2-incubating/bval-jsr303-0.2-incubating.jar
[WARNING] We have a duplicate org/apache/bval/jsr303/resolver/CachingTraversableResolver$CacheEntry.class
in /home/jenkins/jenkins-slave/maven-repositories/1/org/apache/bval/bval-jsr303/0.2-incubating/bval-jsr303-0.2-incubating.jar
[WARNING] We have a duplicate org/apache/bval/jsr303/resolver/CachingTraversableResolver$1.class
in /home/jenkins/jenkins-slave/maven-repositories/1/org/apache/bval/bval-jsr303/0.2-incubating/bval-jsr303-0.2-incubating.jar
[WARNING] We have a duplicate org/apache/bval/jsr303/resolver/CachingTraversableResolver.class
in /home/jenkins/jenkins-slave/maven-repositories/1/org/apache/bval/bval-jsr303/0.2-incubating/bval-jsr303-0.2-incubating.jar
[WARNING] We have a duplicate org/apache/bval/jsr303/resolver/SimpleTraversableResolver.class
in /home/jenkins/jenkins-slave/maven-repositories/1/org/apache/bval/bval-jsr303/0.2-incubating/bval-jsr303-0.2-incubating.jar
[WARNING] We have a duplicate org/apache/bval/jsr303/ElementDescriptorImpl.class in /home/jenkins/jenkins-slave/maven-repositories/1/org/apache/bval/bval-jsr303/0.2-incubating/bval-jsr303-0.2-incubating.jar
[WARNING] We have a duplicate org/apache/bval/jsr303/extensions/ConstructorDescriptor.class
in /home/jenkins/jenkins-slave/maven-repositories/1/org/apache/bval/bval-jsr303/0.2-incubating/bval-jsr303-0.2-incubating.jar
[WARNING] We have a duplicate org/apache/bval/jsr303/extensions/ProcedureDescriptor.class
in /home/jenkins/jenkins-slave/maven-repositories/1/org/apache/bval/bval-jsr303/0.2-incubating/bval-jsr303-0.2-incubating.jar
[WARNING] We have a duplicate org/apache/bval/jsr303/extensions/ParameterDescriptor.class
in /home/jenkins/jenkins-slave/maven-repositories/1/org/apache/bval/bval-jsr303/0.2-incubating/bval-jsr303-0.2-incubating.jar
[WARNING] We have a duplicate org/apache/bval/jsr303/extensions/MethodBeanDescriptor.class
in /home/jenkins/jenkins-slave/maven-repositories/1/org/apache/bval/bval-jsr303/0.2-incubating/bval-jsr303-0.2-incubating.jar
[WARNING] We have a duplicate org/apache/bval/jsr303/extensions/MethodDescriptor.class in
/home/jenkins/jenkins-slave/maven-repositories/1/org/apache/bval/bval-jsr303/0.2-incubating/bval-jsr303-0.2-incubating.jar
[WARNING] We have a duplicate org/apache/bval/jsr303/extensions/ParameterDescriptorImpl.class
in /home/jenkins/jenkins-slave/maven-repositories/1/org/apache/bval/bval-jsr303/0.2-incubating/bval-jsr303-0.2-incubating.jar
[WARNING] We have a duplicate org/apache/bval/jsr303/extensions/MethodValidator.class in /home/jenkins/jenkins-slave/maven-repositories/1/org/apache/bval/bval-jsr303/0.2-incubating/bval-jsr303-0.2-incubating.jar
[WARNING] We have a duplicate org/apache/bval/jsr303/extensions/MethodDescriptorImpl.class
in /home/jenkins/jenkins-slave/maven-repositories/1/org/apache/bval/bval-jsr303/0.2-incubating/bval-jsr303-0.2-incubating.jar
[WARNING] We have a duplicate org/apache/bval/jsr303/extensions/ReturnAccess.class in /home/jenkins/jenkins-slave/maven-repositories/1/org/apache/bval/bval-jsr303/0.2-incubating/bval-jsr303-0.2-incubating.jar
[WARNING] We have a duplicate org/apache/bval/jsr303/extensions/ParameterAccess.class in /home/jenkins/jenkins-slave/maven-repositories/1/org/apache/bval/bval-jsr303/0.2-incubating/bval-jsr303-0.2-incubating.jar
[WARNING] We have a duplicate org/apache/bval/jsr303/extensions/ConstructorDescriptorImpl.class
in /home/jenkins/jenkins-slave/maven-repositories/1/org/apache/bval/bval-jsr303/0.2-incubating/bval-jsr303-0.2-incubating.jar
[WARNING] We have a duplicate org/apache/bval/jsr303/extensions/AppendValidationToList.class
in /home/jenkins/jenkins-slave/maven-repositories/1/org/apache/bval/bval-jsr303/0.2-incubating/bval-jsr303-0.2-incubating.jar
[WARNING] We have a duplicate org/apache/bval/jsr303/extensions/MethodValidatorMetaBeanFactory.class
in /home/jenkins/jenkins-slave/maven-repositories/1/org/apache/bval/bval-jsr303/0.2-incubating/bval-jsr303-0.2-incubating.jar
[WARNING] We have a duplicate org/apache/bval/jsr303/extensions/MethodBeanDescriptorImpl.class
in /home/jenkins/jenkins-slave/maven-repositories/1/org/apache/bval/bval-jsr303/0.2-incubating/bval-jsr303-0.2-incubating.jar
[WARNING] We have a duplicate org/apache/bval/jsr303/extensions/MethodValidatorImpl.class
in /home/jenkins/jenkins-slave/maven-repositories/1/org/apache/bval/bval-jsr303/0.2-incubating/bval-jsr303-0.2-incubating.jar
[WARNING] We have a duplicate org/apache/bval/jsr303/ConstraintViolationImpl.class in /home/jenkins/jenkins-slave/maven-repositories/1/org/apache/bval/bval-jsr303/0.2-incubating/bval-jsr303-0.2-incubating.jar
[WARNING] We have a duplicate org/apache/bval/jsr303/ConstraintValidatorContextImpl$ConstraintViolationBuilderImpl.class
in /home/jenkins/jenkins-slave/maven-repositories/1/org/apache/bval/bval-jsr303/0.2-incubating/bval-jsr303-0.2-incubating.jar
[WARNING] We have a duplicate org/apache/bval/jsr303/ConstraintValidatorContextImpl.class
in /home/jenkins/jenkins-slave/maven-repositories/1/org/apache/bval/bval-jsr303/0.2-incubating/bval-jsr303-0.2-incubating.jar
[WARNING] We have a duplicate org/apache/bval/jsr303/ConstraintValidation.class in /home/jenkins/jenkins-slave/maven-repositories/1/org/apache/bval/bval-jsr303/0.2-incubating/bval-jsr303-0.2-incubating.jar
[WARNING] We have a duplicate org/apache/bval/jsr303/GroupValidationContext.class in /home/jenkins/jenkins-slave/maven-repositories/1/org/apache/bval/bval-jsr303/0.2-incubating/bval-jsr303-0.2-incubating.jar
[WARNING] We have a duplicate org/apache/bval/jsr303/ConstraintValidationListener.class in
/home/jenkins/jenkins-slave/maven-repositories/1/org/apache/bval/bval-jsr303/0.2-incubating/bval-jsr303-0.2-incubating.jar
[WARNING] We have a duplicate org/apache/bval/jsr303/groups/Groups.class in /home/jenkins/jenkins-slave/maven-repositories/1/org/apache/bval/bval-jsr303/0.2-incubating/bval-jsr303-0.2-incubating.jar
[WARNING] We have a duplicate org/apache/bval/jsr303/groups/Group.class in /home/jenkins/jenkins-slave/maven-repositories/1/org/apache/bval/bval-jsr303/0.2-incubating/bval-jsr303-0.2-incubating.jar
[WARNING] We have a duplicate org/apache/bval/jsr303/groups/GroupsComputer.class in /home/jenkins/jenkins-slave/maven-repositories/1/org/apache/bval/bval-jsr303/0.2-incubating/bval-jsr303-0.2-incubating.jar
[WARNING] We have a duplicate org/apache/bval/jsr303/DefaultMessageInterpolator.class in /home/jenkins/jenkins-slave/maven-repositories/1/org/apache/bval/bval-jsr303/0.2-incubating/bval-jsr303-0.2-incubating.jar
[WARNING] We have a duplicate org/apache/bval/jsr303/ConstraintDefaults$1.class in /home/jenkins/jenkins-slave/maven-repositories/1/org/apache/bval/bval-jsr303/0.2-incubating/bval-jsr303-0.2-incubating.jar
[WARNING] We have a duplicate org/apache/bval/jsr303/ConstraintDefaults.class in /home/jenkins/jenkins-slave/maven-repositories/1/org/apache/bval/bval-jsr303/0.2-incubating/bval-jsr303-0.2-incubating.jar
[WARNING] We have a duplicate org/apache/bval/jsr303/BaseAppendValidation.class in /home/jenkins/jenkins-slave/maven-repositories/1/org/apache/bval/bval-jsr303/0.2-incubating/bval-jsr303-0.2-incubating.jar
[WARNING] We have a duplicate org/apache/bval/jsr303/AppendValidation.class in /home/jenkins/jenkins-slave/maven-repositories/1/org/apache/bval/bval-jsr303/0.2-incubating/bval-jsr303-0.2-incubating.jar
[WARNING] We have a duplicate org/apache/bval/jsr303/DefaultValidationProviderResolver.class
in /home/jenkins/jenkins-slave/maven-repositories/1/org/apache/bval/bval-jsr303/0.2-incubating/bval-jsr303-0.2-incubating.jar
[WARNING] We have a duplicate org/apache/bval/jsr303/Jsr303MetaBeanFactory.class in /home/jenkins/jenkins-slave/maven-repositories/1/org/apache/bval/bval-jsr303/0.2-incubating/bval-jsr303-0.2-incubating.jar
[WARNING] We have a duplicate org/apache/bval/jsr303/ApacheFactoryContext$XMLMetaBeanManagerCreator.class
in /home/jenkins/jenkins-slave/maven-repositories/1/org/apache/bval/bval-jsr303/0.2-incubating/bval-jsr303-0.2-incubating.jar
[WARNING] We have a duplicate org/apache/bval/jsr303/ApacheFactoryContext.class in /home/jenkins/jenkins-slave/maven-repositories/1/org/apache/bval/bval-jsr303/0.2-incubating/bval-jsr303-0.2-incubating.jar
[WARNING] We have a duplicate org/apache/bval/jsr303/BeanDescriptorImpl.class in /home/jenkins/jenkins-slave/maven-repositories/1/org/apache/bval/bval-jsr303/0.2-incubating/bval-jsr303-0.2-incubating.jar
[WARNING] We have a duplicate org/apache/bval/jsr303/ApacheValidatorFactory.class in /home/jenkins/jenkins-slave/maven-repositories/1/org/apache/bval/bval-jsr303/0.2-incubating/bval-jsr303-0.2-incubating.jar
[WARNING] We have a duplicate org/apache/bval/jsr303/ConstraintCached.class in /home/jenkins/jenkins-slave/maven-repositories/1/org/apache/bval/bval-jsr303/0.2-incubating/bval-jsr303-0.2-incubating.jar
[WARNING] We have a duplicate org/apache/bval/jsr303/GroupValidationContextImpl.class in /home/jenkins/jenkins-slave/maven-repositories/1/org/apache/bval/bval-jsr303/0.2-incubating/bval-jsr303-0.2-incubating.jar
[WARNING] We have a duplicate org/apache/bval/jsr303/DefaultConstraintValidatorFactory.class
in /home/jenkins/jenkins-slave/maven-repositories/1/org/apache/bval/bval-jsr303/0.2-incubating/bval-jsr303-0.2-incubating.jar
[WARNING] We have a duplicate org/apache/bval/jsr303/ConstraintDescriptorImpl.class in /home/jenkins/jenkins-slave/maven-repositories/1/org/apache/bval/bval-jsr303/0.2-incubating/bval-jsr303-0.2-incubating.jar
[WARNING] We have a duplicate org/apache/bval/jsr303/Jsr303Features$Property.class in /home/jenkins/jenkins-slave/maven-repositories/1/org/apache/bval/bval-jsr303/0.2-incubating/bval-jsr303-0.2-incubating.jar
[WARNING] We have a duplicate org/apache/bval/jsr303/Jsr303Features$Bean.class in /home/jenkins/jenkins-slave/maven-repositories/1/org/apache/bval/bval-jsr303/0.2-incubating/bval-jsr303-0.2-incubating.jar
[WARNING] We have a duplicate org/apache/bval/jsr303/Jsr303Features.class in /home/jenkins/jenkins-slave/maven-repositories/1/org/apache/bval/bval-jsr303/0.2-incubating/bval-jsr303-0.2-incubating.jar
[WARNING] We have a duplicate org/apache/bval/jsr303/ConfigurationImpl.class in /home/jenkins/jenkins-slave/maven-repositories/1/org/apache/bval/bval-jsr303/0.2-incubating/bval-jsr303-0.2-incubating.jar
[WARNING] We have a duplicate org/apache/bval/jsr303/ApacheValidatorConfiguration$Properties.class
in /home/jenkins/jenkins-slave/maven-repositories/1/org/apache/bval/bval-jsr303/0.2-incubating/bval-jsr303-0.2-incubating.jar
[WARNING] We have a duplicate org/apache/bval/jsr303/ApacheValidatorConfiguration.class in
/home/jenkins/jenkins-slave/maven-repositories/1/org/apache/bval/bval-jsr303/0.2-incubating/bval-jsr303-0.2-incubating.jar
[WARNING] We have a duplicate org/apache/bval/jsr303/NestedMetaProperty.class in /home/jenkins/jenkins-slave/maven-repositories/1/org/apache/bval/bval-jsr303/0.2-incubating/bval-jsr303-0.2-incubating.jar
[WARNING] We have a duplicate org/apache/bval/jsr303/UnknownPropertyException.class in /home/jenkins/jenkins-slave/maven-repositories/1/org/apache/bval/bval-jsr303/0.2-incubating/bval-jsr303-0.2-incubating.jar
[WARNING] We have a duplicate org/apache/bval/jsr303/ClassValidator$Jsr303ValidationCallback.class
in /home/jenkins/jenkins-slave/maven-repositories/1/org/apache/bval/bval-jsr303/0.2-incubating/bval-jsr303-0.2-incubating.jar
[WARNING] We have a duplicate org/apache/bval/jsr303/ClassValidator.class in /home/jenkins/jenkins-slave/maven-repositories/1/org/apache/bval/bval-jsr303/0.2-incubating/bval-jsr303-0.2-incubating.jar
[WARNING] We have a duplicate org/apache/bval/jsr303/AnnotationConstraintBuilder$1.class in
/home/jenkins/jenkins-slave/maven-repositories/1/org/apache/bval/bval-jsr303/0.2-incubating/bval-jsr303-0.2-incubating.jar
[WARNING] We have a duplicate org/apache/bval/jsr303/AnnotationConstraintBuilder$ConstraintOverrides.class
in /home/jenkins/jenkins-slave/maven-repositories/1/org/apache/bval/bval-jsr303/0.2-incubating/bval-jsr303-0.2-incubating.jar
[WARNING] We have a duplicate org/apache/bval/jsr303/AnnotationConstraintBuilder.class in
/home/jenkins/jenkins-slave/maven-repositories/1/org/apache/bval/bval-jsr303/0.2-incubating/bval-jsr303-0.2-incubating.jar
[WARNING] We have a duplicate org/apache/bval/jsr303/AppendValidationToBuilder.class in /home/jenkins/jenkins-slave/maven-repositories/1/org/apache/bval/bval-jsr303/0.2-incubating/bval-jsr303-0.2-incubating.jar
[WARNING] We have a duplicate org/apache/bval/jsr303/ConstraintFinderImpl$1.class in /home/jenkins/jenkins-slave/maven-repositories/1/org/apache/bval/bval-jsr303/0.2-incubating/bval-jsr303-0.2-incubating.jar
[WARNING] We have a duplicate org/apache/bval/jsr303/ConstraintFinderImpl.class in /home/jenkins/jenkins-slave/maven-repositories/1/org/apache/bval/bval-jsr303/0.2-incubating/bval-jsr303-0.2-incubating.jar
[WARNING] We have a duplicate org/apache/bval/jsr303/PropertyDescriptorImpl.class in /home/jenkins/jenkins-slave/maven-repositories/1/org/apache/bval/bval-jsr303/0.2-incubating/bval-jsr303-0.2-incubating.jar
[WARNING] We have a duplicate org/apache/bval/jsr303/AppendValidationToMeta.class in /home/jenkins/jenkins-slave/maven-repositories/1/org/apache/bval/bval-jsr303/0.2-incubating/bval-jsr303-0.2-incubating.jar
[WARNING] We have a duplicate org/apache/bval/jsr303/ApacheValidationProvider.class in /home/jenkins/jenkins-slave/maven-repositories/1/org/apache/bval/bval-jsr303/0.2-incubating/bval-jsr303-0.2-incubating.jar
[WARNING] We have a duplicate org/apache/bval/jsr303/GraphBeanIdentity.class in /home/jenkins/jenkins-slave/maven-repositories/1/org/apache/bval/bval-jsr303/0.2-incubating/bval-jsr303-0.2-incubating.jar
[WARNING] We have a duplicate org/apache/bval/constraints/SizeValidator.class in /home/jenkins/jenkins-slave/maven-repositories/1/org/apache/bval/bval-jsr303/0.2-incubating/bval-jsr303-0.2-incubating.jar
[WARNING] We have a duplicate org/apache/bval/constraints/SizeValidatorForArrayOfBoolean.class
in /home/jenkins/jenkins-slave/maven-repositories/1/org/apache/bval/bval-jsr303/0.2-incubating/bval-jsr303-0.2-incubating.jar
[WARNING] We have a duplicate org/apache/bval/constraints/SizeValidatorForArrayOfShort.class
in /home/jenkins/jenkins-slave/maven-repositories/1/org/apache/bval/bval-jsr303/0.2-incubating/bval-jsr303-0.2-incubating.jar
[WARNING] We have a duplicate org/apache/bval/constraints/MaxValidatorForNumber.class in /home/jenkins/jenkins-slave/maven-repositories/1/org/apache/bval/bval-jsr303/0.2-incubating/bval-jsr303-0.2-incubating.jar
[WARNING] We have a duplicate org/apache/bval/constraints/DecimalMaxValidatorForNumber.class
in /home/jenkins/jenkins-slave/maven-repositories/1/org/apache/bval/bval-jsr303/0.2-incubating/bval-jsr303-0.2-incubating.jar
[WARNING] We have a duplicate org/apache/bval/constraints/DecimalMinValidatorForString.class
in /home/jenkins/jenkins-slave/maven-repositories/1/org/apache/bval/bval-jsr303/0.2-incubating/bval-jsr303-0.2-incubating.jar
[WARNING] We have a duplicate org/apache/bval/constraints/SizeValidatorForArrayOfObject.class
in /home/jenkins/jenkins-slave/maven-repositories/1/org/apache/bval/bval-jsr303/0.2-incubating/bval-jsr303-0.2-incubating.jar
[WARNING] We have a duplicate org/apache/bval/constraints/MaxValidatorForString.class in /home/jenkins/jenkins-slave/maven-repositories/1/org/apache/bval/bval-jsr303/0.2-incubating/bval-jsr303-0.2-incubating.jar
[WARNING] We have a duplicate org/apache/bval/constraints/SizeValidatorForArrayOfByte.class
in /home/jenkins/jenkins-slave/maven-repositories/1/org/apache/bval/bval-jsr303/0.2-incubating/bval-jsr303-0.2-incubating.jar
[WARNING] We have a duplicate org/apache/bval/constraints/NotNullValidator.class in /home/jenkins/jenkins-slave/maven-repositories/1/org/apache/bval/bval-jsr303/0.2-incubating/bval-jsr303-0.2-incubating.jar
[WARNING] We have a duplicate org/apache/bval/constraints/SizeValidatorForMap.class in /home/jenkins/jenkins-slave/maven-repositories/1/org/apache/bval/bval-jsr303/0.2-incubating/bval-jsr303-0.2-incubating.jar
[WARNING] We have a duplicate org/apache/bval/constraints/DigitsValidatorForString.class in
/home/jenkins/jenkins-slave/maven-repositories/1/org/apache/bval/bval-jsr303/0.2-incubating/bval-jsr303-0.2-incubating.jar
[WARNING] We have a duplicate org/apache/bval/constraints/MinValidatorForString.class in /home/jenkins/jenkins-slave/maven-repositories/1/org/apache/bval/bval-jsr303/0.2-incubating/bval-jsr303-0.2-incubating.jar
[WARNING] We have a duplicate org/apache/bval/constraints/NotEmptyValidatorForCollection.class
in /home/jenkins/jenkins-slave/maven-repositories/1/org/apache/bval/bval-jsr303/0.2-incubating/bval-jsr303-0.2-incubating.jar
[WARNING] We have a duplicate org/apache/bval/constraints/NotEmpty.class in /home/jenkins/jenkins-slave/maven-repositories/1/org/apache/bval/bval-jsr303/0.2-incubating/bval-jsr303-0.2-incubating.jar
[WARNING] We have a duplicate org/apache/bval/constraints/DecimalMinValidatorForNumber.class
in /home/jenkins/jenkins-slave/maven-repositories/1/org/apache/bval/bval-jsr303/0.2-incubating/bval-jsr303-0.2-incubating.jar
[WARNING] We have a duplicate org/apache/bval/constraints/FutureValidatorForDate.class in
/home/jenkins/jenkins-slave/maven-repositories/1/org/apache/bval/bval-jsr303/0.2-incubating/bval-jsr303-0.2-incubating.jar
[WARNING] We have a duplicate org/apache/bval/constraints/SizeValidatorForArrayOfFloat.class
in /home/jenkins/jenkins-slave/maven-repositories/1/org/apache/bval/bval-jsr303/0.2-incubating/bval-jsr303-0.2-incubating.jar
[WARNING] We have a duplicate org/apache/bval/constraints/EmailValidator.class in /home/jenkins/jenkins-slave/maven-repositories/1/org/apache/bval/bval-jsr303/0.2-incubating/bval-jsr303-0.2-incubating.jar
[WARNING] We have a duplicate org/apache/bval/constraints/Email.class in /home/jenkins/jenkins-slave/maven-repositories/1/org/apache/bval/bval-jsr303/0.2-incubating/bval-jsr303-0.2-incubating.jar
[WARNING] We have a duplicate org/apache/bval/constraints/NotEmptyValidatorForString.class
in /home/jenkins/jenkins-slave/maven-repositories/1/org/apache/bval/bval-jsr303/0.2-incubating/bval-jsr303-0.2-incubating.jar
[WARNING] We have a duplicate org/apache/bval/constraints/AssertFalseValidator.class in /home/jenkins/jenkins-slave/maven-repositories/1/org/apache/bval/bval-jsr303/0.2-incubating/bval-jsr303-0.2-incubating.jar
[WARNING] We have a duplicate org/apache/bval/constraints/PastValidatorForDate.class in /home/jenkins/jenkins-slave/maven-repositories/1/org/apache/bval/bval-jsr303/0.2-incubating/bval-jsr303-0.2-incubating.jar
[WARNING] We have a duplicate org/apache/bval/constraints/DecimalMaxValidatorForString.class
in /home/jenkins/jenkins-slave/maven-repositories/1/org/apache/bval/bval-jsr303/0.2-incubating/bval-jsr303-0.2-incubating.jar
[WARNING] We have a duplicate org/apache/bval/constraints/NotEmptyValidatorForMap.class in
/home/jenkins/jenkins-slave/maven-repositories/1/org/apache/bval/bval-jsr303/0.2-incubating/bval-jsr303-0.2-incubating.jar
[WARNING] We have a duplicate org/apache/bval/constraints/FutureValidatorForCalendar.class
in /home/jenkins/jenkins-slave/maven-repositories/1/org/apache/bval/bval-jsr303/0.2-incubating/bval-jsr303-0.2-incubating.jar
[WARNING] We have a duplicate org/apache/bval/constraints/NullValidator.class in /home/jenkins/jenkins-slave/maven-repositories/1/org/apache/bval/bval-jsr303/0.2-incubating/bval-jsr303-0.2-incubating.jar
[WARNING] We have a duplicate org/apache/bval/constraints/SizeValidatorForCollection.class
in /home/jenkins/jenkins-slave/maven-repositories/1/org/apache/bval/bval-jsr303/0.2-incubating/bval-jsr303-0.2-incubating.jar
[WARNING] We have a duplicate org/apache/bval/constraints/SizeValidatorForArrayOfLong.class
in /home/jenkins/jenkins-slave/maven-repositories/1/org/apache/bval/bval-jsr303/0.2-incubating/bval-jsr303-0.2-incubating.jar
[WARNING] We have a duplicate org/apache/bval/constraints/MinValidatorForNumber.class in /home/jenkins/jenkins-slave/maven-repositories/1/org/apache/bval/bval-jsr303/0.2-incubating/bval-jsr303-0.2-incubating.jar
[WARNING] We have a duplicate org/apache/bval/constraints/AssertTrueValidator.class in /home/jenkins/jenkins-slave/maven-repositories/1/org/apache/bval/bval-jsr303/0.2-incubating/bval-jsr303-0.2-incubating.jar
[WARNING] We have a duplicate org/apache/bval/constraints/PatternValidator.class in /home/jenkins/jenkins-slave/maven-repositories/1/org/apache/bval/bval-jsr303/0.2-incubating/bval-jsr303-0.2-incubating.jar
[WARNING] We have a duplicate org/apache/bval/constraints/DigitsValidatorForNumber.class in
/home/jenkins/jenkins-slave/maven-repositories/1/org/apache/bval/bval-jsr303/0.2-incubating/bval-jsr303-0.2-incubating.jar
[WARNING] We have a duplicate org/apache/bval/constraints/SizeValidatorForArrayOfDouble.class
in /home/jenkins/jenkins-slave/maven-repositories/1/org/apache/bval/bval-jsr303/0.2-incubating/bval-jsr303-0.2-incubating.jar
[WARNING] We have a duplicate org/apache/bval/constraints/SizeValidatorForString.class in
/home/jenkins/jenkins-slave/maven-repositories/1/org/apache/bval/bval-jsr303/0.2-incubating/bval-jsr303-0.2-incubating.jar
[WARNING] We have a duplicate org/apache/bval/constraints/SizeValidatorForArrayOfChar.class
in /home/jenkins/jenkins-slave/maven-repositories/1/org/apache/bval/bval-jsr303/0.2-incubating/bval-jsr303-0.2-incubating.jar
[WARNING] We have a duplicate org/apache/bval/constraints/NotEmptyValidator.class in /home/jenkins/jenkins-slave/maven-repositories/1/org/apache/bval/bval-jsr303/0.2-incubating/bval-jsr303-0.2-incubating.jar
[WARNING] We have a duplicate org/apache/bval/constraints/PastValidatorForCalendar.class in
/home/jenkins/jenkins-slave/maven-repositories/1/org/apache/bval/bval-jsr303/0.2-incubating/bval-jsr303-0.2-incubating.jar
[WARNING] We have a duplicate org/apache/bval/constraints/SizeValidatorForArrayOfInt.class
in /home/jenkins/jenkins-slave/maven-repositories/1/org/apache/bval/bval-jsr303/0.2-incubating/bval-jsr303-0.2-incubating.jar
[INFO] Replacing original artifact with shaded artifact.
[INFO] Replacing <https://builds.apache.org/job/OpenJPA-21x-deploy/ws/2.1.x/openjpa-all/target/openjpa-all-2.1.2-SNAPSHOT.jar>
with <https://builds.apache.org/job/OpenJPA-21x-deploy/ws/2.1.x/openjpa-all/target/openjpa-all-2.1.2-SNAPSHOT-shaded.jar>
[INFO] [ianal:verify-legal-files {execution: default}]
[INFO] Checking legal files in: openjpa-all-2.1.2-SNAPSHOT.jar
[INFO] Checking legal files in: openjpa-all-2.1.2-SNAPSHOT-tests.jar
[INFO] [apache-rat:check {execution: default}]
[INFO] Exclude: **/.*/**
[INFO] Exclude: **/target/**/*
[INFO] [install:install {execution: default-install}]
[INFO] Installing <https://builds.apache.org/job/OpenJPA-21x-deploy/ws/2.1.x/openjpa-all/target/openjpa-all-2.1.2-SNAPSHOT.jar>
to /home/jenkins/jenkins-slave/maven-repositories/1/org/apache/openjpa/openjpa-all/2.1.2-SNAPSHOT/openjpa-all-2.1.2-SNAPSHOT.jar
[INFO] Installing <https://builds.apache.org/job/OpenJPA-21x-deploy/ws/2.1.x/openjpa-all/target/openjpa-all-2.1.2-SNAPSHOT-tests.jar>
to /home/jenkins/jenkins-slave/maven-repositories/1/org/apache/openjpa/openjpa-all/2.1.2-SNAPSHOT/openjpa-all-2.1.2-SNAPSHOT-tests.jar
[INFO] [deploy:deploy {execution: default-deploy}]
[INFO] Retrieving previous build number from apache.snapshots.https
[WARNING] *** CHECKSUM FAILED - Checksum failed on download: local = 'c8f2975501894b30b8311cfc201bc1231e78635e';
remote = 'd86d6a3f67a1ce960f240622b9a9d6065f4af99d' - RETRYING
[WARNING] *** CHECKSUM FAILED - Checksum failed on download: local = 'c8f2975501894b30b8311cfc201bc1231e78635e';
remote = 'd86d6a3f67a1ce960f240622b9a9d6065f4af99d' - IGNORING
Uploading: https://repository.apache.org/content/repositories/snapshots/org/apache/openjpa/openjpa-all/2.1.2-SNAPSHOT/openjpa-all-2.1.2-20150115.064609-81.jar
6231K uploaded  (openjpa-all-2.1.2-20150115.064609-81.jar)
[INFO] Retrieving previous metadata from apache.snapshots.https
[WARNING] *** CHECKSUM FAILED - Checksum failed on download: local = '6e8de0e4ea02914d960d75d2920f8a977cb536b4';
remote = '6681675df1d1789639bc584609e7ee0b87598edb' - RETRYING
[WARNING] *** CHECKSUM FAILED - Checksum failed on download: local = '6e8de0e4ea02914d960d75d2920f8a977cb536b4';
remote = '6681675df1d1789639bc584609e7ee0b87598edb' - IGNORING
[INFO] Uploading repository metadata for: 'artifact org.apache.openjpa:openjpa-all'
[INFO] Uploading project information for openjpa-all 2.1.2-20150115.064609-81
[INFO] Retrieving previous metadata from apache.snapshots.https
[WARNING] *** CHECKSUM FAILED - Checksum failed on download: local = 'c8f2975501894b30b8311cfc201bc1231e78635e';
remote = 'd86d6a3f67a1ce960f240622b9a9d6065f4af99d' - RETRYING
[WARNING] *** CHECKSUM FAILED - Checksum failed on download: local = 'c8f2975501894b30b8311cfc201bc1231e78635e';
remote = 'd86d6a3f67a1ce960f240622b9a9d6065f4af99d' - IGNORING
[INFO] Uploading repository metadata for: 'snapshot org.apache.openjpa:openjpa-all:2.1.2-SNAPSHOT'
[INFO] ------------------------------------------------------------------------
[ERROR] BUILD ERROR
[INFO] ------------------------------------------------------------------------
[INFO] Error installing artifact's metadata: Error while deploying metadata: Failed to transfer
file: https://repository.apache.org/content/repositories/snapshots/org/apache/openjpa/openjpa-all/2.1.2-SNAPSHOT/maven-metadata.xml.sha1.
Return code is: 502

[INFO] ------------------------------------------------------------------------
[INFO] For more information, run Maven with the -e switch
[INFO] ------------------------------------------------------------------------
[INFO] Total time: 47 minutes 43 seconds
[INFO] Finished at: Thu Jan 15 07:33:34 UTC 2015
[INFO] Final Memory: 150M/500M
[INFO] ------------------------------------------------------------------------
[JENKINS] Archiving <https://builds.apache.org/job/OpenJPA-21x-deploy/ws/2.1.x/openjpa-lib/pom.xml>
to org.apache.openjpa/openjpa-lib/2.1.2-SNAPSHOT/openjpa-lib-2.1.2-SNAPSHOT.pom
[JENKINS] Archiving <https://builds.apache.org/job/OpenJPA-21x-deploy/ws/2.1.x/openjpa-lib/target/openjpa-lib-2.1.2-SNAPSHOT.jar>
to org.apache.openjpa/openjpa-lib/2.1.2-20150115.064609-88/openjpa-lib-2.1.2-20150115.064609-88.jar
[JENKINS] Archiving <https://builds.apache.org/job/OpenJPA-21x-deploy/ws/2.1.x/openjpa-lib/target/openjpa-lib-2.1.2-SNAPSHOT-tests.jar>
to org.apache.openjpa/openjpa-lib/2.1.2-20150115.064609-88/openjpa-lib-2.1.2-20150115.064609-88-tests.jar
Sending artifact delta relative to OpenJPA-21x-deploy » OpenJPA Utilities Library #155
Archived 3 artifacts
Archive block size is 32768
Received 0 blocks and 586549 bytes
Compression is 0.0%
Took 0.46 sec
[JENKINS] Archiving <https://builds.apache.org/job/OpenJPA-21x-deploy/ws/2.1.x/openjpa/dependency-reduced-pom.xml>
to org.apache.openjpa/openjpa/2.1.2-SNAPSHOT/openjpa-2.1.2-SNAPSHOT.pom
[JENKINS] Archiving <https://builds.apache.org/job/OpenJPA-21x-deploy/ws/2.1.x/openjpa/target/openjpa-2.1.2-SNAPSHOT.jar>
to org.apache.openjpa/openjpa/2.1.2-20150115.064609-81/openjpa-2.1.2-20150115.064609-81.jar
Sending artifact delta relative to OpenJPA-21x-deploy » OpenJPA Aggregate Jar #155
Archived 2 artifacts
Archive block size is 32768
Received 3 blocks and 4269780 bytes
Compression is 2.3%
Took 1.5 sec
[JENKINS] Archiving <https://builds.apache.org/job/OpenJPA-21x-deploy/ws/2.1.x/openjpa-all/dependency-reduced-pom.xml>
to org.apache.openjpa/openjpa-all/2.1.2-SNAPSHOT/openjpa-all-2.1.2-SNAPSHOT.pom
[JENKINS] Archiving <https://builds.apache.org/job/OpenJPA-21x-deploy/ws/2.1.x/openjpa-all/target/openjpa-all-2.1.2-SNAPSHOT.jar>
to org.apache.openjpa/openjpa-all/2.1.2-20150115.064609-81/openjpa-all-2.1.2-20150115.064609-81.jar
[JENKINS] Archiving <https://builds.apache.org/job/OpenJPA-21x-deploy/ws/2.1.x/openjpa-all/target/openjpa-all-2.1.2-SNAPSHOT-tests.jar>
to org.apache.openjpa/openjpa-all/2.1.2-20150115.064609-81/openjpa-all-2.1.2-20150115.064609-81-tests.jar
Sending artifact delta relative to OpenJPA-21x-deploy » OpenJPA Aggregate Jar with Dependencies
#155
Archived 3 artifacts
Archive block size is 32768
Received 1 blocks and 6374598 bytes
Compression is 0.5%
Took 2.1 sec
[JENKINS] Archiving <https://builds.apache.org/job/OpenJPA-21x-deploy/ws/2.1.x/openjpa-kernel/pom.xml>
to org.apache.openjpa/openjpa-kernel/2.1.2-SNAPSHOT/openjpa-kernel-2.1.2-SNAPSHOT.pom
[JENKINS] Archiving <https://builds.apache.org/job/OpenJPA-21x-deploy/ws/2.1.x/openjpa-kernel/target/openjpa-kernel-2.1.2-SNAPSHOT.jar>
to org.apache.openjpa/openjpa-kernel/2.1.2-20150115.064609-88/openjpa-kernel-2.1.2-20150115.064609-88.jar
[JENKINS] Archiving <https://builds.apache.org/job/OpenJPA-21x-deploy/ws/2.1.x/openjpa-kernel/target/openjpa-kernel-2.1.2-SNAPSHOT-tests.jar>
to org.apache.openjpa/openjpa-kernel/2.1.2-20150115.064609-88/openjpa-kernel-2.1.2-20150115.064609-88-tests.jar
Sending artifact delta relative to OpenJPA-21x-deploy » OpenJPA Kernel #155
Archived 3 artifacts
Archive block size is 32768
Received 2 blocks and 1377920 bytes
Compression is 4.5%
Took 0.7 sec
[JENKINS] Archiving <https://builds.apache.org/job/OpenJPA-21x-deploy/ws/2.1.x/openjpa-persistence/pom.xml>
to org.apache.openjpa/openjpa-persistence/2.1.2-SNAPSHOT/openjpa-persistence-2.1.2-SNAPSHOT.pom
[JENKINS] Archiving <https://builds.apache.org/job/OpenJPA-21x-deploy/ws/2.1.x/openjpa-persistence/target/openjpa-persistence-2.1.2-SNAPSHOT.jar>
to org.apache.openjpa/openjpa-persistence/2.1.2-20150115.064609-88/openjpa-persistence-2.1.2-20150115.064609-88.jar
[JENKINS] Archiving <https://builds.apache.org/job/OpenJPA-21x-deploy/ws/2.1.x/openjpa-persistence/target/openjpa-persistence-2.1.2-SNAPSHOT-tests.jar>
to org.apache.openjpa/openjpa-persistence/2.1.2-20150115.064609-88/openjpa-persistence-2.1.2-20150115.064609-88-tests.jar
Sending artifact delta relative to OpenJPA-21x-deploy » OpenJPA Persistence #155
Archived 3 artifacts
Archive block size is 32768
Received 0 blocks and 839982 bytes
Compression is 0.0%
Took 0.41 sec
[JENKINS] Archiving <https://builds.apache.org/job/OpenJPA-21x-deploy/ws/2.1.x/openjpa-persistence-locking/pom.xml>
to org.apache.openjpa/openjpa-persistence-locking/2.1.2-SNAPSHOT/openjpa-persistence-locking-2.1.2-SNAPSHOT.pom
[JENKINS] Archiving <https://builds.apache.org/job/OpenJPA-21x-deploy/ws/2.1.x/openjpa-persistence-locking/target/openjpa-persistence-locking-2.1.2-SNAPSHOT.jar>
to org.apache.openjpa/openjpa-persistence-locking/2.1.2-20150115.064609-81/openjpa-persistence-locking-2.1.2-20150115.064609-81.jar
[JENKINS] Archiving <https://builds.apache.org/job/OpenJPA-21x-deploy/ws/2.1.x/openjpa-persistence-locking/target/openjpa-persistence-locking-2.1.2-SNAPSHOT-tests.jar>
to org.apache.openjpa/openjpa-persistence-locking/2.1.2-20150115.064609-81/openjpa-persistence-locking-2.1.2-20150115.064609-81-tests.jar
Sending artifact delta relative to OpenJPA-21x-deploy » OpenJPA Persistence Locking Tests
#155
Archived 3 artifacts
Archive block size is 32768
Received 0 blocks and 347866 bytes
Compression is 0.0%
Took 0.24 sec
[JENKINS] Archiving <https://builds.apache.org/job/OpenJPA-21x-deploy/ws/2.1.x/openjpa-persistence-jdbc/pom.xml>
to org.apache.openjpa/openjpa-persistence-jdbc/2.1.2-SNAPSHOT/openjpa-persistence-jdbc-2.1.2-SNAPSHOT.pom
[JENKINS] Archiving <https://builds.apache.org/job/OpenJPA-21x-deploy/ws/2.1.x/openjpa-persistence-jdbc/target/openjpa-persistence-jdbc-2.1.2-SNAPSHOT.jar>
to org.apache.openjpa/openjpa-persistence-jdbc/2.1.2-20150115.064609-84/openjpa-persistence-jdbc-2.1.2-20150115.064609-84.jar
[JENKINS] Archiving <https://builds.apache.org/job/OpenJPA-21x-deploy/ws/2.1.x/openjpa-persistence-jdbc/target/openjpa-persistence-jdbc-2.1.2-SNAPSHOT-tests.jar>
to org.apache.openjpa/openjpa-persistence-jdbc/2.1.2-20150115.064609-84/openjpa-persistence-jdbc-2.1.2-20150115.064609-84-tests.jar
Sending artifact delta relative to OpenJPA-21x-deploy » OpenJPA Persistence JDBC #155
Archived 3 artifacts
Archive block size is 32768
Received 0 blocks and 8061697 bytes
Compression is 0.0%
Took 2.6 sec
[JENKINS] Archiving <https://builds.apache.org/job/OpenJPA-21x-deploy/ws/2.1.x/pom.xml>
to org.apache.openjpa/openjpa-parent/2.1.2-SNAPSHOT/openjpa-parent-2.1.2-SNAPSHOT.pom
[JENKINS] Archiving /home/jenkins/jenkins-slave/maven-repositories/1/org/apache/openjpa/openjpa-parent/2.1.2-SNAPSHOT/openjpa-parent-2.1.2-SNAPSHOT.pom
to org.apache.openjpa/openjpa-parent/2.1.2-20150115.064609-88/openjpa-parent-2.1.2-20150115.064609-88.pom
/home/jenkins/jenkins-slave/maven-repositories/1/org/apache/openjpa/openjpa-parent/2.1.2-SNAPSHOT/openjpa-parent-2.1.2-SNAPSHOT.pom
is not inside <https://builds.apache.org/job/OpenJPA-21x-deploy/ws/2.1.x/;> will archive
in a separate pass
Sending artifact delta relative to OpenJPA-21x-deploy » OpenJPA Parent POM #155
Archived 1 artifacts
Archive block size is 32768
Received 0 blocks and 44300 bytes
Compression is 0.0%
Took 0.18 sec
Sending artifact delta relative to OpenJPA-21x-deploy » OpenJPA Parent POM #155
Archived 1 artifacts
Archive block size is 32768
Received 0 blocks and 44320 bytes
Compression is 0.0%
Took 86 ms
[JENKINS] Archiving <https://builds.apache.org/job/OpenJPA-21x-deploy/ws/2.1.x/openjpa-jdbc/pom.xml>
to org.apache.openjpa/openjpa-jdbc/2.1.2-SNAPSHOT/openjpa-jdbc-2.1.2-SNAPSHOT.pom
[JENKINS] Archiving <https://builds.apache.org/job/OpenJPA-21x-deploy/ws/2.1.x/openjpa-jdbc/target/openjpa-jdbc-2.1.2-SNAPSHOT.jar>
to org.apache.openjpa/openjpa-jdbc/2.1.2-20150115.064609-88/openjpa-jdbc-2.1.2-20150115.064609-88.jar
[JENKINS] Archiving <https://builds.apache.org/job/OpenJPA-21x-deploy/ws/2.1.x/openjpa-jdbc/target/openjpa-jdbc-2.1.2-SNAPSHOT-tests.jar>
to org.apache.openjpa/openjpa-jdbc/2.1.2-20150115.064609-88/openjpa-jdbc-2.1.2-20150115.064609-88-tests.jar
Sending artifact delta relative to OpenJPA-21x-deploy » OpenJPA JDBC #155
Archived 3 artifacts
Archive block size is 32768
Received 1 blocks and 1431440 bytes
Compression is 2.2%
Took 0.7 sec
[JENKINS] Archiving <https://builds.apache.org/job/OpenJPA-21x-deploy/ws/2.1.x/openjpa-slice/pom.xml>
to org.apache.openjpa/openjpa-slice/2.1.2-SNAPSHOT/openjpa-slice-2.1.2-SNAPSHOT.pom
[JENKINS] Archiving <https://builds.apache.org/job/OpenJPA-21x-deploy/ws/2.1.x/openjpa-slice/target/openjpa-slice-2.1.2-SNAPSHOT.jar>
to org.apache.openjpa/openjpa-slice/2.1.2-20150115.064609-81/openjpa-slice-2.1.2-20150115.064609-81.jar
[JENKINS] Archiving <https://builds.apache.org/job/OpenJPA-21x-deploy/ws/2.1.x/openjpa-slice/target/openjpa-slice-2.1.2-SNAPSHOT-tests.jar>
to org.apache.openjpa/openjpa-slice/2.1.2-20150115.064609-81/openjpa-slice-2.1.2-20150115.064609-81-tests.jar
Sending artifact delta relative to OpenJPA-21x-deploy » OpenJPA Slice #155
Archived 3 artifacts
Archive block size is 32768
Received 0 blocks and 177952 bytes
Compression is 0.0%
Took 0.18 sec
[JENKINS] Archiving <https://builds.apache.org/job/OpenJPA-21x-deploy/ws/2.1.x/openjpa-xmlstore/pom.xml>
to org.apache.openjpa/openjpa-xmlstore/2.1.2-SNAPSHOT/openjpa-xmlstore-2.1.2-SNAPSHOT.pom
[JENKINS] Archiving <https://builds.apache.org/job/OpenJPA-21x-deploy/ws/2.1.x/openjpa-xmlstore/target/openjpa-xmlstore-2.1.2-SNAPSHOT.jar>
to org.apache.openjpa/openjpa-xmlstore/2.1.2-20150115.064609-81/openjpa-xmlstore-2.1.2-20150115.064609-81.jar
[JENKINS] Archiving <https://builds.apache.org/job/OpenJPA-21x-deploy/ws/2.1.x/openjpa-xmlstore/target/openjpa-xmlstore-2.1.2-SNAPSHOT-tests.jar>
to org.apache.openjpa/openjpa-xmlstore/2.1.2-20150115.064609-81/openjpa-xmlstore-2.1.2-20150115.064609-81-tests.jar
Sending artifact delta relative to OpenJPA-21x-deploy » OpenJPA XML Store #155
Archived 3 artifacts
Archive block size is 32768
Received 0 blocks and 112387 bytes
Compression is 0.0%
Took 0.19 sec
Sending e-mails to: commits@openjpa.apache.org
channel stopped

Mime
View raw message