openjpa-commits mailing list archives

Site index · List index
Message view « Date » · « Thread »
Top « Date » · « Thread »
From Apache Jenkins Server <jenk...@builds.apache.org>
Subject Build failed in Jenkins: OpenJPA-21x-deploy #157
Date Wed, 28 Jan 2015 07:33:28 GMT
See <https://builds.apache.org/job/OpenJPA-21x-deploy/157/changes>

Changes:

[hthomann] OPENJPA-2536: FetchGroup is not returning lazy fields.  Applied Rick Curtis' fix
to 2.1.x.

------------------------------------------
[...truncated 17187 lines...]
Uploading: https://repository.apache.org/content/repositories/snapshots/org/apache/openjpa/apache-openjpa/2.1.2-SNAPSHOT/apache-openjpa-2.1.2-20150128.064559-81-binary.zip
14951K uploaded  (apache-openjpa-2.1.2-20150128.064559-81-binary.zip)
[INFO] Retrieving previous build number from apache.snapshots.https
Uploading: https://repository.apache.org/content/repositories/snapshots/org/apache/openjpa/apache-openjpa/2.1.2-SNAPSHOT/apache-openjpa-2.1.2-20150128.064559-81-source.zip
11109K uploaded  (apache-openjpa-2.1.2-20150128.064559-81-source.zip)
[INFO] ------------------------------------------------------------------------
[INFO] Building OpenJPA Examples
[INFO]    task-segment: [clean, deploy]
[INFO] ------------------------------------------------------------------------
[INFO] [clean:clean {execution: default-clean}]
[INFO] [buildnumber:create {execution: default}]
[INFO] [enforcer:enforce {execution: default}]
[INFO] [checkstyle:checkstyle {execution: default}]
[INFO] Source directory does not exist - skipping report.
[INFO] [remote-resources:process {execution: default}]
[INFO] [site:attach-descriptor {execution: default-attach-descriptor}]
[INFO] [ianal:verify-legal-files {execution: default}]
[INFO] [apache-rat:check {execution: default}]
[INFO] Exclude: **/.*/**
[INFO] Exclude: **/target/**/*
[INFO] [install:install {execution: default-install}]
[INFO] Installing <https://builds.apache.org/job/OpenJPA-21x-deploy/ws/2.1.x/openjpa-examples/pom.xml>
to /home/jenkins/jenkins-slave/maven-repositories/0/org/apache/openjpa/openjpa-examples/2.1.2-SNAPSHOT/openjpa-examples-2.1.2-SNAPSHOT.pom
[INFO] [deploy:deploy {execution: default-deploy}]
[INFO] Retrieving previous build number from apache.snapshots.https
[WARNING] *** CHECKSUM FAILED - Checksum failed on download: local = 'b462374b5f8422400360ced0e8539d98308d69ec';
remote = '991269802f30ddbe098c89795df76acf670b9d16' - RETRYING
[WARNING] *** CHECKSUM FAILED - Checksum failed on download: local = 'b462374b5f8422400360ced0e8539d98308d69ec';
remote = '991269802f30ddbe098c89795df76acf670b9d16' - IGNORING
Uploading: https://repository.apache.org/content/repositories/snapshots/org/apache/openjpa/openjpa-examples/2.1.2-SNAPSHOT/openjpa-examples-2.1.2-20150128.064559-81.pom
2K uploaded  (openjpa-examples-2.1.2-20150128.064559-81.pom)
[INFO] Retrieving previous metadata from apache.snapshots.https
[WARNING] *** CHECKSUM FAILED - Checksum failed on download: local = 'b462374b5f8422400360ced0e8539d98308d69ec';
remote = '991269802f30ddbe098c89795df76acf670b9d16' - RETRYING
[WARNING] *** CHECKSUM FAILED - Checksum failed on download: local = 'b462374b5f8422400360ced0e8539d98308d69ec';
remote = '991269802f30ddbe098c89795df76acf670b9d16' - IGNORING
[INFO] Uploading repository metadata for: 'snapshot org.apache.openjpa:openjpa-examples:2.1.2-SNAPSHOT'
[INFO] Retrieving previous metadata from apache.snapshots.https
[INFO] Uploading repository metadata for: 'artifact org.apache.openjpa:openjpa-examples'
[INFO] ------------------------------------------------------------------------
[INFO] Building OpenJPA Examples - Simple
[INFO]    task-segment: [clean, deploy]
[INFO] ------------------------------------------------------------------------
[INFO] [clean:clean {execution: default-clean}]
[INFO] [buildnumber:create {execution: default}]
[INFO] [enforcer:enforce {execution: default}]
[INFO] [checkstyle:checkstyle {execution: default}]
[INFO] Starting audit...
Audit done.

[WARNING] Unable to locate Source XRef to link to - DISABLED
[INFO] [remote-resources:process {execution: default}]
[INFO] [resources:resources {execution: default-resources}]
[INFO] Using 'UTF-8' encoding to copy filtered resources.
[INFO] skip non existing resourceDirectory <https://builds.apache.org/job/OpenJPA-21x-deploy/ws/2.1.x/openjpa-examples/simple/src/main/resources>
[INFO] Copying 3 resources
[INFO] [compiler:compile {execution: default-compile}]
[INFO] Compiling 12 source files to <https://builds.apache.org/job/OpenJPA-21x-deploy/ws/2.1.x/openjpa-examples/simple/target/classes>
[INFO] [resources:testResources {execution: default-testResources}]
[INFO] Using 'UTF-8' encoding to copy filtered resources.
[INFO] skip non existing resourceDirectory <https://builds.apache.org/job/OpenJPA-21x-deploy/ws/2.1.x/openjpa-examples/simple/src/test/resources>
[INFO] Copying 3 resources
[INFO] [compiler:testCompile {execution: default-testCompile}]
[INFO] Nothing to compile - all classes are up to date
[WARNING] DEPRECATED [systemProperties]: Use systemPropertyVariables instead.
[INFO] [surefire:test {execution: default-test}]
[INFO] Surefire report directory: <https://builds.apache.org/job/OpenJPA-21x-deploy/ws/2.1.x/openjpa-examples/simple/target/surefire-reports>

-------------------------------------------------------
 T E S T S
-------------------------------------------------------
There are no tests to run.

Results :

Tests run: 0, Failures: 0, Errors: 0, Skipped: 0

[JENKINS] Recording test results
[INFO] [jar:jar {execution: default-jar}]
[INFO] Building jar: <https://builds.apache.org/job/OpenJPA-21x-deploy/ws/2.1.x/openjpa-examples/simple/target/simple-2.1.2-SNAPSHOT.jar>
[INFO] [jar:jar {execution: default-jar}]
[INFO] [jar:test-jar {execution: attach-tests}]
[INFO] Building jar: <https://builds.apache.org/job/OpenJPA-21x-deploy/ws/2.1.x/openjpa-examples/simple/target/simple-2.1.2-SNAPSHOT-tests.jar>
[INFO] [ianal:verify-legal-files {execution: default}]
[INFO] Checking legal files in: simple-2.1.2-SNAPSHOT.jar
[INFO] Checking legal files in: simple-2.1.2-SNAPSHOT-tests.jar
[INFO] [apache-rat:check {execution: default}]
[INFO] Exclude: **/.*/**
[INFO] Exclude: **/target/**/*
[INFO] [install:install {execution: default-install}]
[INFO] Installing <https://builds.apache.org/job/OpenJPA-21x-deploy/ws/2.1.x/openjpa-examples/simple/target/simple-2.1.2-SNAPSHOT.jar>
to /home/jenkins/jenkins-slave/maven-repositories/0/org/apache/openjpa/openjpa-examples/simple/2.1.2-SNAPSHOT/simple-2.1.2-SNAPSHOT.jar
[INFO] Installing <https://builds.apache.org/job/OpenJPA-21x-deploy/ws/2.1.x/openjpa-examples/simple/target/simple-2.1.2-SNAPSHOT-tests.jar>
to /home/jenkins/jenkins-slave/maven-repositories/0/org/apache/openjpa/openjpa-examples/simple/2.1.2-SNAPSHOT/simple-2.1.2-SNAPSHOT-tests.jar
[INFO] [deploy:deploy {execution: default-deploy}]
[INFO] Retrieving previous build number from apache.snapshots.https
[INFO] ------------------------------------------------------------------------
[ERROR] BUILD ERROR
[INFO] ------------------------------------------------------------------------
[INFO] Error retrieving previous build number for artifact 'org.apache.openjpa.openjpa-examples:simple:jar':
repository metadata for: 'snapshot org.apache.openjpa.openjpa-examples:simple:2.1.2-SNAPSHOT'
could not be retrieved from repository: apache.snapshots.https due to an error: Error transferring
file: Server returned HTTP response code: 502 for URL: https://repository.apache.org/content/repositories/snapshots/org/apache/openjpa/openjpa-examples/simple/2.1.2-SNAPSHOT/maven-metadata.xml

[INFO] ------------------------------------------------------------------------
[INFO] For more information, run Maven with the -e switch
[INFO] ------------------------------------------------------------------------
[INFO] Total time: 47 minutes 33 seconds
[INFO] Finished at: Wed Jan 28 07:33:10 UTC 2015
[INFO] Final Memory: 157M/537M
[INFO] ------------------------------------------------------------------------
[JENKINS] Archiving <https://builds.apache.org/job/OpenJPA-21x-deploy/ws/2.1.x/openjpa-examples/simple/pom.xml>
to org.apache.openjpa.openjpa-examples/simple/2.1.2-SNAPSHOT/simple-2.1.2-SNAPSHOT.pom
[JENKINS] Archiving <https://builds.apache.org/job/OpenJPA-21x-deploy/ws/2.1.x/openjpa-examples/simple/target/simple-2.1.2-SNAPSHOT.jar>
to org.apache.openjpa.openjpa-examples/simple/2.1.2-SNAPSHOT/simple-2.1.2-SNAPSHOT.jar
[JENKINS] Archiving <https://builds.apache.org/job/OpenJPA-21x-deploy/ws/2.1.x/openjpa-examples/simple/target/simple-2.1.2-SNAPSHOT-tests.jar>
to org.apache.openjpa.openjpa-examples/simple/2.1.2-SNAPSHOT/simple-2.1.2-SNAPSHOT-tests.jar
Sending artifact delta relative to OpenJPA-21x-deploy » OpenJPA Examples - Simple #155
Archived 3 artifacts
Archive block size is 32768
Received 0 blocks and 32050 bytes
Compression is 0.0%
Took 0.16 sec
[JENKINS] Archiving <https://builds.apache.org/job/OpenJPA-21x-deploy/ws/2.1.x/openjpa-lib/pom.xml>
to org.apache.openjpa/openjpa-lib/2.1.2-SNAPSHOT/openjpa-lib-2.1.2-SNAPSHOT.pom
[JENKINS] Archiving <https://builds.apache.org/job/OpenJPA-21x-deploy/ws/2.1.x/openjpa-lib/target/openjpa-lib-2.1.2-SNAPSHOT.jar>
to org.apache.openjpa/openjpa-lib/2.1.2-20150128.064559-89/openjpa-lib-2.1.2-20150128.064559-89.jar
[JENKINS] Archiving <https://builds.apache.org/job/OpenJPA-21x-deploy/ws/2.1.x/openjpa-lib/target/openjpa-lib-2.1.2-SNAPSHOT-tests.jar>
to org.apache.openjpa/openjpa-lib/2.1.2-20150128.064559-89/openjpa-lib-2.1.2-20150128.064559-89-tests.jar
Sending artifact delta relative to OpenJPA-21x-deploy » OpenJPA Utilities Library #156
Archived 3 artifacts
Archive block size is 32768
Received 0 blocks and 586547 bytes
Compression is 0.0%
Took 0.25 sec
[JENKINS] Archiving <https://builds.apache.org/job/OpenJPA-21x-deploy/ws/2.1.x/openjpa/dependency-reduced-pom.xml>
to org.apache.openjpa/openjpa/2.1.2-SNAPSHOT/openjpa-2.1.2-SNAPSHOT.pom
[JENKINS] Archiving <https://builds.apache.org/job/OpenJPA-21x-deploy/ws/2.1.x/openjpa/target/openjpa-2.1.2-SNAPSHOT.jar>
to org.apache.openjpa/openjpa/2.1.2-20150128.064559-82/openjpa-2.1.2-20150128.064559-82.jar
Sending artifact delta relative to OpenJPA-21x-deploy » OpenJPA Aggregate Jar #156
Archived 2 artifacts
Archive block size is 32768
Received 3 blocks and 4269781 bytes
Compression is 2.3%
Took 1.2 sec
[JENKINS] Archiving <https://builds.apache.org/job/OpenJPA-21x-deploy/ws/2.1.x/openjpa-all/dependency-reduced-pom.xml>
to org.apache.openjpa/openjpa-all/2.1.2-SNAPSHOT/openjpa-all-2.1.2-SNAPSHOT.pom
[JENKINS] Archiving <https://builds.apache.org/job/OpenJPA-21x-deploy/ws/2.1.x/openjpa-all/target/openjpa-all-2.1.2-SNAPSHOT.jar>
to org.apache.openjpa/openjpa-all/2.1.2-20150128.064559-82/openjpa-all-2.1.2-20150128.064559-82.jar
[JENKINS] Archiving <https://builds.apache.org/job/OpenJPA-21x-deploy/ws/2.1.x/openjpa-all/target/openjpa-all-2.1.2-SNAPSHOT-tests.jar>
to org.apache.openjpa/openjpa-all/2.1.2-20150128.064559-82/openjpa-all-2.1.2-20150128.064559-82-tests.jar
Sending artifact delta relative to OpenJPA-21x-deploy » OpenJPA Aggregate Jar with Dependencies
#155
Archived 3 artifacts
Archive block size is 32768
Received 1 blocks and 6374606 bytes
Compression is 0.5%
Took 1.7 sec
[JENKINS] Archiving <https://builds.apache.org/job/OpenJPA-21x-deploy/ws/2.1.x/openjpa-kernel/pom.xml>
to org.apache.openjpa/openjpa-kernel/2.1.2-SNAPSHOT/openjpa-kernel-2.1.2-SNAPSHOT.pom
[JENKINS] Archiving <https://builds.apache.org/job/OpenJPA-21x-deploy/ws/2.1.x/openjpa-kernel/target/openjpa-kernel-2.1.2-SNAPSHOT.jar>
to org.apache.openjpa/openjpa-kernel/2.1.2-20150128.064559-89/openjpa-kernel-2.1.2-20150128.064559-89.jar
[JENKINS] Archiving <https://builds.apache.org/job/OpenJPA-21x-deploy/ws/2.1.x/openjpa-kernel/target/openjpa-kernel-2.1.2-SNAPSHOT-tests.jar>
to org.apache.openjpa/openjpa-kernel/2.1.2-20150128.064559-89/openjpa-kernel-2.1.2-20150128.064559-89-tests.jar
Sending artifact delta relative to OpenJPA-21x-deploy » OpenJPA Kernel #156
Archived 3 artifacts
Archive block size is 32768
Received 2 blocks and 1377928 bytes
Compression is 4.5%
Took 0.6 sec
[JENKINS] Archiving <https://builds.apache.org/job/OpenJPA-21x-deploy/ws/2.1.x/openjpa-examples/pom.xml>
to org.apache.openjpa/openjpa-examples/2.1.2-SNAPSHOT/openjpa-examples-2.1.2-SNAPSHOT.pom
[JENKINS] Archiving /home/jenkins/jenkins-slave/maven-repositories/0/org/apache/openjpa/openjpa-examples/2.1.2-SNAPSHOT/openjpa-examples-2.1.2-SNAPSHOT.pom
to org.apache.openjpa/openjpa-examples/2.1.2-20150128.064559-81/openjpa-examples-2.1.2-20150128.064559-81.pom
/home/jenkins/jenkins-slave/maven-repositories/0/org/apache/openjpa/openjpa-examples/2.1.2-SNAPSHOT/openjpa-examples-2.1.2-SNAPSHOT.pom
is not inside <https://builds.apache.org/job/OpenJPA-21x-deploy/ws/2.1.x/openjpa-examples/;>
will archive in a separate pass
Sending artifact delta relative to OpenJPA-21x-deploy » OpenJPA Examples #155
Archived 1 artifacts
Archive block size is 32768
Received 0 blocks and 2784 bytes
Compression is 0.0%
Took 71 ms
Sending artifact delta relative to OpenJPA-21x-deploy » OpenJPA Examples #155
Archived 1 artifacts
Archive block size is 32768
Received 0 blocks and 2804 bytes
Compression is 0.0%
Took 28 ms
[JENKINS] Archiving <https://builds.apache.org/job/OpenJPA-21x-deploy/ws/2.1.x/openjpa-persistence/pom.xml>
to org.apache.openjpa/openjpa-persistence/2.1.2-SNAPSHOT/openjpa-persistence-2.1.2-SNAPSHOT.pom
[JENKINS] Archiving <https://builds.apache.org/job/OpenJPA-21x-deploy/ws/2.1.x/openjpa-persistence/target/openjpa-persistence-2.1.2-SNAPSHOT.jar>
to org.apache.openjpa/openjpa-persistence/2.1.2-20150128.064559-89/openjpa-persistence-2.1.2-20150128.064559-89.jar
[JENKINS] Archiving <https://builds.apache.org/job/OpenJPA-21x-deploy/ws/2.1.x/openjpa-persistence/target/openjpa-persistence-2.1.2-SNAPSHOT-tests.jar>
to org.apache.openjpa/openjpa-persistence/2.1.2-20150128.064559-89/openjpa-persistence-2.1.2-20150128.064559-89-tests.jar
Sending artifact delta relative to OpenJPA-21x-deploy » OpenJPA Persistence #156
Archived 3 artifacts
Archive block size is 32768
Received 0 blocks and 839980 bytes
Compression is 0.0%
Took 0.34 sec
[JENKINS] Archiving <https://builds.apache.org/job/OpenJPA-21x-deploy/ws/2.1.x/openjpa-persistence-locking/pom.xml>
to org.apache.openjpa/openjpa-persistence-locking/2.1.2-SNAPSHOT/openjpa-persistence-locking-2.1.2-SNAPSHOT.pom
[JENKINS] Archiving <https://builds.apache.org/job/OpenJPA-21x-deploy/ws/2.1.x/openjpa-persistence-locking/target/openjpa-persistence-locking-2.1.2-SNAPSHOT.jar>
to org.apache.openjpa/openjpa-persistence-locking/2.1.2-20150128.064559-82/openjpa-persistence-locking-2.1.2-20150128.064559-82.jar
[JENKINS] Archiving <https://builds.apache.org/job/OpenJPA-21x-deploy/ws/2.1.x/openjpa-persistence-locking/target/openjpa-persistence-locking-2.1.2-SNAPSHOT-tests.jar>
to org.apache.openjpa/openjpa-persistence-locking/2.1.2-20150128.064559-82/openjpa-persistence-locking-2.1.2-20150128.064559-82-tests.jar
Sending artifact delta relative to OpenJPA-21x-deploy » OpenJPA Persistence Locking Tests
#156
Archived 3 artifacts
Archive block size is 32768
Received 0 blocks and 347868 bytes
Compression is 0.0%
Took 0.21 sec
[JENKINS] Archiving <https://builds.apache.org/job/OpenJPA-21x-deploy/ws/2.1.x/openjpa-persistence-jdbc/pom.xml>
to org.apache.openjpa/openjpa-persistence-jdbc/2.1.2-SNAPSHOT/openjpa-persistence-jdbc-2.1.2-SNAPSHOT.pom
[JENKINS] Archiving <https://builds.apache.org/job/OpenJPA-21x-deploy/ws/2.1.x/openjpa-persistence-jdbc/target/openjpa-persistence-jdbc-2.1.2-SNAPSHOT.jar>
to org.apache.openjpa/openjpa-persistence-jdbc/2.1.2-20150128.064559-85/openjpa-persistence-jdbc-2.1.2-20150128.064559-85.jar
[JENKINS] Archiving <https://builds.apache.org/job/OpenJPA-21x-deploy/ws/2.1.x/openjpa-persistence-jdbc/target/openjpa-persistence-jdbc-2.1.2-SNAPSHOT-tests.jar>
to org.apache.openjpa/openjpa-persistence-jdbc/2.1.2-20150128.064559-85/openjpa-persistence-jdbc-2.1.2-20150128.064559-85-tests.jar
Sending artifact delta relative to OpenJPA-21x-deploy » OpenJPA Persistence JDBC #156
Archived 3 artifacts
Archive block size is 32768
Received 1 blocks and 8029198 bytes
Compression is 0.4%
Took 2.3 sec
[JENKINS] Archiving <https://builds.apache.org/job/OpenJPA-21x-deploy/ws/2.1.x/openjpa-project/pom.xml>
to org.apache.openjpa/apache-openjpa/2.1.2-SNAPSHOT/apache-openjpa-2.1.2-SNAPSHOT.pom
[JENKINS] Archiving /home/jenkins/jenkins-slave/maven-repositories/0/org/apache/openjpa/apache-openjpa/2.1.2-SNAPSHOT/apache-openjpa-2.1.2-SNAPSHOT.pom
to org.apache.openjpa/apache-openjpa/2.1.2-20150128.064559-81/apache-openjpa-2.1.2-20150128.064559-81.pom
[JENKINS] Archiving <https://builds.apache.org/job/OpenJPA-21x-deploy/ws/2.1.x/openjpa-project/target/site/downloads/apache-openjpa-2.1.2-SNAPSHOT-binary.zip>
to org.apache.openjpa/apache-openjpa/2.1.2-20150128.064559-81/apache-openjpa-2.1.2-20150128.064559-81-binary.zip
[JENKINS] Archiving <https://builds.apache.org/job/OpenJPA-21x-deploy/ws/2.1.x/openjpa-project/target/site/downloads/apache-openjpa-2.1.2-SNAPSHOT-source.zip>
to org.apache.openjpa/apache-openjpa/2.1.2-20150128.064559-81/apache-openjpa-2.1.2-20150128.064559-81-source.zip
/home/jenkins/jenkins-slave/maven-repositories/0/org/apache/openjpa/apache-openjpa/2.1.2-SNAPSHOT/apache-openjpa-2.1.2-SNAPSHOT.pom
is not inside <https://builds.apache.org/job/OpenJPA-21x-deploy/ws/2.1.x/openjpa-project/;>
will archive in a separate pass
Sending artifact delta relative to OpenJPA-21x-deploy » OpenJPA Project Docs and Assemblies
#155
Archived 3 artifacts
Archive block size is 32768
Received 470 blocks and 11307257 bytes
Compression is 57.7%
Took 3.8 sec
Sending artifact delta relative to OpenJPA-21x-deploy » OpenJPA Project Docs and Assemblies
#155
Archived 1 artifacts
Archive block size is 32768
Received 0 blocks and 21746 bytes
Compression is 0.0%
Took 0.43 sec
[JENKINS] Archiving <https://builds.apache.org/job/OpenJPA-21x-deploy/ws/2.1.x/pom.xml>
to org.apache.openjpa/openjpa-parent/2.1.2-SNAPSHOT/openjpa-parent-2.1.2-SNAPSHOT.pom
[JENKINS] Archiving /home/jenkins/jenkins-slave/maven-repositories/0/org/apache/openjpa/openjpa-parent/2.1.2-SNAPSHOT/openjpa-parent-2.1.2-SNAPSHOT.pom
to org.apache.openjpa/openjpa-parent/2.1.2-20150128.064559-89/openjpa-parent-2.1.2-20150128.064559-89.pom
/home/jenkins/jenkins-slave/maven-repositories/0/org/apache/openjpa/openjpa-parent/2.1.2-SNAPSHOT/openjpa-parent-2.1.2-SNAPSHOT.pom
is not inside <https://builds.apache.org/job/OpenJPA-21x-deploy/ws/2.1.x/;> will archive
in a separate pass
Sending artifact delta relative to OpenJPA-21x-deploy » OpenJPA Parent POM #156
Archived 1 artifacts
Archive block size is 32768
Received 0 blocks and 44300 bytes
Compression is 0.0%
Took 71 ms
Sending artifact delta relative to OpenJPA-21x-deploy » OpenJPA Parent POM #156
Archived 1 artifacts
Archive block size is 32768
Received 0 blocks and 44320 bytes
Compression is 0.0%
Took 35 ms
[JENKINS] Archiving <https://builds.apache.org/job/OpenJPA-21x-deploy/ws/2.1.x/openjpa-jdbc/pom.xml>
to org.apache.openjpa/openjpa-jdbc/2.1.2-SNAPSHOT/openjpa-jdbc-2.1.2-SNAPSHOT.pom
[JENKINS] Archiving <https://builds.apache.org/job/OpenJPA-21x-deploy/ws/2.1.x/openjpa-jdbc/target/openjpa-jdbc-2.1.2-SNAPSHOT.jar>
to org.apache.openjpa/openjpa-jdbc/2.1.2-20150128.064559-89/openjpa-jdbc-2.1.2-20150128.064559-89.jar
[JENKINS] Archiving <https://builds.apache.org/job/OpenJPA-21x-deploy/ws/2.1.x/openjpa-jdbc/target/openjpa-jdbc-2.1.2-SNAPSHOT-tests.jar>
to org.apache.openjpa/openjpa-jdbc/2.1.2-20150128.064559-89/openjpa-jdbc-2.1.2-20150128.064559-89-tests.jar
Sending artifact delta relative to OpenJPA-21x-deploy » OpenJPA JDBC #156
Archived 3 artifacts
Archive block size is 32768
Received 1 blocks and 1431439 bytes
Compression is 2.2%
Took 0.43 sec
[JENKINS] Archiving <https://builds.apache.org/job/OpenJPA-21x-deploy/ws/2.1.x/openjpa-slice/pom.xml>
to org.apache.openjpa/openjpa-slice/2.1.2-SNAPSHOT/openjpa-slice-2.1.2-SNAPSHOT.pom
[JENKINS] Archiving <https://builds.apache.org/job/OpenJPA-21x-deploy/ws/2.1.x/openjpa-slice/target/openjpa-slice-2.1.2-SNAPSHOT.jar>
to org.apache.openjpa/openjpa-slice/2.1.2-20150128.064559-82/openjpa-slice-2.1.2-20150128.064559-82.jar
[JENKINS] Archiving <https://builds.apache.org/job/OpenJPA-21x-deploy/ws/2.1.x/openjpa-slice/target/openjpa-slice-2.1.2-SNAPSHOT-tests.jar>
to org.apache.openjpa/openjpa-slice/2.1.2-20150128.064559-82/openjpa-slice-2.1.2-20150128.064559-82-tests.jar
Sending artifact delta relative to OpenJPA-21x-deploy » OpenJPA Slice #156
Archived 3 artifacts
Archive block size is 32768
Received 0 blocks and 177951 bytes
Compression is 0.0%
Took 0.19 sec
[JENKINS] Archiving <https://builds.apache.org/job/OpenJPA-21x-deploy/ws/2.1.x/openjpa-xmlstore/pom.xml>
to org.apache.openjpa/openjpa-xmlstore/2.1.2-SNAPSHOT/openjpa-xmlstore-2.1.2-SNAPSHOT.pom
[JENKINS] Archiving <https://builds.apache.org/job/OpenJPA-21x-deploy/ws/2.1.x/openjpa-xmlstore/target/openjpa-xmlstore-2.1.2-SNAPSHOT.jar>
to org.apache.openjpa/openjpa-xmlstore/2.1.2-20150128.064559-82/openjpa-xmlstore-2.1.2-20150128.064559-82.jar
[JENKINS] Archiving <https://builds.apache.org/job/OpenJPA-21x-deploy/ws/2.1.x/openjpa-xmlstore/target/openjpa-xmlstore-2.1.2-SNAPSHOT-tests.jar>
to org.apache.openjpa/openjpa-xmlstore/2.1.2-20150128.064559-82/openjpa-xmlstore-2.1.2-20150128.064559-82-tests.jar
Sending artifact delta relative to OpenJPA-21x-deploy » OpenJPA XML Store #156
Archived 3 artifacts
Archive block size is 32768
Received 0 blocks and 112386 bytes
Compression is 0.0%
Took 0.17 sec
Sending e-mails to: commits@openjpa.apache.org
Sending e-mails to: commits@openjpa.apache.org
channel stopped

Mime
View raw message