openjpa-commits mailing list archives

Site index · List index
Message view « Date » · « Thread »
Top « Date » · « Thread »
From Apache Jenkins Server <jenk...@builds.apache.org>
Subject Build failed in Jenkins: OpenJPA-21x-docs » OpenJPA Project Docs and Assemblies #49
Date Wed, 15 Apr 2015 07:18:03 GMT
See <https://builds.apache.org/job/OpenJPA-21x-docs/org.apache.openjpa$apache-openjpa/49/>

------------------------------------------
maven-agent.jar already up to date
classworlds.jar already up to date
maven-interceptor.jar already up to date
maven2.1-interceptor.jar already up to date
<===[JENKINS REMOTING CAPACITY]===>   channel started
Executing Maven:  -B -f <https://builds.apache.org/job/OpenJPA-21x-docs/org.apache.openjpa$apache-openjpa/ws/pom.xml>
-Dmaven.repo.local=/home/jenkins/jenkins-slave/maven-repositories/1 process-resources -Pdocbook-profile
[INFO] Scanning for projects...
[INFO] ------------------------------------------------------------------------
[INFO] Building OpenJPA Project Docs and Assemblies
[INFO]    task-segment: [process-resources]
[INFO] ------------------------------------------------------------------------
[INFO] [buildnumber:create {execution: default}]
[INFO] Checking for local modifications: skipped.
[INFO] Updating project files from SCM: skipped.
[INFO] Executing: /bin/sh -c cd <https://builds.apache.org/job/OpenJPA-21x-docs/org.apache.openjpa$apache-openjpa/ws/>
&& svn --non-interactive info
[INFO] Working directory: <https://builds.apache.org/job/OpenJPA-21x-docs/org.apache.openjpa$apache-openjpa/ws/>
[INFO] Storing buildNumber: 1591536 at timestamp: April 15, 2015 at 7:17 AM
[INFO] Executing: /bin/sh -c cd <https://builds.apache.org/job/OpenJPA-21x-docs/org.apache.openjpa$apache-openjpa/ws/>
&& svn --non-interactive info
[INFO] Working directory: <https://builds.apache.org/job/OpenJPA-21x-docs/org.apache.openjpa$apache-openjpa/ws/>
[INFO] Storing buildScmBranch: branches/2.1.x/openjpa-project
[INFO] snapshot org.apache.openjpa:openjpa:2.1.2-SNAPSHOT: checking for updates from jai.repository
[INFO] snapshot org.apache.openjpa:openjpa-all:2.1.2-SNAPSHOT: checking for updates from jai.repository
[INFO] [enforcer:enforce {execution: default}]
Setting property: classpath.resource.loader.class => 'org.codehaus.plexus.velocity.ContextClassLoaderResourceLoader'.
Setting property: site.resource.loader.class => 'org.codehaus.plexus.velocity.SiteResourceLoader'.
Setting property: velocimacro.messages.on => 'false'.
Setting property: resource.loader => 'classpath,site'.
Setting property: runtime.log.invalid.references => 'false'.
Setting property: resource.manager.logwhenfound => 'false'.
Setting property: velocimacro.permissions.allow.inline.to.replace.global => 'true'.
[INFO] [checkstyle:checkstyle {execution: default}]
[INFO] Source directory does not exist - skipping report.
[ERROR] VM #displayTree: error : too few arguments to macro. Wanted 2 got 0
[ERROR] VM #menuItem: error : too few arguments to macro. Wanted 1 got 0
[INFO] Setting property: classpath.resource.loader.class => 'org.codehaus.plexus.velocity.ContextClassLoaderResourceLoader'.
[INFO] Setting property: velocimacro.messages.on => 'false'.
[INFO] Setting property: resource.loader => 'classpath'.
[INFO] Setting property: resource.manager.logwhenfound => 'false'.
[INFO] [remote-resources:process {execution: default}]
Downloading: http://agilejava.com/maven/com/sun/jai_core/1.1.3/jai_core-1.1.3.pom
1K downloaded  (jai_core-1.1.3.pom)
[WARNING] *** CHECKSUM FAILED - Checksum failed on download: local = '4772168b400a0ce2c46ba2ebac04594e93759073';
remote = '<!--
	top.location="http://www.seektoexplore.com/?dn=agilejava.com&fp=QJMKcJUHUccSJpF7mWh4T4%2B37tjMiryrSnasueRSqbVmurnrZ%2FFBYOXa1Lt6Ci0MTt2LgnHyA%2B%2FqrJBLpmZS1A%3D%3D&prvtof=I83YzCfk79E6CcF3MK9Ovcu4JtCKKu7cgdDRYuygXlw%3D&poru=tmrg9ilN7Li25Gbu0UBcVls60yjCRpkzrborsDYNmCoeaH%2FZyQioQUF3%2BcvMBPNEK6wRsdciLARRFJY%2F846VsYieEtYOmt90cYJZxAsUvoQ%3D&cifr=1&";
	/*
-->
<html><head>
				' - RETRYING
Downloading: http://agilejava.com/maven/com/sun/jai_core/1.1.3/jai_core-1.1.3.pom
1K downloaded  (jai_core-1.1.3.pom)
[WARNING] *** CHECKSUM FAILED - Checksum failed on download: local = '0eaee223621fdb9d01a984ffd795d9fb0e3d80cb';
remote = '<!--
	top.location="http://www.seektoexplore.com/?dn=agilejava.com&fp=OZps8K7xahEn03wlqPYzxJQEcbS0SomnD7%2FWIOtbqnTVf2e6YvadwcKWGNSnLbGVYQ0xCc9P8l5VBbMcjH8Piw%3D%3D&prvtof=X1yRKzUmK9NSvsXXsaoiy%2FJf%2FQzdG8Yr5Hs44TuM3Bw%3D&poru=qTo84AGgcw%2FwgaTeWc9iM%2B%2FKuoMqhBC1rNj13qGRtQRORGDmw1ZZFSbP0rN0sU1nMm2pvfZ9TM0E%2F%2F89SxA9xg6jsHyurYsDluW12W4X6JU%3D&cifr=1&";
	/*
-->
<html><head>
				' - IGNORING
[WARNING] POM for 'com.sun:jai_core:pom:1.1.3:runtime' is invalid.

Its dependencies (if any) will NOT be available to the current build.
Downloading: http://agilejava.com/maven/com/sun/jai_codec/1.1.3/jai_codec-1.1.3.pom
1K downloaded  (jai_codec-1.1.3.pom)
[WARNING] *** CHECKSUM FAILED - Checksum failed on download: local = 'a137231fe3781d70d1f946534f5260232d0e84ce';
remote = '<!--
	top.location="http://www.seektoexplore.com/?dn=agilejava.com&fp=fOMgOXvtc%2FWTLFIr3s5lb0sDLrxUVDmRjjSBOugICHw2yD4xhKMxd7d64arpc0FqT4ZkO4%2F0tAGooIaHffsXyQ%3D%3D&prvtof=G6Jt%2BknPQGAuccSJ%2BdZsJsAYx80LlMb4FqHg1oO4m4I%3D&poru=%2FY8W7RMxzdi13mW%2BSzhrH9gv1eZwOuY1lT8TeaTpPbeQePjfG3e1HF6sZWenkGnGiZ8hUrqu4I9FIwNpFto8S0aDzmOiMyOX7qTIDyxvwHs%3D&cifr=1&";
	/*
-->
<html><head>
				' - RETRYING
Downloading: http://agilejava.com/maven/com/sun/jai_codec/1.1.3/jai_codec-1.1.3.pom
1K downloaded  (jai_codec-1.1.3.pom)
[WARNING] *** CHECKSUM FAILED - Checksum failed on download: local = 'fee186354debcc1609202d6206c53d3c8074fb4f';
remote = '<!--
	top.location="http://www.seektoexplore.com/?dn=agilejava.com&fp=0Sk%2Bk74e9tiRgCImcGiM8tXdUQ6xmQUjpikDmMAmYN63ICjCacmrV4nlFWi4G9yGkg85ZYIdb8UK9uQnfTsH5Q%3D%3D&prvtof=evGaoZVxVS1YvRpfPcfsIhfBebPWE46bd2SEsj58oZw%3D&poru=Qat27thNsESNkU20%2FsuR2PElU%2BMF9Il2VAqST4QghMvPdrlb2uVIkSL24ZnkDbpVaCnSKgV9sZBjk12c85g6IjSwRSqeqbB8c3xKgkxfOlE%3D&cifr=1&";
	/*
-->
<html><head>
				' - IGNORING
[WARNING] POM for 'com.sun:jai_codec:pom:1.1.3:runtime' is invalid.

Its dependencies (if any) will NOT be available to the current build.
Downloading: http://agilejava.com/maven/com/agilejava/docbkx/docbkx-maven-base/2.0.7/docbkx-maven-base-2.0.7.pom
1K downloaded  (docbkx-maven-base-2.0.7.pom)
[WARNING] *** CHECKSUM FAILED - Checksum failed on download: local = '9fba346ba9a6ae6320b5652d8d111484d3f9f392';
remote = '<!--
	top.location="http://www.seektoexplore.com/?dn=agilejava.com&fp=P4CaD1iW5KeFVAgOhLJnbxQqL1u70q1Sj9O14K1MGdoJNgagTC061FTXKMRMLCUj9s33TR1Uvzj1iijgAxyltg%3D%3D&prvtof=znpoC3fhr%2BOtzKqgXbExlfI8qFxcCxrgaKD4wJ5i%2Fm0%3D&poru=QRLCidFC7sLoV9xB0Ig5wjFRiZ%2BNrXJmwwDmx6%2FzqxMEX1wbP1FCCKesR0WCMclTRtohVWRqGK12q%2Fd5PHpMlgHdGOo30e0WJ5IKEMABHHY%3D&cifr=1&";
	/*
-->
<html><head>
				' - RETRYING
Downloading: http://agilejava.com/maven/com/agilejava/docbkx/docbkx-maven-base/2.0.7/docbkx-maven-base-2.0.7.pom
1K downloaded  (docbkx-maven-base-2.0.7.pom)
[WARNING] *** CHECKSUM FAILED - Checksum failed on download: local = '48716adb3b750741b6ffa3603cd8c9e73b770e2c';
remote = '<!--
	top.location="http://www.seektoexplore.com/?dn=agilejava.com&fp=u7yxsh6Ki7N0ymvYoUhnbGIBTR6x5aH%2BJ4uhlnLRu4e392iGo%2BN%2BnKexMaW5wIDrmY%2BJhusgd0iJ6kaSvNzKPg%3D%3D&prvtof=hzXK5q36rpLf6gBJNXN3b2Jat94R%2BCC2xx9HHsii6iU%3D&poru=3e8ULDNXeYA57fSEeSkZn8rlU7%2Ff5Ro2uaSIl5Dr4CPFiaCedQ%2FWuJ7MhHflKH0MYi68aGPU77C5WFAwtCr0OlXlJ1gHuAUdx5ASEJ5nm5g%3D&cifr=1&";
	/*
-->
<html><head>
				' - IGNORING
[WARNING] POM for 'com.agilejava.docbkx:docbkx-maven-base:pom:2.0.7:runtime' is invalid.

Its dependencies (if any) will NOT be available to the current build.
Downloading: http://agilejava.com/maven/com/agilejava/docbkx/docbkx-maven-base/2.0.7/docbkx-maven-base-2.0.7.jar
Downloading: http://agilejava.com/maven/com/sun/jai_core/1.1.3/jai_core-1.1.3.jar
58b downloaded  (docbkx-maven-base-2.0.7.jar)
58b downloaded  (jai_core-1.1.3.jar)
[WARNING] *** CHECKSUM FAILED - Checksum failed on download: local = '48d628027388ba84af265623c1434a70bffdc175';
remote = '<!--
	top.location="http://www.seektoexplore.com/?dn=agilejava.com&fp=X%2FEnh%2BUqaT133STLMd9W3UoZK%2FoCa8kMqTl%2BlNi3HL%2Bnd3AQaMTvvmt0HovpEwhwI7ghWQNzdr%2Fya%2Bd%2BBE3RTQ%3D%3D&prvtof=Af4oRzC14z5Q5uoEXm5KLjM6Mecdvu7Al%2BNkGnw%2BTYk%3D&poru=LzGNUNCbKUm0%2Ft53hgFTuUhQQMn0yIlWWX15Yt6wp76%2Fm0ASTunJJkfY0fbhEygmthk1OJk8toUXXyhmAwtWModihCEFuY1CDUfuSSxfePY%3D&cifr=1&";
	/*
-->
<html><head>
				' - RETRYING
Downloading: http://agilejava.com/maven/com/agilejava/docbkx/docbkx-maven-base/2.0.7/docbkx-maven-base-2.0.7.jar
[WARNING] *** CHECKSUM FAILED - Checksum failed on download: local = '48d628027388ba84af265623c1434a70bffdc175';
remote = '<!--
	top.location="http://www.seektoexplore.com/?dn=agilejava.com&fp=LNUxWX5lqY95Hrmwh%2BR1VYoFPRfI%2BHSLZ1bkroSMxzB5aUYW3T3jIDase6eBZLd1btaUS62CCBMrMYAF76HaJg%3D%3D&prvtof=0Id2VtWVUnk5GpNUxTXbLRIsXV4cXxshT4Pj77PTEa4%3D&poru=3ohlPFyOCgMQpFl%2FKjrFeSr%2Fcz7nbL7R6I4YDXK3jjHq70%2FxXPPzuu77zfKCkSOT6sVhsx0CYJ%2BA57iQM8ZD0beWF4ozs%2BYgQ3RNOhCOjxA%3D&cifr=1&";
	/*
-->
<html><head>
				' - RETRYING
Downloading: http://agilejava.com/maven/com/sun/jai_core/1.1.3/jai_core-1.1.3.jar
58b downloaded  (docbkx-maven-base-2.0.7.jar)
58b downloaded  (jai_core-1.1.3.jar)
[WARNING] *** CHECKSUM FAILED - Checksum failed on download: local = '48d628027388ba84af265623c1434a70bffdc175';
remote = '<!--
	top.location="http://www.seektoexplore.com/?dn=agilejava.com&fp=4y%2BmvtGWbkYXXsewlXA19M1gyd94yKS1NBhI8jVfulVR%2BWIHYcYtnQ01cRH4ss0fDeJXVVhno992fv473c%2B2zA%3D%3D&prvtof=6J3EeO2YPTQCHSgfdxqceQIrx2zvAbEZfdZ6n3uNP0k%3D&poru=Bretd9J%2BzxSsOaRlIUWccCxF34d91ClNIeWqhQmFR7E%2FLyIS%2F8Q4Dss9mqRwgLj7P3qU8Z%2BrciF5r3ZPN79kzwCenHqvYIw0sKF5sZZAcDo%3D&cifr=1&";
	/*
-->
<html><head>
				' - IGNORING
[WARNING] *** CHECKSUM FAILED - Checksum failed on download: local = '48d628027388ba84af265623c1434a70bffdc175';
remote = '<!--
	top.location="http://www.seektoexplore.com/?dn=agilejava.com&fp=B6rr7PoyBlZ86FBgzhkILvZFhBsOouI2SLbHFi%2F9fwlESj0ude4wKJRSnQTw3OunZ40BNPUeCSRTtjCmZxWg6Q%3D%3D&prvtof=c5kqqIlB5adF%2FgPlmDudDz2%2Bq%2Fh%2B%2BaijEDmZaoZiUrI%3D&poru=%2FsRRxryl2s%2BpqMhTK98CyYUOILkIG8Ja8MFUYgOUZpMIVOYgQlVqZUH%2F1b9zv22KpRZ%2FDE70z%2F5IKbQ3K5XyrFOy8YJw523TxkRsaEuVjHg%3D&cifr=1&";
	/*
-->
<html><head>
				' - IGNORING
Downloading: http://agilejava.com/maven/com/sun/jai_codec/1.1.3/jai_codec-1.1.3.jar
58b downloaded  (jai_codec-1.1.3.jar)
[WARNING] *** CHECKSUM FAILED - Checksum failed on download: local = '48d628027388ba84af265623c1434a70bffdc175';
remote = '<!--
	top.location="http://www.seektoexplore.com/?dn=agilejava.com&fp=jEzkVxelNvN5NrTi3aXK3DJ5QLTiaIVV%2ByZ2Wz0HJnWv2vidE0LdmFNN%2BwRMsY1jM8UipzPpCWBgbnlGsg90lQ%3D%3D&prvtof=nsfwzvo9yQwcBRwamxwMkYgpE4uut3DjbdzFATClAEw%3D&poru=Bvtnt28b0RgDLOAOsqpYzlD2VsjV8JLXIXobE%2BoruOUio%2FJ2zj9uC9u8RR6%2BQZMQOb8uM5OJuNIWsiwN7LhjygMF0pX%2FhCa2%2FgBm3MoF5aA%3D&cifr=1&";
	/*
-->
<html><head>
				' - RETRYING
Downloading: http://agilejava.com/maven/com/sun/jai_codec/1.1.3/jai_codec-1.1.3.jar
58b downloaded  (jai_codec-1.1.3.jar)
[WARNING] *** CHECKSUM FAILED - Checksum failed on download: local = '48d628027388ba84af265623c1434a70bffdc175';
remote = '<!--
	top.location="http://www.seektoexplore.com/?dn=agilejava.com&fp=p8CCmCItpi5lsKzK83c3Oyhu43SzRAfLXYxLWorF0%2B8zNgOkroaagzza2OFkYZ1qa4GcYceGAgGAUNZzjH0lIg%3D%3D&prvtof=RZ2kypzciNcvFRtYFdeiYROmzV4cXqNJfmZnXM%2BRPGQ%3D&poru=CI8AXOY%2B2E4bqqbrRfQ%2FefvKgg1l2EGL0vooeaYd1ps4zSHmlgolUS9LXFdDv4tuNKNOaNS2UZToZx3kcBddv2wErjJTjkNG1ifXjn7OW%2BA%3D&cifr=1&";
	/*
-->
<html><head>
				' - IGNORING
-----------------------------------------------------
this realm = app0.child-container[com.agilejava.docbkx:docbkx-maven-plugin:2.0.7]
urls[0] = file:/home/jenkins/jenkins-slave/maven-repositories/1/com/agilejava/docbkx/docbkx-maven-plugin/2.0.7/docbkx-maven-plugin-2.0.7.jar
urls[1] = file:/home/jenkins/jenkins-slave/maven-repositories/1/org/docbook/docbook-xml/4.4/docbook-xml-4.4.jar
urls[2] = file:/home/jenkins/jenkins-slave/maven-repositories/1/com/sun/jai_core/1.1.3/jai_core-1.1.3.jar
urls[3] = file:/home/jenkins/jenkins-slave/maven-repositories/1/com/sun/jai_codec/1.1.3/jai_codec-1.1.3.jar
urls[4] = file:/home/jenkins/jenkins-slave/maven-repositories/1/xerces/xercesImpl/2.8.0/xercesImpl-2.8.0.jar
urls[5] = file:/home/jenkins/jenkins-slave/maven-repositories/1/xml-apis/xml-apis/1.3.03/xml-apis-1.3.03.jar
urls[6] = file:/home/jenkins/jenkins-slave/maven-repositories/1/xerces/xmlParserAPIs/2.6.2/xmlParserAPIs-2.6.2.jar
urls[7] = file:/home/jenkins/jenkins-slave/maven-repositories/1/fop/fop/0.20.5/fop-0.20.5.jar
urls[8] = file:/home/jenkins/jenkins-slave/maven-repositories/1/batik/batik-1.5-fop/0.20-5/batik-1.5-fop-0.20-5.jar
urls[9] = file:/home/jenkins/jenkins-slave/maven-repositories/1/xalan/xalan/2.4.1/xalan-2.4.1.jar
urls[10] = file:/home/jenkins/jenkins-slave/maven-repositories/1/avalon-framework/avalon-framework/4.1.5/avalon-framework-4.1.5.jar
urls[11] = file:/home/jenkins/jenkins-slave/maven-repositories/1/org/codehaus/plexus/plexus-utils/1.1/plexus-utils-1.1.jar
urls[12] = file:/home/jenkins/jenkins-slave/maven-repositories/1/com/agilejava/docbkx/docbkx-maven-base/2.0.7/docbkx-maven-base-2.0.7.jar
Number of imports: 10
import: org.codehaus.classworlds.Entry@a6c57a42
import: org.codehaus.classworlds.Entry@12f43f3b
import: org.codehaus.classworlds.Entry@20025374
import: org.codehaus.classworlds.Entry@f8e44ca4
import: org.codehaus.classworlds.Entry@92758522
import: org.codehaus.classworlds.Entry@ebf2705b
import: org.codehaus.classworlds.Entry@bb25e54
import: org.codehaus.classworlds.Entry@bece5185
import: org.codehaus.classworlds.Entry@3fee8e37
import: org.codehaus.classworlds.Entry@3fee19d8


this realm = plexus.core.maven
Number of imports: 10
import: org.codehaus.classworlds.Entry@a6c57a42
import: org.codehaus.classworlds.Entry@12f43f3b
import: org.codehaus.classworlds.Entry@20025374
import: org.codehaus.classworlds.Entry@f8e44ca4
import: org.codehaus.classworlds.Entry@92758522
import: org.codehaus.classworlds.Entry@ebf2705b
import: org.codehaus.classworlds.Entry@bb25e54
import: org.codehaus.classworlds.Entry@bece5185
import: org.codehaus.classworlds.Entry@3fee8e37
import: org.codehaus.classworlds.Entry@3fee19d8


this realm = plexus.core
urls[0] = file:/home/jenkins/jenkins-slave/maven2.1-interceptor.jar
urls[1] = file:/home/jenkins/jenkins-slave/maven-interceptor.jar
urls[2] = file:/home/jenkins/tools/maven/apache-maven-2.2.1/lib/maven-2.2.1-uber.jar
Number of imports: 10
import: org.codehaus.classworlds.Entry@a6c57a42
import: org.codehaus.classworlds.Entry@12f43f3b
import: org.codehaus.classworlds.Entry@20025374
import: org.codehaus.classworlds.Entry@f8e44ca4
import: org.codehaus.classworlds.Entry@92758522
import: org.codehaus.classworlds.Entry@ebf2705b
import: org.codehaus.classworlds.Entry@bb25e54
import: org.codehaus.classworlds.Entry@bece5185
import: org.codehaus.classworlds.Entry@3fee8e37
import: org.codehaus.classworlds.Entry@3fee19d8
-----------------------------------------------------
[INFO] ------------------------------------------------------------------------
[ERROR] BUILD ERROR
[INFO] ------------------------------------------------------------------------
[INFO] Internal error in the plugin manager executing goal 'com.agilejava.docbkx:docbkx-maven-plugin:2.0.7:generate-pdf':
Unable to load the mojo 'com.agilejava.docbkx:docbkx-maven-plugin:2.0.7:generate-pdf' in the
plugin 'com.agilejava.docbkx:docbkx-maven-plugin'. A required class is missing: com/agilejava/docbkx/maven/AbstractTransformerMojo
com.agilejava.docbkx.maven.AbstractTransformerMojo
[INFO] ------------------------------------------------------------------------
[INFO] For more information, run Maven with the -e switch
[INFO] ------------------------------------------------------------------------
[INFO] Total time: 17 seconds
[INFO] Finished at: Wed Apr 15 07:18:02 UTC 2015
[INFO] Final Memory: 45M/345M
[INFO] ------------------------------------------------------------------------

Mime
View raw message