openjpa-commits mailing list archives

Site index · List index
Message view « Date » · « Thread »
Top « Date » · « Thread »
From Apache Jenkins Server <jenk...@builds.apache.org>
Subject Build failed in Jenkins: OpenJPA-22x-deploy » OpenJPA Examples - Simple #78
Date Sat, 02 May 2015 07:31:19 GMT
See <https://builds.apache.org/job/OpenJPA-22x-deploy/org.apache.openjpa.openjpa-examples$simple/78/>

------------------------------------------
[INFO] ------------------------------------------------------------------------
[INFO] Building OpenJPA Examples - Simple
[INFO]    task-segment: [clean, deploy]
[INFO] ------------------------------------------------------------------------
[INFO] [clean:clean {execution: default-clean}]
[INFO] Deleting file set: <https://builds.apache.org/job/OpenJPA-22x-deploy/org.apache.openjpa.openjpa-examples$simple/ws/target>
(included: [**], excluded: [])
[INFO] [buildnumber:create {execution: default}]
[INFO] [enforcer:enforce {execution: default}]
[INFO] [checkstyle:checkstyle {execution: default}]
[INFO] Starting audit...
Audit done.

[WARNING] Unable to locate Source XRef to link to - DISABLED
[INFO] [remote-resources:process {execution: default}]
[INFO] [resources:resources {execution: default-resources}]
[INFO] Using 'UTF-8' encoding to copy filtered resources.
[INFO] skip non existing resourceDirectory <https://builds.apache.org/job/OpenJPA-22x-deploy/org.apache.openjpa.openjpa-examples$simple/ws/src/main/resources>
[INFO] Copying 3 resources
[INFO] [compiler:compile {execution: default-compile}]
[INFO] Compiling 12 source files to <https://builds.apache.org/job/OpenJPA-22x-deploy/org.apache.openjpa.openjpa-examples$simple/ws/target/classes>
[INFO] [compiler:testCompile {execution: test-source-compile}]
[INFO] Nothing to compile - all classes are up to date
[INFO] [resources:testResources {execution: default-testResources}]
[INFO] Using 'UTF-8' encoding to copy filtered resources.
[INFO] skip non existing resourceDirectory <https://builds.apache.org/job/OpenJPA-22x-deploy/org.apache.openjpa.openjpa-examples$simple/ws/src/test/resources>
[INFO] Copying 3 resources
[INFO] [compiler:testCompile {execution: default-testCompile}]
[INFO] Nothing to compile - all classes are up to date
[WARNING] DEPRECATED [systemProperties]: Use systemPropertyVariables instead.
[INFO] [surefire:test {execution: default-test}]
[INFO] Surefire report directory: <https://builds.apache.org/job/OpenJPA-22x-deploy/org.apache.openjpa.openjpa-examples$simple/ws/target/surefire-reports>

-------------------------------------------------------
 T E S T S
-------------------------------------------------------
There are no tests to run.

Results :

Tests run: 0, Failures: 0, Errors: 0, Skipped: 0

[JENKINS] Recording test results
[INFO] [jar:jar {execution: default-jar}]
[INFO] Building jar: <https://builds.apache.org/job/OpenJPA-22x-deploy/org.apache.openjpa.openjpa-examples$simple/ws/target/simple-2.2.3-SNAPSHOT.jar>
[INFO] [jar:jar {execution: default-jar}]
[INFO] [jar:test-jar {execution: attach-tests}]
[INFO] Building jar: <https://builds.apache.org/job/OpenJPA-22x-deploy/org.apache.openjpa.openjpa-examples$simple/ws/target/simple-2.2.3-SNAPSHOT-tests.jar>
[INFO] [ianal:verify-legal-files {execution: default}]
[INFO] Checking legal files in: simple-2.2.3-SNAPSHOT.jar
[INFO] Checking legal files in: simple-2.2.3-SNAPSHOT-tests.jar
[INFO] [apache-rat:check {execution: default}]
[INFO] Exclude: **/.*/**
[INFO] Exclude: **/target/**/*
[INFO] [install:install {execution: default-install}]
[INFO] Installing <https://builds.apache.org/job/OpenJPA-22x-deploy/org.apache.openjpa.openjpa-examples$simple/ws/target/simple-2.2.3-SNAPSHOT.jar>
to /home/jenkins/jenkins-slave/maven-repositories/1/org/apache/openjpa/openjpa-examples/simple/2.2.3-SNAPSHOT/simple-2.2.3-SNAPSHOT.jar
[INFO] Installing <https://builds.apache.org/job/OpenJPA-22x-deploy/org.apache.openjpa.openjpa-examples$simple/ws/target/simple-2.2.3-SNAPSHOT-tests.jar>
to /home/jenkins/jenkins-slave/maven-repositories/1/org/apache/openjpa/openjpa-examples/simple/2.2.3-SNAPSHOT/simple-2.2.3-SNAPSHOT-tests.jar
[INFO] [deploy:deploy {execution: default-deploy}]
[INFO] Retrieving previous build number from apache.snapshots.https
[WARNING] *** CHECKSUM FAILED - Checksum failed on download: local = '1ada7762b195af986f084894afd7b38aa30ea722';
remote = '61e1afdec6e4dc25fa46d9592c4d9f4cace60c05' - RETRYING
[WARNING] *** CHECKSUM FAILED - Checksum failed on download: local = '1ada7762b195af986f084894afd7b38aa30ea722';
remote = '61e1afdec6e4dc25fa46d9592c4d9f4cace60c05' - IGNORING
Uploading: https://repository.apache.org/content/repositories/snapshots/org/apache/openjpa/openjpa-examples/simple/2.2.3-SNAPSHOT/simple-2.2.3-20150502.064545-53.jar
21K uploaded  (simple-2.2.3-20150502.064545-53.jar)
[INFO] Uploading project information for simple 2.2.3-20150502.064545-53
[INFO] Retrieving previous metadata from apache.snapshots.https
[WARNING] *** CHECKSUM FAILED - Checksum failed on download: local = '1ada7762b195af986f084894afd7b38aa30ea722';
remote = '61e1afdec6e4dc25fa46d9592c4d9f4cace60c05' - RETRYING
[WARNING] *** CHECKSUM FAILED - Checksum failed on download: local = '1ada7762b195af986f084894afd7b38aa30ea722';
remote = '61e1afdec6e4dc25fa46d9592c4d9f4cace60c05' - IGNORING
[INFO] Uploading repository metadata for: 'snapshot org.apache.openjpa.openjpa-examples:simple:2.2.3-SNAPSHOT'
[INFO] Retrieving previous metadata from apache.snapshots.https
[INFO] ------------------------------------------------------------------------
[ERROR] BUILD ERROR
[INFO] ------------------------------------------------------------------------
[INFO] Error installing artifact's metadata: repository metadata for: 'artifact org.apache.openjpa.openjpa-examples:simple'
could not be retrieved from repository: apache.snapshots.https due to an error: Error transferring
file: Server returned HTTP response code: 502 for URL: https://repository.apache.org/content/repositories/snapshots/org/apache/openjpa/openjpa-examples/simple/maven-metadata.xml.sha1

[INFO] ------------------------------------------------------------------------
[INFO] For more information, run Maven with the -e switch
[INFO] ------------------------------------------------------------------------
[INFO] Total time: 45 minutes 32 seconds
[INFO] Finished at: Sat May 02 07:30:54 UTC 2015
[INFO] Final Memory: 179M/582M
[INFO] ------------------------------------------------------------------------

Mime
View raw message