openjpa-commits mailing list archives

Site index · List index
Message view « Date » · « Thread »
Top « Date » · « Thread »
From Apache Jenkins Server <jenk...@builds.apache.org>
Subject Build failed in Jenkins: OpenJPA-22x-deploy #78
Date Sat, 02 May 2015 07:31:23 GMT
See <https://builds.apache.org/job/OpenJPA-22x-deploy/78/changes>

Changes:

[jgrassel] OPENJPA-2506: Add serialVersionUID to ClassMetaData

------------------------------------------
[...truncated 27437 lines...]
[WARNING] Unable to locate Source XRef to link to - DISABLED
[INFO] [remote-resources:process {execution: default}]
[INFO] [resources:resources {execution: default-resources}]
[INFO] Using 'UTF-8' encoding to copy filtered resources.
[INFO] skip non existing resourceDirectory <https://builds.apache.org/job/OpenJPA-22x-deploy/ws/2.2.x/openjpa-examples/simple/src/main/resources>
[INFO] Copying 3 resources
[INFO] [compiler:compile {execution: default-compile}]
[INFO] Compiling 12 source files to <https://builds.apache.org/job/OpenJPA-22x-deploy/ws/2.2.x/openjpa-examples/simple/target/classes>
[INFO] [compiler:testCompile {execution: test-source-compile}]
[INFO] Nothing to compile - all classes are up to date
[INFO] [resources:testResources {execution: default-testResources}]
[INFO] Using 'UTF-8' encoding to copy filtered resources.
[INFO] skip non existing resourceDirectory <https://builds.apache.org/job/OpenJPA-22x-deploy/ws/2.2.x/openjpa-examples/simple/src/test/resources>
[INFO] Copying 3 resources
[INFO] [compiler:testCompile {execution: default-testCompile}]
[INFO] Nothing to compile - all classes are up to date
[WARNING] DEPRECATED [systemProperties]: Use systemPropertyVariables instead.
[INFO] [surefire:test {execution: default-test}]
[INFO] Surefire report directory: <https://builds.apache.org/job/OpenJPA-22x-deploy/ws/2.2.x/openjpa-examples/simple/target/surefire-reports>

-------------------------------------------------------
 T E S T S
-------------------------------------------------------
There are no tests to run.

Results :

Tests run: 0, Failures: 0, Errors: 0, Skipped: 0

[JENKINS] Recording test results
[INFO] [jar:jar {execution: default-jar}]
[INFO] Building jar: <https://builds.apache.org/job/OpenJPA-22x-deploy/ws/2.2.x/openjpa-examples/simple/target/simple-2.2.3-SNAPSHOT.jar>
[INFO] [jar:jar {execution: default-jar}]
[INFO] [jar:test-jar {execution: attach-tests}]
[INFO] Building jar: <https://builds.apache.org/job/OpenJPA-22x-deploy/ws/2.2.x/openjpa-examples/simple/target/simple-2.2.3-SNAPSHOT-tests.jar>
[INFO] [ianal:verify-legal-files {execution: default}]
[INFO] Checking legal files in: simple-2.2.3-SNAPSHOT.jar
[INFO] Checking legal files in: simple-2.2.3-SNAPSHOT-tests.jar
[INFO] [apache-rat:check {execution: default}]
[INFO] Exclude: **/.*/**
[INFO] Exclude: **/target/**/*
[INFO] [install:install {execution: default-install}]
[INFO] Installing <https://builds.apache.org/job/OpenJPA-22x-deploy/ws/2.2.x/openjpa-examples/simple/target/simple-2.2.3-SNAPSHOT.jar>
to /home/jenkins/jenkins-slave/maven-repositories/1/org/apache/openjpa/openjpa-examples/simple/2.2.3-SNAPSHOT/simple-2.2.3-SNAPSHOT.jar
[INFO] Installing <https://builds.apache.org/job/OpenJPA-22x-deploy/ws/2.2.x/openjpa-examples/simple/target/simple-2.2.3-SNAPSHOT-tests.jar>
to /home/jenkins/jenkins-slave/maven-repositories/1/org/apache/openjpa/openjpa-examples/simple/2.2.3-SNAPSHOT/simple-2.2.3-SNAPSHOT-tests.jar
[INFO] [deploy:deploy {execution: default-deploy}]
[INFO] Retrieving previous build number from apache.snapshots.https
[WARNING] *** CHECKSUM FAILED - Checksum failed on download: local = '1ada7762b195af986f084894afd7b38aa30ea722';
remote = '61e1afdec6e4dc25fa46d9592c4d9f4cace60c05' - RETRYING
[WARNING] *** CHECKSUM FAILED - Checksum failed on download: local = '1ada7762b195af986f084894afd7b38aa30ea722';
remote = '61e1afdec6e4dc25fa46d9592c4d9f4cace60c05' - IGNORING
Uploading: https://repository.apache.org/content/repositories/snapshots/org/apache/openjpa/openjpa-examples/simple/2.2.3-SNAPSHOT/simple-2.2.3-20150502.064545-53.jar
21K uploaded  (simple-2.2.3-20150502.064545-53.jar)
[INFO] Uploading project information for simple 2.2.3-20150502.064545-53
[INFO] Retrieving previous metadata from apache.snapshots.https
[WARNING] *** CHECKSUM FAILED - Checksum failed on download: local = '1ada7762b195af986f084894afd7b38aa30ea722';
remote = '61e1afdec6e4dc25fa46d9592c4d9f4cace60c05' - RETRYING
[WARNING] *** CHECKSUM FAILED - Checksum failed on download: local = '1ada7762b195af986f084894afd7b38aa30ea722';
remote = '61e1afdec6e4dc25fa46d9592c4d9f4cace60c05' - IGNORING
[INFO] Uploading repository metadata for: 'snapshot org.apache.openjpa.openjpa-examples:simple:2.2.3-SNAPSHOT'
[INFO] Retrieving previous metadata from apache.snapshots.https
[INFO] ------------------------------------------------------------------------
[ERROR] BUILD ERROR
[INFO] ------------------------------------------------------------------------
[INFO] Error installing artifact's metadata: repository metadata for: 'artifact org.apache.openjpa.openjpa-examples:simple'
could not be retrieved from repository: apache.snapshots.https due to an error: Error transferring
file: Server returned HTTP response code: 502 for URL: https://repository.apache.org/content/repositories/snapshots/org/apache/openjpa/openjpa-examples/simple/maven-metadata.xml.sha1

[INFO] ------------------------------------------------------------------------
[INFO] For more information, run Maven with the -e switch
[INFO] ------------------------------------------------------------------------
[INFO] Total time: 45 minutes 32 seconds
[INFO] Finished at: Sat May 02 07:30:54 UTC 2015
[INFO] Final Memory: 179M/582M
[INFO] ------------------------------------------------------------------------
[JENKINS] Archiving <https://builds.apache.org/job/OpenJPA-22x-deploy/ws/2.2.x/openjpa/dependency-reduced-pom.xml>
to org.apache.openjpa/openjpa/2.2.3-SNAPSHOT/openjpa-2.2.3-SNAPSHOT.pom
[JENKINS] Archiving <https://builds.apache.org/job/OpenJPA-22x-deploy/ws/2.2.x/openjpa/target/openjpa-2.2.3-SNAPSHOT.jar>
to org.apache.openjpa/openjpa/2.2.3-20150502.064545-53/openjpa-2.2.3-20150502.064545-53.jar
Sending artifact delta relative to OpenJPA-22x-deploy » OpenJPA Aggregate Jar #76
Archived 2 artifacts
Archive block size is 32768
Received 4 blocks and 4558044 bytes
Compression is 2.8%
Took 2.6 sec
[JENKINS] Archiving <https://builds.apache.org/job/OpenJPA-22x-deploy/ws/2.2.x/openjpa-lib/pom.xml>
to org.apache.openjpa/openjpa-lib/2.2.3-SNAPSHOT/openjpa-lib-2.2.3-SNAPSHOT.pom
[JENKINS] Archiving <https://builds.apache.org/job/OpenJPA-22x-deploy/ws/2.2.x/openjpa-lib/target/openjpa-lib-2.2.3-SNAPSHOT.jar>
to org.apache.openjpa/openjpa-lib/2.2.3-20150502.064545-57/openjpa-lib-2.2.3-20150502.064545-57.jar
[JENKINS] Archiving <https://builds.apache.org/job/OpenJPA-22x-deploy/ws/2.2.x/openjpa-lib/target/openjpa-lib-2.2.3-SNAPSHOT-tests.jar>
to org.apache.openjpa/openjpa-lib/2.2.3-20150502.064545-57/openjpa-lib-2.2.3-20150502.064545-57-tests.jar
Sending artifact delta relative to OpenJPA-22x-deploy » OpenJPA Utilities Library #77
Archived 3 artifacts
Archive block size is 32768
Received 0 blocks and 582478 bytes
Compression is 0.0%
Took 0.35 sec
[JENKINS] Archiving <https://builds.apache.org/job/OpenJPA-22x-deploy/ws/2.2.x/openjpa-all/dependency-reduced-pom.xml>
to org.apache.openjpa/openjpa-all/2.2.3-SNAPSHOT/openjpa-all-2.2.3-SNAPSHOT.pom
[JENKINS] Archiving <https://builds.apache.org/job/OpenJPA-22x-deploy/ws/2.2.x/openjpa-all/target/openjpa-all-2.2.3-SNAPSHOT.jar>
to org.apache.openjpa/openjpa-all/2.2.3-20150502.064545-53/openjpa-all-2.2.3-20150502.064545-53.jar
[JENKINS] Archiving <https://builds.apache.org/job/OpenJPA-22x-deploy/ws/2.2.x/openjpa-all/target/openjpa-all-2.2.3-SNAPSHOT-tests.jar>
to org.apache.openjpa/openjpa-all/2.2.3-20150502.064545-53/openjpa-all-2.2.3-20150502.064545-53-tests.jar
Sending artifact delta relative to OpenJPA-22x-deploy » OpenJPA Aggregate Jar with Dependencies
#76
Archived 3 artifacts
Archive block size is 32768
Received 4 blocks and 6717290 bytes
Compression is 1.9%
Took 2.8 sec
[JENKINS] Archiving <https://builds.apache.org/job/OpenJPA-22x-deploy/ws/2.2.x/openjpa-kernel/pom.xml>
to org.apache.openjpa/openjpa-kernel/2.2.3-SNAPSHOT/openjpa-kernel-2.2.3-SNAPSHOT.pom
[JENKINS] Archiving <https://builds.apache.org/job/OpenJPA-22x-deploy/ws/2.2.x/openjpa-kernel/target/openjpa-kernel-2.2.3-SNAPSHOT.jar>
to org.apache.openjpa/openjpa-kernel/2.2.3-20150502.064545-57/openjpa-kernel-2.2.3-20150502.064545-57.jar
[JENKINS] Archiving <https://builds.apache.org/job/OpenJPA-22x-deploy/ws/2.2.x/openjpa-kernel/target/openjpa-kernel-2.2.3-SNAPSHOT-tests.jar>
to org.apache.openjpa/openjpa-kernel/2.2.3-20150502.064545-57/openjpa-kernel-2.2.3-20150502.064545-57-tests.jar
Sending artifact delta relative to OpenJPA-22x-deploy » OpenJPA Kernel #77
Archived 3 artifacts
Archive block size is 32768
Received 2 blocks and 1450406 bytes
Compression is 4.3%
Took 0.85 sec
[JENKINS] Archiving <https://builds.apache.org/job/OpenJPA-22x-deploy/ws/2.2.x/openjpa-examples/pom.xml>
to org.apache.openjpa/openjpa-examples/2.2.3-SNAPSHOT/openjpa-examples-2.2.3-SNAPSHOT.pom
[JENKINS] Archiving /home/jenkins/jenkins-slave/maven-repositories/1/org/apache/openjpa/openjpa-examples/2.2.3-SNAPSHOT/openjpa-examples-2.2.3-SNAPSHOT.pom
to org.apache.openjpa/openjpa-examples/2.2.3-20150502.064545-53/openjpa-examples-2.2.3-20150502.064545-53.pom
/home/jenkins/jenkins-slave/maven-repositories/1/org/apache/openjpa/openjpa-examples/2.2.3-SNAPSHOT/openjpa-examples-2.2.3-SNAPSHOT.pom
is not inside <https://builds.apache.org/job/OpenJPA-22x-deploy/ws/2.2.x/openjpa-examples/;>
will archive in a separate pass
Sending artifact delta relative to OpenJPA-22x-deploy » OpenJPA Examples #76
Archived 1 artifacts
Archive block size is 32768
Received 0 blocks and 3079 bytes
Compression is 0.0%
Took 76 ms
Sending artifact delta relative to OpenJPA-22x-deploy » OpenJPA Examples #76
Archived 1 artifacts
Archive block size is 32768
Received 0 blocks and 3099 bytes
Compression is 0.0%
Took 28 ms
[JENKINS] Archiving <https://builds.apache.org/job/OpenJPA-22x-deploy/ws/2.2.x/openjpa-persistence-jdbc/pom.xml>
to org.apache.openjpa/openjpa-persistence-jdbc/2.2.3-SNAPSHOT/openjpa-persistence-jdbc-2.2.3-SNAPSHOT.pom
[JENKINS] Archiving <https://builds.apache.org/job/OpenJPA-22x-deploy/ws/2.2.x/openjpa-persistence-jdbc/target/openjpa-persistence-jdbc-2.2.3-SNAPSHOT.jar>
to org.apache.openjpa/openjpa-persistence-jdbc/2.2.3-20150502.064545-55/openjpa-persistence-jdbc-2.2.3-20150502.064545-55.jar
[JENKINS] Archiving <https://builds.apache.org/job/OpenJPA-22x-deploy/ws/2.2.x/openjpa-persistence-jdbc/target/openjpa-persistence-jdbc-2.2.3-SNAPSHOT-tests.jar>
to org.apache.openjpa/openjpa-persistence-jdbc/2.2.3-20150502.064545-55/openjpa-persistence-jdbc-2.2.3-20150502.064545-55-tests.jar
Sending artifact delta relative to OpenJPA-22x-deploy » OpenJPA Persistence JDBC #77
Archived 3 artifacts
Archive block size is 32768
Received 1 blocks and 8565423 bytes
Compression is 0.4%
Took 3.3 sec
[JENKINS] Archiving <https://builds.apache.org/job/OpenJPA-22x-deploy/ws/2.2.x/pom.xml>
to org.apache.openjpa/openjpa-parent/2.2.3-SNAPSHOT/openjpa-parent-2.2.3-SNAPSHOT.pom
[JENKINS] Archiving /home/jenkins/jenkins-slave/maven-repositories/1/org/apache/openjpa/openjpa-parent/2.2.3-SNAPSHOT/openjpa-parent-2.2.3-SNAPSHOT.pom
to org.apache.openjpa/openjpa-parent/2.2.3-20150502.064545-57/openjpa-parent-2.2.3-20150502.064545-57.pom
/home/jenkins/jenkins-slave/maven-repositories/1/org/apache/openjpa/openjpa-parent/2.2.3-SNAPSHOT/openjpa-parent-2.2.3-SNAPSHOT.pom
is not inside <https://builds.apache.org/job/OpenJPA-22x-deploy/ws/2.2.x/;> will archive
in a separate pass
Sending artifact delta relative to OpenJPA-22x-deploy » OpenJPA Parent POM #77
Archived 1 artifacts
Archive block size is 32768
Received 1 blocks and 21272 bytes
Compression is 60.6%
Took 0.23 sec
Sending artifact delta relative to OpenJPA-22x-deploy » OpenJPA Parent POM #77
Archived 1 artifacts
Archive block size is 32768
Received 1 blocks and 21292 bytes
Compression is 60.6%
Took 37 ms
[JENKINS] Archiving <https://builds.apache.org/job/OpenJPA-22x-deploy/ws/2.2.x/openjpa-slice/pom.xml>
to org.apache.openjpa/openjpa-slice/2.2.3-SNAPSHOT/openjpa-slice-2.2.3-SNAPSHOT.pom
[JENKINS] Archiving <https://builds.apache.org/job/OpenJPA-22x-deploy/ws/2.2.x/openjpa-slice/target/openjpa-slice-2.2.3-SNAPSHOT.jar>
to org.apache.openjpa/openjpa-slice/2.2.3-20150502.064545-53/openjpa-slice-2.2.3-20150502.064545-53.jar
[JENKINS] Archiving <https://builds.apache.org/job/OpenJPA-22x-deploy/ws/2.2.x/openjpa-slice/target/openjpa-slice-2.2.3-SNAPSHOT-tests.jar>
to org.apache.openjpa/openjpa-slice/2.2.3-20150502.064545-53/openjpa-slice-2.2.3-20150502.064545-53-tests.jar
Sending artifact delta relative to OpenJPA-22x-deploy » OpenJPA Slice #76
Archived 3 artifacts
Archive block size is 32768
Received 0 blocks and 187976 bytes
Compression is 0.0%
Took 0.34 sec
[JENKINS] Archiving <https://builds.apache.org/job/OpenJPA-22x-deploy/ws/2.2.x/openjpa-xmlstore/pom.xml>
to org.apache.openjpa/openjpa-xmlstore/2.2.3-SNAPSHOT/openjpa-xmlstore-2.2.3-SNAPSHOT.pom
[JENKINS] Archiving <https://builds.apache.org/job/OpenJPA-22x-deploy/ws/2.2.x/openjpa-xmlstore/target/openjpa-xmlstore-2.2.3-SNAPSHOT.jar>
to org.apache.openjpa/openjpa-xmlstore/2.2.3-20150502.064545-53/openjpa-xmlstore-2.2.3-20150502.064545-53.jar
[JENKINS] Archiving <https://builds.apache.org/job/OpenJPA-22x-deploy/ws/2.2.x/openjpa-xmlstore/target/openjpa-xmlstore-2.2.3-SNAPSHOT-tests.jar>
to org.apache.openjpa/openjpa-xmlstore/2.2.3-20150502.064545-53/openjpa-xmlstore-2.2.3-20150502.064545-53-tests.jar
Sending artifact delta relative to OpenJPA-22x-deploy » OpenJPA XML Store #76
Archived 3 artifacts
Archive block size is 32768
Received 0 blocks and 112500 bytes
Compression is 0.0%
Took 0.33 sec
[JENKINS] Archiving <https://builds.apache.org/job/OpenJPA-22x-deploy/ws/2.2.x/openjpa-tools/pom.xml>
to org.apache.openjpa/openjpa-tools/2.2.3-SNAPSHOT/openjpa-tools-2.2.3-SNAPSHOT.pom
[JENKINS] Archiving /home/jenkins/jenkins-slave/maven-repositories/1/org/apache/openjpa/openjpa-tools/2.2.3-SNAPSHOT/openjpa-tools-2.2.3-SNAPSHOT.pom
to org.apache.openjpa/openjpa-tools/2.2.3-20150502.064545-55/openjpa-tools-2.2.3-20150502.064545-55.pom
/home/jenkins/jenkins-slave/maven-repositories/1/org/apache/openjpa/openjpa-tools/2.2.3-SNAPSHOT/openjpa-tools-2.2.3-SNAPSHOT.pom
is not inside <https://builds.apache.org/job/OpenJPA-22x-deploy/ws/2.2.x/openjpa-tools/;>
will archive in a separate pass
Sending artifact delta relative to OpenJPA-22x-deploy » OpenJPA tools #77
Archived 1 artifacts
Archive block size is 32768
Received 0 blocks and 2163 bytes
Compression is 0.0%
Took 78 ms
Sending artifact delta relative to OpenJPA-22x-deploy » OpenJPA tools #77
Archived 1 artifacts
Archive block size is 32768
Received 0 blocks and 2183 bytes
Compression is 0.0%
Took 27 ms
[JENKINS] Archiving <https://builds.apache.org/job/OpenJPA-22x-deploy/ws/2.2.x/openjpa-tools/openjpa-maven-plugin/pom.xml>
to org.apache.openjpa/openjpa-maven-plugin/2.2.3-SNAPSHOT/openjpa-maven-plugin-2.2.3-SNAPSHOT.pom
[JENKINS] Archiving <https://builds.apache.org/job/OpenJPA-22x-deploy/ws/2.2.x/openjpa-tools/openjpa-maven-plugin/target/openjpa-maven-plugin-2.2.3-SNAPSHOT.jar>
to org.apache.openjpa/openjpa-maven-plugin/2.2.3-20150502.064545-55/openjpa-maven-plugin-2.2.3-20150502.064545-55.jar
[JENKINS] Archiving <https://builds.apache.org/job/OpenJPA-22x-deploy/ws/2.2.x/openjpa-tools/openjpa-maven-plugin/target/openjpa-maven-plugin-2.2.3-SNAPSHOT-tests.jar>
to org.apache.openjpa/openjpa-maven-plugin/2.2.3-20150502.064545-55/openjpa-maven-plugin-2.2.3-20150502.064545-55-tests.jar
Sending artifact delta relative to OpenJPA-22x-deploy » OpenJPA Maven Plugin #77
Archived 3 artifacts
Archive block size is 32768
Received 0 blocks and 52421 bytes
Compression is 0.0%
Took 0.14 sec
[JENKINS] Archiving <https://builds.apache.org/job/OpenJPA-22x-deploy/ws/2.2.x/openjpa-examples/simple/pom.xml>
to org.apache.openjpa.openjpa-examples/simple/2.2.3-SNAPSHOT/simple-2.2.3-SNAPSHOT.pom
[JENKINS] Archiving <https://builds.apache.org/job/OpenJPA-22x-deploy/ws/2.2.x/openjpa-examples/simple/target/simple-2.2.3-SNAPSHOT.jar>
to org.apache.openjpa.openjpa-examples/simple/2.2.3-20150502.064545-53/simple-2.2.3-20150502.064545-53.jar
[JENKINS] Archiving <https://builds.apache.org/job/OpenJPA-22x-deploy/ws/2.2.x/openjpa-examples/simple/target/simple-2.2.3-SNAPSHOT-tests.jar>
to org.apache.openjpa.openjpa-examples/simple/2.2.3-20150502.064545-53/simple-2.2.3-20150502.064545-53-tests.jar
Sending artifact delta relative to OpenJPA-22x-deploy » OpenJPA Examples - Simple #76
Archived 3 artifacts
Archive block size is 32768
Received 0 blocks and 32087 bytes
Compression is 0.0%
Took 0.1 sec
[JENKINS] Archiving <https://builds.apache.org/job/OpenJPA-22x-deploy/ws/2.2.x/openjpa-persistence-locking/pom.xml>
to org.apache.openjpa/openjpa-persistence-locking/2.2.3-SNAPSHOT/openjpa-persistence-locking-2.2.3-SNAPSHOT.pom
[JENKINS] Archiving <https://builds.apache.org/job/OpenJPA-22x-deploy/ws/2.2.x/openjpa-persistence-locking/target/openjpa-persistence-locking-2.2.3-SNAPSHOT.jar>
to org.apache.openjpa/openjpa-persistence-locking/2.2.3-20150502.064545-55/openjpa-persistence-locking-2.2.3-20150502.064545-55.jar
[JENKINS] Archiving <https://builds.apache.org/job/OpenJPA-22x-deploy/ws/2.2.x/openjpa-persistence-locking/target/openjpa-persistence-locking-2.2.3-SNAPSHOT-tests.jar>
to org.apache.openjpa/openjpa-persistence-locking/2.2.3-20150502.064545-55/openjpa-persistence-locking-2.2.3-20150502.064545-55-tests.jar
Sending artifact delta relative to OpenJPA-22x-deploy » OpenJPA Persistence Locking Tests
#77
Archived 3 artifacts
Archive block size is 32768
Received 0 blocks and 349340 bytes
Compression is 0.0%
Took 0.2 sec
[JENKINS] Archiving <https://builds.apache.org/job/OpenJPA-22x-deploy/ws/2.2.x/openjpa-persistence/pom.xml>
to org.apache.openjpa/openjpa-persistence/2.2.3-SNAPSHOT/openjpa-persistence-2.2.3-SNAPSHOT.pom
[JENKINS] Archiving <https://builds.apache.org/job/OpenJPA-22x-deploy/ws/2.2.x/openjpa-persistence/target/openjpa-persistence-2.2.3-SNAPSHOT.jar>
to org.apache.openjpa/openjpa-persistence/2.2.3-20150502.064545-56/openjpa-persistence-2.2.3-20150502.064545-56.jar
[JENKINS] Archiving <https://builds.apache.org/job/OpenJPA-22x-deploy/ws/2.2.x/openjpa-persistence/target/openjpa-persistence-2.2.3-SNAPSHOT-tests.jar>
to org.apache.openjpa/openjpa-persistence/2.2.3-20150502.064545-56/openjpa-persistence-2.2.3-20150502.064545-56-tests.jar
Sending artifact delta relative to OpenJPA-22x-deploy » OpenJPA Persistence #77
Archived 3 artifacts
Archive block size is 32768
Received 0 blocks and 861886 bytes
Compression is 0.0%
Took 0.39 sec
[JENKINS] Archiving <https://builds.apache.org/job/OpenJPA-22x-deploy/ws/2.2.x/openjpa-project/pom.xml>
to org.apache.openjpa/apache-openjpa/2.2.3-SNAPSHOT/apache-openjpa-2.2.3-SNAPSHOT.pom
[JENKINS] Archiving /home/jenkins/jenkins-slave/maven-repositories/1/org/apache/openjpa/apache-openjpa/2.2.3-SNAPSHOT/apache-openjpa-2.2.3-SNAPSHOT.pom
to org.apache.openjpa/apache-openjpa/2.2.3-20150502.064545-53/apache-openjpa-2.2.3-20150502.064545-53.pom
[JENKINS] Archiving <https://builds.apache.org/job/OpenJPA-22x-deploy/ws/2.2.x/openjpa-project/target/site/downloads/apache-openjpa-2.2.3-SNAPSHOT-binary.zip>
to org.apache.openjpa/apache-openjpa/2.2.3-20150502.064545-53/apache-openjpa-2.2.3-20150502.064545-53-binary.zip
[JENKINS] Archiving <https://builds.apache.org/job/OpenJPA-22x-deploy/ws/2.2.x/openjpa-project/target/site/downloads/apache-openjpa-2.2.3-SNAPSHOT-source.zip>
to org.apache.openjpa/apache-openjpa/2.2.3-20150502.064545-53/apache-openjpa-2.2.3-20150502.064545-53-source.zip
/home/jenkins/jenkins-slave/maven-repositories/1/org/apache/openjpa/apache-openjpa/2.2.3-SNAPSHOT/apache-openjpa-2.2.3-SNAPSHOT.pom
is not inside <https://builds.apache.org/job/OpenJPA-22x-deploy/ws/2.2.x/openjpa-project/;>
will archive in a separate pass
Sending artifact delta relative to OpenJPA-22x-deploy » OpenJPA Project Docs and Assemblies
#76
Archived 3 artifacts
Archive block size is 32768
Received 485 blocks and 12428750 bytes
Compression is 56.1%
Took 7.8 sec
Sending artifact delta relative to OpenJPA-22x-deploy » OpenJPA Project Docs and Assemblies
#76
Archived 1 artifacts
Archive block size is 32768
Received 0 blocks and 22098 bytes
Compression is 0.0%
Took 0.43 sec
[JENKINS] Archiving <https://builds.apache.org/job/OpenJPA-22x-deploy/ws/2.2.x/openjpa-jest/pom.xml>
to org.apache.openjpa/openjpa-jest/2.2.3-SNAPSHOT/openjpa-jest-2.2.3-SNAPSHOT.pom
[JENKINS] Archiving <https://builds.apache.org/job/OpenJPA-22x-deploy/ws/2.2.x/openjpa-jest/target/openjpa-jest-2.2.3-SNAPSHOT.jar>
to org.apache.openjpa/openjpa-jest/2.2.3-20150502.064545-53/openjpa-jest-2.2.3-20150502.064545-53.jar
[JENKINS] Archiving <https://builds.apache.org/job/OpenJPA-22x-deploy/ws/2.2.x/openjpa-jest/target/openjpa-jest-2.2.3-SNAPSHOT-tests.jar>
to org.apache.openjpa/openjpa-jest/2.2.3-20150502.064545-53/openjpa-jest-2.2.3-20150502.064545-53-tests.jar
Sending artifact delta relative to OpenJPA-22x-deploy » OpenJPA JEST #76
Archived 3 artifacts
Archive block size is 32768
Received 1 blocks and 213376 bytes
Compression is 13.3%
Took 0.18 sec
[JENKINS] Archiving <https://builds.apache.org/job/OpenJPA-22x-deploy/ws/2.2.x/openjpa-jdbc/pom.xml>
to org.apache.openjpa/openjpa-jdbc/2.2.3-SNAPSHOT/openjpa-jdbc-2.2.3-SNAPSHOT.pom
[JENKINS] Archiving <https://builds.apache.org/job/OpenJPA-22x-deploy/ws/2.2.x/openjpa-jdbc/target/openjpa-jdbc-2.2.3-SNAPSHOT.jar>
to org.apache.openjpa/openjpa-jdbc/2.2.3-20150502.064545-56/openjpa-jdbc-2.2.3-20150502.064545-56.jar
[JENKINS] Archiving <https://builds.apache.org/job/OpenJPA-22x-deploy/ws/2.2.x/openjpa-jdbc/target/openjpa-jdbc-2.2.3-SNAPSHOT-tests.jar>
to org.apache.openjpa/openjpa-jdbc/2.2.3-20150502.064545-56/openjpa-jdbc-2.2.3-20150502.064545-56-tests.jar
Sending artifact delta relative to OpenJPA-22x-deploy » OpenJPA JDBC #77
Archived 3 artifacts
Archive block size is 32768
Received 1 blocks and 1444801 bytes
Compression is 2.2%
Took 0.78 sec
Sending e-mails to: commits@openjpa.apache.org
Sending e-mails to: commits@openjpa.apache.org
channel stopped

Mime
View raw message