openjpa-commits mailing list archives

Site index · List index
Message view « Date » · « Thread »
Top « Date » · « Thread »
From Apache Jenkins Server <jenk...@builds.apache.org>
Subject Build failed in Jenkins: OpenJPA-trunk-deploy #482
Date Thu, 04 Jun 2015 08:59:11 GMT
See <https://builds.apache.org/job/OpenJPA-trunk-deploy/482/>

------------------------------------------
[...truncated 6299 lines...]
[INFO] 
[INFO] --- maven-deploy-plugin:2.8.2:deploy (default-deploy) @ openjpa-parent ---
[INFO] Downloading: https://repository.apache.org/content/repositories/snapshots/org/apache/openjpa/openjpa-parent/2.4.1-SNAPSHOT/maven-metadata.xml
[INFO] Downloaded: https://repository.apache.org/content/repositories/snapshots/org/apache/openjpa/openjpa-parent/2.4.1-SNAPSHOT/maven-metadata.xml
(368 B at 0.3 KB/sec)
[INFO] Uploading: https://repository.apache.org/content/repositories/snapshots/org/apache/openjpa/openjpa-parent/2.4.1-SNAPSHOT/openjpa-parent-2.4.1-20150604.085746-7.pom
[INFO] ------------------------------------------------------------------------
[INFO] Reactor Summary:
[INFO] 
[INFO] OpenJPA Parent POM ................................. FAILURE [01:15 min]
[INFO] OpenJPA Utilities Library .......................... SKIPPED
[INFO] OpenJPA Kernel ..................................... SKIPPED
[INFO] OpenJPA JDBC ....................................... SKIPPED
[INFO] OpenJPA Persistence ................................ SKIPPED
[INFO] OpenJPA Persistence JDBC ........................... SKIPPED
[INFO] OpenJPA Persistence Locking Tests .................. SKIPPED
[INFO] OpenJPA tools ...................................... SKIPPED
[INFO] OpenJPA Maven Plugin ............................... SKIPPED
[INFO] OpenJPA XML Store .................................. SKIPPED
[INFO] OpenJPA Slice ...................................... SKIPPED
[INFO] OpenJPA JEST ....................................... SKIPPED
[INFO] OpenJPA Aggregate Jar .............................. SKIPPED
[INFO] OpenJPA Aggregate Jar with Dependencies ............ SKIPPED
[INFO] OpenJPA Project Docs and Assemblies ................ SKIPPED
[INFO] OpenJPA Examples ................................... SKIPPED
[INFO] OpenJPA Examples - Simple .......................... SKIPPED
[INFO] OpenJPA Examples - image-gallery ................... SKIPPED
[INFO] OpenJPA Examples - OpenBooks ....................... SKIPPED
[INFO] OpenJPA Integration Tests .......................... SKIPPED
[INFO] OpenJPA Integration Tests - Daytrader .............. SKIPPED
[INFO] OpenJPA Integration Tests - Examples ............... SKIPPED
[INFO] OpenJPA Integration Tests - SLF4JLogFactory ........ SKIPPED
[INFO] OpenJPA Integration Tests - JPA TCK ................ SKIPPED
[INFO] OpenJPA Integration Tests - Bean Validation ........ SKIPPED
[INFO] OpenJPA Integration Tests - JMX Platform MBeans .... SKIPPED
[INFO] OpenJPA Fetching Statistic Tool .................... SKIPPED
[INFO] OpenJPA Fetching Statistic Tool -- WAS Bundle ...... SKIPPED
[INFO] ------------------------------------------------------------------------
[INFO] BUILD FAILURE
[INFO] ------------------------------------------------------------------------
[INFO] Total time: 01:22 min
[INFO] Finished at: 2015-06-04T08:58:51+00:00
[INFO] Final Memory: 40M/436M
[INFO] ------------------------------------------------------------------------
[ERROR] Failed to execute goal org.apache.maven.plugins:maven-deploy-plugin:2.8.2:deploy (default-deploy)
on project openjpa-parent: Failed to deploy artifacts: Could not transfer artifact org.apache.openjpa:openjpa-parent:pom:2.4.1-20150604.085746-7
from/to apache.snapshots.https (https://repository.apache.org/content/repositories/snapshots):
Failed to transfer file: https://repository.apache.org/content/repositories/snapshots/org/apache/openjpa/openjpa-parent/2.4.1-SNAPSHOT/openjpa-parent-2.4.1-20150604.085746-7.pom.
Return code is: 502, ReasonPhrase: Proxy Error. -> [Help 1]
[ERROR] 
[ERROR] To see the full stack trace of the errors, re-run Maven with the -e switch.
[ERROR] Re-run Maven using the -X switch to enable full debug logging.
[ERROR] 
[ERROR] For more information about the errors and possible solutions, please read the following
articles:
[ERROR] [Help 1] http://cwiki.apache.org/confluence/display/MAVEN/MojoExecutionException
[JENKINS] Archiving <https://builds.apache.org/job/OpenJPA-trunk-deploy/ws/trunk/openjpa/pom.xml>
to org.apache.openjpa/openjpa/2.4.1-SNAPSHOT/openjpa-2.4.1-SNAPSHOT.pom
Sending artifact delta relative to OpenJPA-trunk-deploy » OpenJPA Aggregate Jar #479
Archived 1 artifacts
Archive block size is 32768
Received 0 blocks and 10659 bytes
Compression is 0.0%
Took 1.2 sec
[JENKINS] Archiving <https://builds.apache.org/job/OpenJPA-trunk-deploy/ws/trunk/openjpa-lib/pom.xml>
to org.apache.openjpa/openjpa-lib/2.4.1-SNAPSHOT/openjpa-lib-2.4.1-SNAPSHOT.pom
Sending artifact delta relative to OpenJPA-trunk-deploy » OpenJPA Utilities Library #481
Archived 1 artifacts
Archive block size is 32768
Received 0 blocks and 6570 bytes
Compression is 0.0%
Took 0.38 sec
[JENKINS] Archiving <https://builds.apache.org/job/OpenJPA-trunk-deploy/ws/trunk/openjpa-all/pom.xml>
to org.apache.openjpa/openjpa-all/2.4.1-SNAPSHOT/openjpa-all-2.4.1-SNAPSHOT.pom
Sending artifact delta relative to OpenJPA-trunk-deploy » OpenJPA Aggregate Jar with Dependencies
#479
Archived 1 artifacts
Archive block size is 32768
Received 0 blocks and 7092 bytes
Compression is 0.0%
Took 1.5 sec
[JENKINS] Archiving <https://builds.apache.org/job/OpenJPA-trunk-deploy/ws/trunk/openjpa-kernel/pom.xml>
to org.apache.openjpa/openjpa-kernel/2.4.1-SNAPSHOT/openjpa-kernel-2.4.1-SNAPSHOT.pom
Sending artifact delta relative to OpenJPA-trunk-deploy » OpenJPA Kernel #481
Archived 1 artifacts
Archive block size is 32768
Received 0 blocks and 7203 bytes
Compression is 0.0%
Took 0.37 sec
[JENKINS] Archiving <https://builds.apache.org/job/OpenJPA-trunk-deploy/ws/trunk/openjpa-integration/tck/pom.xml>
to org.apache.openjpa/openjpa-integration-tck/2.4.1-SNAPSHOT/openjpa-integration-tck-2.4.1-SNAPSHOT.pom
Sending artifact delta relative to OpenJPA-trunk-deploy » OpenJPA Integration Tests - JPA
TCK #477
Archived 1 artifacts
Archive block size is 32768
Received 0 blocks and 26355 bytes
Compression is 0.0%
Took 74 ms
[JENKINS] Archiving <https://builds.apache.org/job/OpenJPA-trunk-deploy/ws/trunk/openjpa-examples/pom.xml>
to org.apache.openjpa/openjpa-examples/2.4.1-SNAPSHOT/openjpa-examples-2.4.1-SNAPSHOT.pom
Sending artifact delta relative to OpenJPA-trunk-deploy » OpenJPA Examples #479
Archived 1 artifacts
Archive block size is 32768
Received 0 blocks and 3079 bytes
Compression is 0.0%
Took 76 ms
[JENKINS] Archiving <https://builds.apache.org/job/OpenJPA-trunk-deploy/ws/trunk/openjpa-persistence-jdbc/pom.xml>
to org.apache.openjpa/openjpa-persistence-jdbc/2.4.1-SNAPSHOT/openjpa-persistence-jdbc-2.4.1-SNAPSHOT.pom
Sending artifact delta relative to OpenJPA-trunk-deploy » OpenJPA Persistence JDBC #479
Archived 1 artifacts
Archive block size is 32768
Received 0 blocks and 59627 bytes
Compression is 0.0%
Took 1.1 sec
[JENKINS] Archiving <https://builds.apache.org/job/OpenJPA-trunk-deploy/ws/trunk/pom.xml>
to org.apache.openjpa/openjpa-parent/2.4.1-SNAPSHOT/openjpa-parent-2.4.1-SNAPSHOT.pom
[JENKINS] Archiving <https://builds.apache.org/job/OpenJPA-trunk-deploy/ws/trunk/target/openjpa-parent-2.4.1-SNAPSHOT-site.xml>
to org.apache.openjpa/openjpa-parent/2.4.1-SNAPSHOT/openjpa-parent-2.4.1-SNAPSHOT-site.xml
Sending artifact delta relative to OpenJPA-trunk-deploy » OpenJPA Parent POM #481
Archived 2 artifacts
Archive block size is 32768
Received 1 blocks and 24273 bytes
Compression is 57.4%
Took 62 ms
[JENKINS] Archiving <https://builds.apache.org/job/OpenJPA-trunk-deploy/ws/trunk/openjpa-integration/slf4j/pom.xml>
to org.apache.openjpa/openjpa-integration-slf4j/2.4.1-SNAPSHOT/openjpa-integration-slf4j-2.4.1-SNAPSHOT.pom
Sending artifact delta relative to OpenJPA-trunk-deploy » OpenJPA Integration Tests - SLF4JLogFactory
#477
Archived 1 artifacts
Archive block size is 32768
Received 0 blocks and 6724 bytes
Compression is 0.0%
Took 0.12 sec
[JENKINS] Archiving <https://builds.apache.org/job/OpenJPA-trunk-deploy/ws/trunk/openjpa-integration/validation/pom.xml>
to org.apache.openjpa/openjpa-integration-validation/2.4.1-SNAPSHOT/openjpa-integration-validation-2.4.1-SNAPSHOT.pom
Sending artifact delta relative to OpenJPA-trunk-deploy » OpenJPA Integration Tests - Bean
Validation #477
Archived 1 artifacts
Archive block size is 32768
Received 0 blocks and 10739 bytes
Compression is 0.0%
Took 0.19 sec
[JENKINS] Archiving <https://builds.apache.org/job/OpenJPA-trunk-deploy/ws/trunk/openjpa-slice/pom.xml>
to org.apache.openjpa/openjpa-slice/2.4.1-SNAPSHOT/openjpa-slice-2.4.1-SNAPSHOT.pom
Sending artifact delta relative to OpenJPA-trunk-deploy » OpenJPA Slice #479
Archived 1 artifacts
Archive block size is 32768
Received 0 blocks and 6695 bytes
Compression is 0.0%
Took 0.14 sec
[JENKINS] Archiving <https://builds.apache.org/job/OpenJPA-trunk-deploy/ws/trunk/openjpa-xmlstore/pom.xml>
to org.apache.openjpa/openjpa-xmlstore/2.4.1-SNAPSHOT/openjpa-xmlstore-2.4.1-SNAPSHOT.pom
Sending artifact delta relative to OpenJPA-trunk-deploy » OpenJPA XML Store #479
Archived 1 artifacts
Archive block size is 32768
Received 0 blocks and 6149 bytes
Compression is 0.0%
Took 0.11 sec
[JENKINS] Archiving <https://builds.apache.org/job/OpenJPA-trunk-deploy/ws/trunk/openjpa-tools/pom.xml>
to org.apache.openjpa/openjpa-tools/2.4.1-SNAPSHOT/openjpa-tools-2.4.1-SNAPSHOT.pom
Sending artifact delta relative to OpenJPA-trunk-deploy » OpenJPA tools #479
Archived 1 artifacts
Archive block size is 32768
Received 0 blocks and 2309 bytes
Compression is 0.0%
Took 27 ms
[JENKINS] Archiving <https://builds.apache.org/job/OpenJPA-trunk-deploy/ws/trunk/openjpa-tools/openjpa-maven-plugin/pom.xml>
to org.apache.openjpa/openjpa-maven-plugin/2.4.1-SNAPSHOT/openjpa-maven-plugin-2.4.1-SNAPSHOT.pom
Sending artifact delta relative to OpenJPA-trunk-deploy » OpenJPA Maven Plugin #479
Archived 1 artifacts
Archive block size is 32768
Received 0 blocks and 6580 bytes
Compression is 0.0%
Took 96 ms
[JENKINS] Archiving <https://builds.apache.org/job/OpenJPA-trunk-deploy/ws/trunk/openjpa-examples/simple/pom.xml>
to org.apache.openjpa.openjpa-examples/simple/2.4.1-SNAPSHOT/simple-2.4.1-SNAPSHOT.pom
Sending artifact delta relative to OpenJPA-trunk-deploy » OpenJPA Examples - Simple #479
Archived 1 artifacts
Archive block size is 32768
Received 0 blocks and 2523 bytes
Compression is 0.0%
Took 49 ms
[JENKINS] Archiving <https://builds.apache.org/job/OpenJPA-trunk-deploy/ws/trunk/openjpa-integration/pom.xml>
to org.apache.openjpa/openjpa-integration/2.4.1-SNAPSHOT/openjpa-integration-2.4.1-SNAPSHOT.pom
Sending artifact delta relative to OpenJPA-trunk-deploy » OpenJPA Integration Tests #479
Archived 1 artifacts
Archive block size is 32768
Received 0 blocks and 2663 bytes
Compression is 0.0%
Took 28 ms
[JENKINS] Archiving <https://builds.apache.org/job/OpenJPA-trunk-deploy/ws/trunk/openjpa-persistence-locking/pom.xml>
to org.apache.openjpa/openjpa-persistence-locking/2.4.1-SNAPSHOT/openjpa-persistence-locking-2.4.1-SNAPSHOT.pom
Sending artifact delta relative to OpenJPA-trunk-deploy » OpenJPA Persistence Locking Tests
#479
Archived 1 artifacts
Archive block size is 32768
Received 0 blocks and 39331 bytes
Compression is 0.0%
Took 0.11 sec
[JENKINS] Archiving <https://builds.apache.org/job/OpenJPA-trunk-deploy/ws/trunk/openjpa-persistence/pom.xml>
to org.apache.openjpa/openjpa-persistence/2.4.1-SNAPSHOT/openjpa-persistence-2.4.1-SNAPSHOT.pom
Sending artifact delta relative to OpenJPA-trunk-deploy » OpenJPA Persistence #481
Archived 1 artifacts
Archive block size is 32768
Received 0 blocks and 2529 bytes
Compression is 0.0%
Took 0.31 sec
[JENKINS] Archiving <https://builds.apache.org/job/OpenJPA-trunk-deploy/ws/trunk/openjpa-tools/openjpa-fetch-statistics-was/pom.xml>
to org.apache.openjpa/openjpa-fetch-statistics-was/2.4.1-SNAPSHOT/openjpa-fetch-statistics-was-2.4.1-SNAPSHOT.pom
Sending artifact delta relative to OpenJPA-trunk-deploy » OpenJPA Fetching Statistic Tool
-- WAS Bundle #477
Archived 1 artifacts
Archive block size is 32768
Received 0 blocks and 4164 bytes
Compression is 0.0%
Took 98 ms
[JENKINS] Archiving <https://builds.apache.org/job/OpenJPA-trunk-deploy/ws/trunk/openjpa-project/pom.xml>
to org.apache.openjpa/apache-openjpa/2.4.1-SNAPSHOT/apache-openjpa-2.4.1-SNAPSHOT.pom
Sending artifact delta relative to OpenJPA-trunk-deploy » OpenJPA Project Docs and Assemblies
#479
Archived 1 artifacts
Archive block size is 32768
Received 0 blocks and 21637 bytes
Compression is 0.0%
Took 6.9 sec
[JENKINS] Archiving <https://builds.apache.org/job/OpenJPA-trunk-deploy/ws/trunk/openjpa-examples/openbooks/pom.xml>
to org.apache.openjpa.openjpa-examples/openbooks/2.4.1-SNAPSHOT/openbooks-2.4.1-SNAPSHOT.pom
Sending artifact delta relative to OpenJPA-trunk-deploy » OpenJPA Examples - OpenBooks #479
Archived 1 artifacts
Archive block size is 32768
Received 0 blocks and 10417 bytes
Compression is 0.0%
Took 2.2 sec
[JENKINS] Archiving <https://builds.apache.org/job/OpenJPA-trunk-deploy/ws/trunk/openjpa-tools/openjpa-fetch-statistics/pom.xml>
to org.apache.openjpa/openjpa-fetch-statistics/2.4.1-SNAPSHOT/openjpa-fetch-statistics-2.4.1-SNAPSHOT.pom
Sending artifact delta relative to OpenJPA-trunk-deploy » OpenJPA Fetching Statistic Tool
#477
Archived 1 artifacts
Archive block size is 32768
Received 0 blocks and 3207 bytes
Compression is 0.0%
Took 89 ms
[JENKINS] Archiving <https://builds.apache.org/job/OpenJPA-trunk-deploy/ws/trunk/openjpa-jest/pom.xml>
to org.apache.openjpa/openjpa-jest/2.4.1-SNAPSHOT/openjpa-jest-2.4.1-SNAPSHOT.pom
Sending artifact delta relative to OpenJPA-trunk-deploy » OpenJPA JEST #479
Archived 1 artifacts
Archive block size is 32768
Received 0 blocks and 4268 bytes
Compression is 0.0%
Took 94 ms
[JENKINS] Archiving <https://builds.apache.org/job/OpenJPA-trunk-deploy/ws/trunk/openjpa-examples/image-gallery/pom.xml>
to org.apache.openjpa.openjpa-examples/image-gallery/2.4.1-SNAPSHOT/image-gallery-2.4.1-SNAPSHOT.pom
Sending artifact delta relative to OpenJPA-trunk-deploy » OpenJPA Examples - image-gallery
#479
Archived 1 artifacts
Archive block size is 32768
Received 0 blocks and 4421 bytes
Compression is 0.0%
Took 74 ms
[JENKINS] Archiving <https://builds.apache.org/job/OpenJPA-trunk-deploy/ws/trunk/openjpa-integration/jmx/pom.xml>
to org.apache.openjpa/openjpa-integration-jmx/2.4.1-SNAPSHOT/openjpa-integration-jmx-2.4.1-SNAPSHOT.pom
Sending artifact delta relative to OpenJPA-trunk-deploy » OpenJPA Integration Tests - JMX
Platform MBeans #477
Archived 1 artifacts
Archive block size is 32768
Received 0 blocks and 6270 bytes
Compression is 0.0%
Took 84 ms
[JENKINS] Archiving <https://builds.apache.org/job/OpenJPA-trunk-deploy/ws/trunk/openjpa-jdbc/pom.xml>
to org.apache.openjpa/openjpa-jdbc/2.4.1-SNAPSHOT/openjpa-jdbc-2.4.1-SNAPSHOT.pom
Sending artifact delta relative to OpenJPA-trunk-deploy » OpenJPA JDBC #481
Archived 1 artifacts
Archive block size is 32768
Received 0 blocks and 3251 bytes
Compression is 0.0%
Took 0.17 sec
[JENKINS] Archiving <https://builds.apache.org/job/OpenJPA-trunk-deploy/ws/trunk/openjpa-integration/examples/pom.xml>
to org.apache.openjpa/openjpa-integration-examples/2.4.1-SNAPSHOT/openjpa-integration-examples-2.4.1-SNAPSHOT.pom
Sending artifact delta relative to OpenJPA-trunk-deploy » OpenJPA Integration Tests - Examples
#477
Archived 1 artifacts
Archive block size is 32768
Received 0 blocks and 4331 bytes
Compression is 0.0%
Took 58 ms
[JENKINS] Archiving <https://builds.apache.org/job/OpenJPA-trunk-deploy/ws/trunk/openjpa-integration/daytrader/pom.xml>
to org.apache.openjpa/openjpa-integration-daytrader/2.4.1-SNAPSHOT/openjpa-integration-daytrader-2.4.1-SNAPSHOT.pom
Sending artifact delta relative to OpenJPA-trunk-deploy » OpenJPA Integration Tests - Daytrader
#477
Archived 1 artifacts
Archive block size is 32768
Received 0 blocks and 8623 bytes
Compression is 0.0%
Took 69 ms
Sending e-mails to: commits@openjpa.apache.org
channel stopped

Mime
View raw message