openjpa-commits mailing list archives

Site index · List index
Message view « Date » · « Thread »
Top « Date » · « Thread »
From Apache Jenkins Server <jenk...@builds.apache.org>
Subject Build failed in Jenkins: OpenJPA-20x-deploy » OpenJPA Parent POM #109
Date Thu, 10 Sep 2015 03:46:39 GMT
See <https://builds.apache.org/job/OpenJPA-20x-deploy/org.apache.openjpa$openjpa-parent/109/>

------------------------------------------
maven-agent.jar already up to date
classworlds.jar already up to date
maven-interceptor.jar already up to date
maven2.1-interceptor.jar already up to date
<===[JENKINS REMOTING CAPACITY]===>   channel started
Executing Maven:  -B -f <https://builds.apache.org/job/OpenJPA-20x-deploy/org.apache.openjpa$openjpa-parent/ws/pom.xml>
-Dmaven.repo.local=/home/jenkins/jenkins-slave/maven-repositories/2 clean deploy
[INFO] Scanning for projects...
[INFO] Reactor build order: 
[INFO]   OpenJPA Parent POM
[INFO]   OpenJPA Utilities Library
[INFO]   OpenJPA Kernel
[INFO]   OpenJPA JDBC
[INFO]   OpenJPA Persistence
[INFO]   OpenJPA Persistence JDBC
[INFO]   OpenJPA Persistence Locking Tests
[INFO]   OpenJPA XML Store
[INFO]   OpenJPA Slice
[INFO]   OpenJPA Aggregate Jar
[INFO]   OpenJPA Aggregate Jar with Dependencies
[INFO]   OpenJPA Project Docs and Assemblies
[INFO]   OpenJPA Examples
[INFO]   OpenJPA Integration Tests
[INFO]   OpenJPA Integration Tests - Daytrader
[INFO]   OpenJPA Integration Tests - Examples
[INFO]   OpenJPA Integration Tests - JPA TCK
[INFO]   OpenJPA Integration Tests - Bean Validation
[INFO] ------------------------------------------------------------------------
[INFO] Building OpenJPA Parent POM
[INFO]    task-segment: [clean, deploy]
[INFO] ------------------------------------------------------------------------
Downloading: http://repo1.maven.org/maven2/org/apache/maven/plugins/maven-checkstyle-plugin/2.4/maven-checkstyle-plugin-2.4.pom
10K downloaded  (maven-checkstyle-plugin-2.4.pom)
Downloading: http://repo1.maven.org/maven2/org/apache/maven/plugins/maven-checkstyle-plugin/2.4/maven-checkstyle-plugin-2.4.jar
65K downloaded  (maven-checkstyle-plugin-2.4.jar)
[INFO] [clean:clean {execution: default-clean}]
[INFO] Deleting file set: <https://builds.apache.org/job/OpenJPA-20x-deploy/org.apache.openjpa$openjpa-parent/ws/target>
(included: [**], excluded: [])
[INFO] [buildnumber:create {execution: default}]
[INFO] Checking for local modifications: skipped.
[INFO] Updating project files from SCM: skipped.
[INFO] Executing: /bin/sh -c cd <https://builds.apache.org/job/OpenJPA-20x-deploy/org.apache.openjpa$openjpa-parent/ws/>
&& svn --non-interactive info
[INFO] Working directory: <https://builds.apache.org/job/OpenJPA-20x-deploy/org.apache.openjpa$openjpa-parent/ws/>
[INFO] Storing buildNumber: 1702137 at timestamp: September 10, 2015 at 3:45 AM
[INFO] Executing: /bin/sh -c cd <https://builds.apache.org/job/OpenJPA-20x-deploy/org.apache.openjpa$openjpa-parent/ws/>
&& svn --non-interactive info
[INFO] Working directory: <https://builds.apache.org/job/OpenJPA-20x-deploy/org.apache.openjpa$openjpa-parent/ws/>
[INFO] Storing buildScmBranch: branches/2.0.x
[INFO] [enforcer:enforce {execution: default}]
Downloading: http://repo1.maven.org/maven2/org/apache/maven/reporting/maven-reporting-impl/2.0.4.3/maven-reporting-impl-2.0.4.3.pom
4K downloaded  (maven-reporting-impl-2.0.4.3.pom)
Downloading: http://repo1.maven.org/maven2/org/apache/maven/shared/maven-shared-components/14/maven-shared-components-14.pom
9K downloaded  (maven-shared-components-14.pom)
Downloading: http://repo1.maven.org/maven2/org/codehaus/plexus/plexus-resources/1.0-alpha-4/plexus-resources-1.0-alpha-4.pom
762b downloaded  (plexus-resources-1.0-alpha-4.pom)
Downloading: http://repo1.maven.org/maven2/org/apache/maven/reporting/maven-reporting-impl/2.0.4.3/maven-reporting-impl-2.0.4.3.jar
Downloading: http://repo1.maven.org/maven2/org/codehaus/plexus/plexus-resources/1.0-alpha-4/plexus-resources-1.0-alpha-4.jar
20K downloaded  (maven-reporting-impl-2.0.4.3.jar)
16K downloaded  (plexus-resources-1.0-alpha-4.jar)
Setting property: classpath.resource.loader.class => 'org.codehaus.plexus.velocity.ContextClassLoaderResourceLoader'.
Setting property: site.resource.loader.class => 'org.codehaus.plexus.velocity.SiteResourceLoader'.
Setting property: velocimacro.messages.on => 'false'.
Setting property: resource.loader => 'classpath,site'.
Setting property: runtime.log.invalid.references => 'false'.
Setting property: resource.manager.logwhenfound => 'false'.
Setting property: velocimacro.permissions.allow.inline.to.replace.global => 'true'.
[INFO] [checkstyle:checkstyle {execution: default}]
[INFO] Source directory does not exist - skipping report.
[ERROR] VM #displayTree: error : too few arguments to macro. Wanted 2 got 0
[ERROR] VM #menuItem: error : too few arguments to macro. Wanted 1 got 0
[INFO] Setting property: classpath.resource.loader.class => 'org.codehaus.plexus.velocity.ContextClassLoaderResourceLoader'.
[INFO] Setting property: velocimacro.messages.on => 'false'.
[INFO] Setting property: resource.loader => 'classpath'.
[INFO] Setting property: resource.manager.logwhenfound => 'false'.
[INFO] [remote-resources:process {execution: default}]
[WARNING] POM for 'org.mortbay.jetty:jetty-util:pom:6.1.5:runtime' is invalid.

Its dependencies (if any) will NOT be available to the current build.
[WARNING] POM for 'org.mortbay.jetty:servlet-api-2.5:pom:6.1.5:runtime' is invalid.

Its dependencies (if any) will NOT be available to the current build.
[INFO] [site:attach-descriptor {execution: default-attach-descriptor}]
[INFO] Parent project loaded from repository.
[INFO] [ianal:verify-legal-files {execution: default}]
[INFO] [apache-rat:check {execution: default}]
[INFO] Exclude: **/.*/**
[INFO] Exclude: **/target/**/*
[INFO] [install:install {execution: default-install}]
[INFO] Installing <https://builds.apache.org/job/OpenJPA-20x-deploy/org.apache.openjpa$openjpa-parent/ws/pom.xml>
to /home/jenkins/jenkins-slave/maven-repositories/2/org/apache/openjpa/openjpa-parent/2.0.2-SNAPSHOT/openjpa-parent-2.0.2-SNAPSHOT.pom
[INFO] [deploy:deploy {execution: default-deploy}]
[INFO] Retrieving previous build number from apache.snapshots.https
[INFO] ------------------------------------------------------------------------
[ERROR] BUILD ERROR
[INFO] ------------------------------------------------------------------------
[INFO] Error retrieving previous build number for artifact 'org.apache.openjpa:openjpa-parent:pom':
repository metadata for: 'snapshot org.apache.openjpa:openjpa-parent:2.0.2-SNAPSHOT' could
not be retrieved from repository: apache.snapshots.https due to an error: Error transferring
file: java.lang.RuntimeException: Could not generate DH keypair

Prime size must be multiple of 64, and can only range from 512 to 1024 (inclusive)
[INFO] ------------------------------------------------------------------------
[INFO] For more information, run Maven with the -e switch
[INFO] ------------------------------------------------------------------------
[INFO] Total time: 43 seconds
[INFO] Finished at: Thu Sep 10 03:46:39 UTC 2015
[INFO] Final Memory: 49M/325M
[INFO] ------------------------------------------------------------------------

Mime
View raw message