openjpa-commits mailing list archives

Site index · List index
Message view « Date » · « Thread »
Top « Date » · « Thread »
From Apache Jenkins Server <jenk...@builds.apache.org>
Subject Build failed in Jenkins: OpenJPA-trunk-deploy » OpenJPA Kernel #507
Date Tue, 02 Feb 2016 06:48:07 GMT
See <https://builds.apache.org/job/OpenJPA-trunk-deploy/org.apache.openjpa$openjpa-kernel/507/>

------------------------------------------
[INFO]                                                                         
[INFO] ------------------------------------------------------------------------
[INFO] Building OpenJPA Kernel 2.4.1-SNAPSHOT
[INFO] ------------------------------------------------------------------------
[INFO] 
[INFO] --- maven-clean-plugin:2.5:clean (default-clean) @ openjpa-kernel ---
[INFO] 
[INFO] --- buildnumber-maven-plugin:1.0-beta-4:create (default) @ openjpa-kernel ---
[INFO] 
[INFO] --- maven-enforcer-plugin:1.3.1:enforce (default) @ openjpa-kernel ---
[INFO] 
[INFO] --- javacc-maven-plugin:2.4:jjtree-javacc (jjtree-javacc-jpql) @ openjpa-kernel ---
Java Compiler Compiler Version 4.0 (Tree Builder)
(type "jjtree" with no arguments for help)
Reading from file <https://builds.apache.org/job/OpenJPA-trunk-deploy/org.apache.openjpa$openjpa-kernel/ws/src/main/jjtree/org/apache/openjpa/kernel/jpql/JPQL.jjt>
. . .
File "<https://builds.apache.org/job/OpenJPA-trunk-deploy/org.apache.openjpa$openjpa-kernel/ws/target/generated-sources/jjtree/org/apache/openjpa/kernel/jpql/Node.java">
does not exist.  Will create one.
Annotated grammar generated successfully in <https://builds.apache.org/job/OpenJPA-trunk-deploy/org.apache.openjpa$openjpa-kernel/ws/target/generated-sources/jjtree/org/apache/openjpa/kernel/jpql/JPQL.jj>
Java Compiler Compiler Version 4.0 (Parser Generator)
(type "javacc" with no arguments for help)
Reading from file <https://builds.apache.org/job/OpenJPA-trunk-deploy/org.apache.openjpa$openjpa-kernel/ws/target/generated-sources/jjtree/org/apache/openjpa/kernel/jpql/JPQL.jj>
. . .
Warning: Choice conflict in (...)* construct at line 939, column 17.
         Expansion nested within construct and expansion following construct
         have common prefixes, one of which is: "+"
         Consider using a lookahead of 2 or more for nested expansion.
Warning: Choice conflict in (...)* construct at line 948, column 17.
         Expansion nested within construct and expansion following construct
         have common prefixes, one of which is: "*"
         Consider using a lookahead of 2 or more for nested expansion.
File "TokenMgrError.java" does not exist.  Will create one.
Warning: ParseException.java: File is obsolete.  Please rename or delete this file so that
a new one can be generated for you.
File "Token.java" does not exist.  Will create one.
File "JavaCharStream.java" does not exist.  Will create one.
Parser generated with 0 errors and 3 warnings.
[INFO] Processed 1 grammar
[INFO] 
[INFO] --- maven-checkstyle-plugin:2.6:checkstyle (default) @ openjpa-kernel ---
[INFO] Starting audit...
Audit done.

[WARNING] Unable to locate Source XRef to link to - DISABLED
[INFO] 
[INFO] --- maven-remote-resources-plugin:1.5:process (default) @ openjpa-kernel ---
[INFO] 
[INFO] --- maven-resources-plugin:2.6:resources (default-resources) @ openjpa-kernel ---
[INFO] Using 'UTF-8' encoding to copy filtered resources.
[INFO] Copying 15 resources
[INFO] Copying 3 resources
[INFO] 
[INFO] --- maven-compiler-plugin:2.3.2:compile (default-compile) @ openjpa-kernel ---
[INFO] Compiling 506 source files to <https://builds.apache.org/job/OpenJPA-trunk-deploy/org.apache.openjpa$openjpa-kernel/ws/target/classes>
[INFO] -------------------------------------------------------------
[ERROR] COMPILATION ERROR : 
[INFO] -------------------------------------------------------------
[ERROR] <https://builds.apache.org/job/OpenJPA-trunk-deploy/org.apache.openjpa$openjpa-kernel/ws/src/main/java/org/apache/openjpa/enhance/PCClassFileTransformer.java>:[40,55]
error: package com.sun.xml.internal.fastinfoset.alphabet does not exist
[ERROR] <https://builds.apache.org/job/OpenJPA-trunk-deploy/org.apache.openjpa$openjpa-kernel/ws/src/main/java/org/apache/openjpa/enhance/PCClassFileTransformer.java>:[40,0]
error: static import only from classes and interfaces
[INFO] 2 errors 
[INFO] -------------------------------------------------------------

Mime
View raw message