openjpa-commits mailing list archives

Site index · List index
Message view « Date » · « Thread »
Top « Date » · « Thread »
From Apache Jenkins Server <jenk...@builds.apache.org>
Subject Build failed in Jenkins: OpenJPA-trunk-deploy #507
Date Tue, 02 Feb 2016 06:48:08 GMT
See <https://builds.apache.org/job/OpenJPA-trunk-deploy/507/changes>

Changes:

[hthomann] OPENJPA-2627: Create an option to disable column type checking errors during schema
validation.

------------------------------------------
[...truncated 6433 lines...]
0  WARN   [main] openjpa.Runtime - The configuration property named "openjpa.ConnectionProperties"
was not recognized and will be ignored, although the name closely matches a valid property
called "openjpa.objectKey".
1  WARN   [main] openjpa.Runtime - The configuration property named "openjpa.ConnectionURL"
was not recognized and will be ignored, although the name closely matches a valid property
called "openjpa.objectKey".
1  WARN   [main] openjpa.Runtime - The configuration property named "openjpa.ConnectionUserName"
was not recognized and will be ignored, although the name closely matches a valid property
called "openjpa.objectKey".
1  WARN   [main] openjpa.Runtime - The configuration property named "openjpa.ConnectionDriverName"
was not recognized and will be ignored, although the name closely matches a valid property
called "openjpa.objectKey".
2  WARN   [main] openjpa.Runtime - The configuration property named "openjpa.ConnectionPassword"
was not recognized and will be ignored, although the name closely matches a valid property
called "openjpa.objectKey".
2  WARN   [main] openjpa.Runtime - The configuration property named "openjpa.DynamicEnhancementAgent"
was not recognized and will be ignored.
Tests run: 8, Failures: 0, Errors: 0, Skipped: 0, Time elapsed: 0.077 sec - in org.apache.openjpa.lib.conf.test.TestConfigurationImpl
Running org.apache.openjpa.lib.rop.TestListResultList
Tests run: 17, Failures: 0, Errors: 0, Skipped: 0, Time elapsed: 0.044 sec - in org.apache.openjpa.lib.rop.TestListResultList
Running org.apache.openjpa.lib.rop.TestEagerResultList
Tests run: 17, Failures: 0, Errors: 0, Skipped: 0, Time elapsed: 0.009 sec - in org.apache.openjpa.lib.rop.TestEagerResultList
Running org.apache.openjpa.lib.rop.TestLazyForwardResultList
Tests run: 17, Failures: 0, Errors: 0, Skipped: 0, Time elapsed: 0.005 sec - in org.apache.openjpa.lib.rop.TestLazyForwardResultList
Running org.apache.openjpa.lib.rop.TestRangeResultObjectProvider
Tests run: 17, Failures: 0, Errors: 0, Skipped: 0, Time elapsed: 0.06 sec - in org.apache.openjpa.lib.rop.TestRangeResultObjectProvider
Running org.apache.openjpa.lib.rop.TestMergedResultObjectProvider
Tests run: 17, Failures: 0, Errors: 0, Skipped: 0, Time elapsed: 0.069 sec - in org.apache.openjpa.lib.rop.TestMergedResultObjectProvider
Running org.apache.openjpa.lib.rop.TestSoftRandomAccessResultList
Tests run: 17, Failures: 0, Errors: 0, Skipped: 0, Time elapsed: 0.021 sec - in org.apache.openjpa.lib.rop.TestSoftRandomAccessResultList
Running org.apache.openjpa.lib.rop.TestWindowResultList
Tests run: 17, Failures: 0, Errors: 0, Skipped: 0, Time elapsed: 0.011 sec - in org.apache.openjpa.lib.rop.TestWindowResultList
Running org.apache.openjpa.lib.rop.TestRandomAccessResultList
Tests run: 17, Failures: 0, Errors: 0, Skipped: 0, Time elapsed: 0.009 sec - in org.apache.openjpa.lib.rop.TestRandomAccessResultList
Running org.apache.openjpa.lib.rop.TestSimpleResultList
Tests run: 17, Failures: 0, Errors: 0, Skipped: 0, Time elapsed: 0.005 sec - in org.apache.openjpa.lib.rop.TestSimpleResultList
Running org.apache.openjpa.lib.rop.TestOrderedMergedResultObjectProvider
Tests run: 17, Failures: 0, Errors: 0, Skipped: 0, Time elapsed: 0.073 sec - in org.apache.openjpa.lib.rop.TestOrderedMergedResultObjectProvider
Running org.apache.openjpa.lib.util.TestTemporaryClassLoader
Tests run: 1, Failures: 0, Errors: 0, Skipped: 0, Time elapsed: 0.002 sec - in org.apache.openjpa.lib.util.TestTemporaryClassLoader
Running org.apache.openjpa.lib.util.svn.TestSVNUtils
Tests run: 6, Failures: 0, Errors: 0, Skipped: 0, Time elapsed: 0.001 sec - in org.apache.openjpa.lib.util.svn.TestSVNUtils
Running org.apache.openjpa.lib.util.TestSimpleRegex
Tests run: 1, Failures: 0, Errors: 0, Skipped: 0, Time elapsed: 0.001 sec - in org.apache.openjpa.lib.util.TestSimpleRegex
Running org.apache.openjpa.lib.util.TestOptions
Tests run: 2, Failures: 0, Errors: 0, Skipped: 0, Time elapsed: 0.004 sec - in org.apache.openjpa.lib.util.TestOptions
Running org.apache.openjpa.lib.util.TestParameterTemplate
Tests run: 1, Failures: 0, Errors: 0, Skipped: 0, Time elapsed: 0 sec - in org.apache.openjpa.lib.util.TestParameterTemplate
Running org.apache.openjpa.lib.util.TestUUIDGenerator
Tests run: 7, Failures: 0, Errors: 0, Skipped: 0, Time elapsed: 0.459 sec - in org.apache.openjpa.lib.util.TestUUIDGenerator
Running org.apache.openjpa.lib.util.TestTypedProperties
Tests run: 4, Failures: 0, Errors: 0, Skipped: 0, Time elapsed: 0.002 sec - in org.apache.openjpa.lib.util.TestTypedProperties
Running org.apache.openjpa.lib.util.TestPropertiesParser
Tests run: 13, Failures: 0, Errors: 0, Skipped: 0, Time elapsed: 0.119 sec - in org.apache.openjpa.lib.util.TestPropertiesParser
Running org.apache.openjpa.lib.util.TestAbstractEventManager
Tests run: 2, Failures: 0, Errors: 0, Skipped: 0, Time elapsed: 0.002 sec - in org.apache.openjpa.lib.util.TestAbstractEventManager
Running org.apache.openjpa.lib.util.TestLocalizer
Tests run: 7, Failures: 0, Errors: 0, Skipped: 0, Time elapsed: 0.013 sec - in org.apache.openjpa.lib.util.TestLocalizer
Running org.apache.openjpa.lib.util.TestReferenceSet
Tests run: 4, Failures: 0, Errors: 0, Skipped: 0, Time elapsed: 0.017 sec - in org.apache.openjpa.lib.util.TestReferenceSet
Running org.apache.openjpa.lib.util.TestMultiClassLoader
Tests run: 2, Failures: 0, Errors: 0, Skipped: 0, Time elapsed: 0.002 sec - in org.apache.openjpa.lib.util.TestMultiClassLoader
Running org.apache.openjpa.lib.graph.TestGraph
Tests run: 3, Failures: 0, Errors: 0, Skipped: 0, Time elapsed: 0.003 sec - in org.apache.openjpa.lib.graph.TestGraph
Running org.apache.openjpa.lib.graph.TestDepthFirstAnalysis
Tests run: 4, Failures: 0, Errors: 0, Skipped: 0, Time elapsed: 0.005 sec - in org.apache.openjpa.lib.graph.TestDepthFirstAnalysis
Running org.apache.openjpa.lib.xml.TestXMLWriter
Tests run: 1, Failures: 0, Errors: 0, Skipped: 0, Time elapsed: 0.074 sec - in org.apache.openjpa.lib.xml.TestXMLWriter
Running org.apache.openjpa.lib.xml.TestDocTypeReader
Tests run: 3, Failures: 0, Errors: 0, Skipped: 0, Time elapsed: 0.111 sec - in org.apache.openjpa.lib.xml.TestDocTypeReader
Running org.apache.openjpa.lib.identifier.TestIdentifiers
Tests run: 1, Failures: 0, Errors: 0, Skipped: 0, Time elapsed: 0.004 sec - in org.apache.openjpa.lib.identifier.TestIdentifiers

Results :

Tests run: 257, Failures: 0, Errors: 0, Skipped: 0

[JENKINS] Recording test results
log4j:WARN No appenders could be found for logger (org.apache.commons.beanutils.converters.BooleanConverter).
log4j:WARN Please initialize the log4j system properly.
[INFO] 
[INFO] --- maven-jar-plugin:2.3.1:jar (default-jar) @ openjpa-lib ---
[INFO] Building jar: <https://builds.apache.org/job/OpenJPA-trunk-deploy/ws/trunk/openjpa-lib/target/openjpa-lib-2.4.1-SNAPSHOT.jar>
[INFO] 
[INFO] --- maven-site-plugin:3.4:attach-descriptor (attach-descriptor) @ openjpa-lib ---
[INFO] 
[INFO] --- maven-jar-plugin:2.3.1:test-jar (attach-tests) @ openjpa-lib ---
[INFO] Building jar: <https://builds.apache.org/job/OpenJPA-trunk-deploy/ws/trunk/openjpa-lib/target/openjpa-lib-2.4.1-SNAPSHOT-tests.jar>
[INFO] 
[INFO] --- ianal-maven-plugin:1.0-alpha-1:verify-legal-files (default) @ openjpa-lib ---
[INFO] Checking legal files in: openjpa-lib-2.4.1-SNAPSHOT.jar
[INFO] Checking legal files in: openjpa-lib-2.4.1-SNAPSHOT-tests.jar
[INFO] 
[INFO] --- apache-rat-plugin:0.7:check (default) @ openjpa-lib ---
[INFO] Exclude: **/.*/**
[INFO] Exclude: **/target/**/*
[INFO] 
[INFO] --- maven-install-plugin:2.5.2:install (default-install) @ openjpa-lib ---
[INFO] Installing <https://builds.apache.org/job/OpenJPA-trunk-deploy/ws/trunk/openjpa-lib/target/openjpa-lib-2.4.1-SNAPSHOT.jar>
to /home/jenkins/jenkins-slave/maven-repositories/0/org/apache/openjpa/openjpa-lib/2.4.1-SNAPSHOT/openjpa-lib-2.4.1-SNAPSHOT.jar
[INFO] Installing <https://builds.apache.org/job/OpenJPA-trunk-deploy/ws/trunk/openjpa-lib/pom.xml>
to /home/jenkins/jenkins-slave/maven-repositories/0/org/apache/openjpa/openjpa-lib/2.4.1-SNAPSHOT/openjpa-lib-2.4.1-SNAPSHOT.pom
[INFO] Installing <https://builds.apache.org/job/OpenJPA-trunk-deploy/ws/trunk/openjpa-lib/target/openjpa-lib-2.4.1-SNAPSHOT-tests.jar>
to /home/jenkins/jenkins-slave/maven-repositories/0/org/apache/openjpa/openjpa-lib/2.4.1-SNAPSHOT/openjpa-lib-2.4.1-SNAPSHOT-tests.jar
[INFO] 
[INFO] --- maven-deploy-plugin:2.8.2:deploy (default-deploy) @ openjpa-lib ---
[INFO] Downloading: https://repository.apache.org/content/repositories/snapshots/org/apache/openjpa/openjpa-lib/2.4.1-SNAPSHOT/maven-metadata.xml
[INFO] Downloaded: https://repository.apache.org/content/repositories/snapshots/org/apache/openjpa/openjpa-lib/2.4.1-SNAPSHOT/maven-metadata.xml
(995 B at 2.8 KB/sec)
[INFO] Uploading: https://repository.apache.org/content/repositories/snapshots/org/apache/openjpa/openjpa-lib/2.4.1-SNAPSHOT/openjpa-lib-2.4.1-20160202.064138-30.jar
[INFO] Uploaded: https://repository.apache.org/content/repositories/snapshots/org/apache/openjpa/openjpa-lib/2.4.1-SNAPSHOT/openjpa-lib-2.4.1-20160202.064138-30.jar
(449 KB at 1224.5 KB/sec)
[INFO] Uploading: https://repository.apache.org/content/repositories/snapshots/org/apache/openjpa/openjpa-lib/2.4.1-SNAPSHOT/openjpa-lib-2.4.1-20160202.064138-30.pom
[INFO] Uploaded: https://repository.apache.org/content/repositories/snapshots/org/apache/openjpa/openjpa-lib/2.4.1-SNAPSHOT/openjpa-lib-2.4.1-20160202.064138-30.pom
(7 KB at 33.3 KB/sec)
[INFO] Downloading: https://repository.apache.org/content/repositories/snapshots/org/apache/openjpa/openjpa-lib/maven-metadata.xml
[INFO] Downloaded: https://repository.apache.org/content/repositories/snapshots/org/apache/openjpa/openjpa-lib/maven-metadata.xml
(591 B at 2.6 KB/sec)
[INFO] Uploading: https://repository.apache.org/content/repositories/snapshots/org/apache/openjpa/openjpa-lib/2.4.1-SNAPSHOT/maven-metadata.xml
[INFO] Uploaded: https://repository.apache.org/content/repositories/snapshots/org/apache/openjpa/openjpa-lib/2.4.1-SNAPSHOT/maven-metadata.xml
(995 B at 4.7 KB/sec)
[INFO] Uploading: https://repository.apache.org/content/repositories/snapshots/org/apache/openjpa/openjpa-lib/maven-metadata.xml
[INFO] Uploaded: https://repository.apache.org/content/repositories/snapshots/org/apache/openjpa/openjpa-lib/maven-metadata.xml
(591 B at 3.5 KB/sec)
[INFO] Uploading: https://repository.apache.org/content/repositories/snapshots/org/apache/openjpa/openjpa-lib/2.4.1-SNAPSHOT/openjpa-lib-2.4.1-20160202.064138-30-tests.jar
[INFO] Uploaded: https://repository.apache.org/content/repositories/snapshots/org/apache/openjpa/openjpa-lib/2.4.1-SNAPSHOT/openjpa-lib-2.4.1-20160202.064138-30-tests.jar
(100 KB at 484.6 KB/sec)
[INFO] Uploading: https://repository.apache.org/content/repositories/snapshots/org/apache/openjpa/openjpa-lib/2.4.1-SNAPSHOT/maven-metadata.xml
[INFO] Uploaded: https://repository.apache.org/content/repositories/snapshots/org/apache/openjpa/openjpa-lib/2.4.1-SNAPSHOT/maven-metadata.xml
(995 B at 6.3 KB/sec)
[INFO]                                                                         
[INFO] ------------------------------------------------------------------------
[INFO] Building OpenJPA Kernel 2.4.1-SNAPSHOT
[INFO] ------------------------------------------------------------------------
[INFO] 
[INFO] --- maven-clean-plugin:2.5:clean (default-clean) @ openjpa-kernel ---
[INFO] 
[INFO] --- buildnumber-maven-plugin:1.0-beta-4:create (default) @ openjpa-kernel ---
[INFO] 
[INFO] --- maven-enforcer-plugin:1.3.1:enforce (default) @ openjpa-kernel ---
[INFO] 
[INFO] --- javacc-maven-plugin:2.4:jjtree-javacc (jjtree-javacc-jpql) @ openjpa-kernel ---
Java Compiler Compiler Version 4.0 (Tree Builder)
(type "jjtree" with no arguments for help)
Reading from file <https://builds.apache.org/job/OpenJPA-trunk-deploy/ws/trunk/openjpa-kernel/src/main/jjtree/org/apache/openjpa/kernel/jpql/JPQL.jjt>
. . .
File "<https://builds.apache.org/job/OpenJPA-trunk-deploy/ws/trunk/openjpa-kernel/target/generated-sources/jjtree/org/apache/openjpa/kernel/jpql/Node.java">
does not exist.  Will create one.
Annotated grammar generated successfully in <https://builds.apache.org/job/OpenJPA-trunk-deploy/ws/trunk/openjpa-kernel/target/generated-sources/jjtree/org/apache/openjpa/kernel/jpql/JPQL.jj>
Java Compiler Compiler Version 4.0 (Parser Generator)
(type "javacc" with no arguments for help)
Reading from file <https://builds.apache.org/job/OpenJPA-trunk-deploy/ws/trunk/openjpa-kernel/target/generated-sources/jjtree/org/apache/openjpa/kernel/jpql/JPQL.jj>
. . .
Warning: Choice conflict in (...)* construct at line 939, column 17.
         Expansion nested within construct and expansion following construct
         have common prefixes, one of which is: "+"
         Consider using a lookahead of 2 or more for nested expansion.
Warning: Choice conflict in (...)* construct at line 948, column 17.
         Expansion nested within construct and expansion following construct
         have common prefixes, one of which is: "*"
         Consider using a lookahead of 2 or more for nested expansion.
File "TokenMgrError.java" does not exist.  Will create one.
Warning: ParseException.java: File is obsolete.  Please rename or delete this file so that
a new one can be generated for you.
File "Token.java" does not exist.  Will create one.
File "JavaCharStream.java" does not exist.  Will create one.
Parser generated with 0 errors and 3 warnings.
[INFO] Processed 1 grammar
[INFO] 
[INFO] --- maven-checkstyle-plugin:2.6:checkstyle (default) @ openjpa-kernel ---
[INFO] Starting audit...
Audit done.

[WARNING] Unable to locate Source XRef to link to - DISABLED
[INFO] 
[INFO] --- maven-remote-resources-plugin:1.5:process (default) @ openjpa-kernel ---
[INFO] 
[INFO] --- maven-resources-plugin:2.6:resources (default-resources) @ openjpa-kernel ---
[INFO] Using 'UTF-8' encoding to copy filtered resources.
[INFO] Copying 15 resources
[INFO] Copying 3 resources
[INFO] 
[INFO] --- maven-compiler-plugin:2.3.2:compile (default-compile) @ openjpa-kernel ---
[INFO] Compiling 506 source files to <https://builds.apache.org/job/OpenJPA-trunk-deploy/ws/trunk/openjpa-kernel/target/classes>
[INFO] -------------------------------------------------------------
[ERROR] COMPILATION ERROR : 
[INFO] -------------------------------------------------------------
[ERROR] <https://builds.apache.org/job/OpenJPA-trunk-deploy/ws/trunk/openjpa-kernel/src/main/java/org/apache/openjpa/enhance/PCClassFileTransformer.java>:[40,55]
error: package com.sun.xml.internal.fastinfoset.alphabet does not exist
[ERROR] <https://builds.apache.org/job/OpenJPA-trunk-deploy/ws/trunk/openjpa-kernel/src/main/java/org/apache/openjpa/enhance/PCClassFileTransformer.java>:[40,0]
error: static import only from classes and interfaces
[INFO] 2 errors 
[INFO] -------------------------------------------------------------
[INFO] ------------------------------------------------------------------------
[INFO] Reactor Summary:
[INFO] 
[INFO] OpenJPA Parent POM ................................. SUCCESS [ 17.269 s]
[INFO] OpenJPA Utilities Library .......................... SUCCESS [ 29.336 s]
[INFO] OpenJPA Kernel ..................................... FAILURE [ 17.329 s]
[INFO] OpenJPA JDBC ....................................... SKIPPED
[INFO] OpenJPA Persistence ................................ SKIPPED
[INFO] OpenJPA Persistence JDBC ........................... SKIPPED
[INFO] OpenJPA Persistence Locking Tests .................. SKIPPED
[INFO] OpenJPA tools ...................................... SKIPPED
[INFO] OpenJPA Maven Plugin ............................... SKIPPED
[INFO] OpenJPA XML Store .................................. SKIPPED
[INFO] OpenJPA Slice ...................................... SKIPPED
[INFO] OpenJPA JEST ....................................... SKIPPED
[INFO] OpenJPA Aggregate Jar .............................. SKIPPED
[INFO] OpenJPA Aggregate Jar with Dependencies ............ SKIPPED
[INFO] OpenJPA Project Docs and Assemblies ................ SKIPPED
[INFO] OpenJPA Examples ................................... SKIPPED
[INFO] OpenJPA Examples - Simple .......................... SKIPPED
[INFO] OpenJPA Examples - image-gallery ................... SKIPPED
[INFO] OpenJPA Examples - OpenBooks ....................... SKIPPED
[INFO] OpenJPA Integration Tests .......................... SKIPPED
[INFO] OpenJPA Integration Tests - Daytrader .............. SKIPPED
[INFO] OpenJPA Integration Tests - Examples ............... SKIPPED
[INFO] OpenJPA Integration Tests - SLF4JLogFactory ........ SKIPPED
[INFO] OpenJPA Integration Tests - JPA TCK ................ SKIPPED
[INFO] OpenJPA Integration Tests - Bean Validation ........ SKIPPED
[INFO] OpenJPA Integration Tests - JMX Platform MBeans .... SKIPPED
[INFO] OpenJPA Fetching Statistic Tool .................... SKIPPED
[INFO] OpenJPA Fetching Statistic Tool -- WAS Bundle ...... SKIPPED
[INFO] ------------------------------------------------------------------------
[INFO] BUILD FAILURE
[INFO] ------------------------------------------------------------------------
[INFO] Total time: 01:10 min
[INFO] Finished at: 2016-02-02T06:42:02+00:00
[INFO] Final Memory: 63M/862M
[INFO] ------------------------------------------------------------------------
[ERROR] Failed to execute goal org.apache.maven.plugins:maven-compiler-plugin:2.3.2:compile
(default-compile) on project openjpa-kernel: Compilation failure: Compilation failure:
[ERROR] <https://builds.apache.org/job/OpenJPA-trunk-deploy/ws/trunk/openjpa-kernel/src/main/java/org/apache/openjpa/enhance/PCClassFileTransformer.java>:[40,55]
error: package com.sun.xml.internal.fastinfoset.alphabet does not exist
[ERROR] <https://builds.apache.org/job/OpenJPA-trunk-deploy/ws/trunk/openjpa-kernel/src/main/java/org/apache/openjpa/enhance/PCClassFileTransformer.java>:[40,0]
error: static import only from classes and interfaces
[ERROR] -> [Help 1]
[ERROR] 
[ERROR] To see the full stack trace of the errors, re-run Maven with the -e switch.
[ERROR] Re-run Maven using the -X switch to enable full debug logging.
[ERROR] 
[ERROR] For more information about the errors and possible solutions, please read the following
articles:
[ERROR] [Help 1] http://cwiki.apache.org/confluence/display/MAVEN/MojoFailureException
[ERROR] 
[ERROR] After correcting the problems, you can resume the build with the command
[ERROR]   mvn <goals> -rf :openjpa-kernel
[JENKINS] Archiving <https://builds.apache.org/job/OpenJPA-trunk-deploy/ws/trunk/openjpa/pom.xml>
to org.apache.openjpa/openjpa/2.4.1-SNAPSHOT/openjpa-2.4.1-SNAPSHOT.pom
[JENKINS] Archiving <https://builds.apache.org/job/OpenJPA-trunk-deploy/ws/trunk/openjpa-lib/pom.xml>
to org.apache.openjpa/openjpa-lib/2.4.1-SNAPSHOT/openjpa-lib-2.4.1-SNAPSHOT.pom
[JENKINS] Archiving <https://builds.apache.org/job/OpenJPA-trunk-deploy/ws/trunk/openjpa-lib/target/openjpa-lib-2.4.1-SNAPSHOT.jar>
to org.apache.openjpa/openjpa-lib/2.4.1-20160202.064138-30/openjpa-lib-2.4.1-20160202.064138-30.jar
[JENKINS] Archiving <https://builds.apache.org/job/OpenJPA-trunk-deploy/ws/trunk/openjpa-lib/target/openjpa-lib-2.4.1-SNAPSHOT-tests.jar>
to org.apache.openjpa/openjpa-lib/2.4.1-20160202.064138-30/openjpa-lib-2.4.1-20160202.064138-30-tests.jar
[JENKINS] Archiving <https://builds.apache.org/job/OpenJPA-trunk-deploy/ws/trunk/openjpa-all/pom.xml>
to org.apache.openjpa/openjpa-all/2.4.1-SNAPSHOT/openjpa-all-2.4.1-SNAPSHOT.pom
[JENKINS] Archiving <https://builds.apache.org/job/OpenJPA-trunk-deploy/ws/trunk/openjpa-kernel/pom.xml>
to org.apache.openjpa/openjpa-kernel/2.4.1-SNAPSHOT/openjpa-kernel-2.4.1-SNAPSHOT.pom
[JENKINS] Archiving <https://builds.apache.org/job/OpenJPA-trunk-deploy/ws/trunk/openjpa-integration/tck/pom.xml>
to org.apache.openjpa/openjpa-integration-tck/2.4.1-SNAPSHOT/openjpa-integration-tck-2.4.1-SNAPSHOT.pom
[JENKINS] Archiving <https://builds.apache.org/job/OpenJPA-trunk-deploy/ws/trunk/openjpa-examples/pom.xml>
to org.apache.openjpa/openjpa-examples/2.4.1-SNAPSHOT/openjpa-examples-2.4.1-SNAPSHOT.pom
[JENKINS] Archiving <https://builds.apache.org/job/OpenJPA-trunk-deploy/ws/trunk/openjpa-persistence-jdbc/pom.xml>
to org.apache.openjpa/openjpa-persistence-jdbc/2.4.1-SNAPSHOT/openjpa-persistence-jdbc-2.4.1-SNAPSHOT.pom
[JENKINS] Archiving <https://builds.apache.org/job/OpenJPA-trunk-deploy/ws/trunk/pom.xml>
to org.apache.openjpa/openjpa-parent/2.4.1-SNAPSHOT/openjpa-parent-2.4.1-SNAPSHOT.pom
[JENKINS] Archiving <https://builds.apache.org/job/OpenJPA-trunk-deploy/ws/trunk/target/openjpa-parent-2.4.1-SNAPSHOT-site.xml>
to org.apache.openjpa/openjpa-parent/2.4.1-20160202.064107-30/openjpa-parent-2.4.1-20160202.064107-30-site.xml
[JENKINS] Archiving <https://builds.apache.org/job/OpenJPA-trunk-deploy/ws/trunk/openjpa-integration/slf4j/pom.xml>
to org.apache.openjpa/openjpa-integration-slf4j/2.4.1-SNAPSHOT/openjpa-integration-slf4j-2.4.1-SNAPSHOT.pom
[JENKINS] Archiving <https://builds.apache.org/job/OpenJPA-trunk-deploy/ws/trunk/openjpa-integration/validation/pom.xml>
to org.apache.openjpa/openjpa-integration-validation/2.4.1-SNAPSHOT/openjpa-integration-validation-2.4.1-SNAPSHOT.pom
[JENKINS] Archiving <https://builds.apache.org/job/OpenJPA-trunk-deploy/ws/trunk/openjpa-slice/pom.xml>
to org.apache.openjpa/openjpa-slice/2.4.1-SNAPSHOT/openjpa-slice-2.4.1-SNAPSHOT.pom
[JENKINS] Archiving <https://builds.apache.org/job/OpenJPA-trunk-deploy/ws/trunk/openjpa-xmlstore/pom.xml>
to org.apache.openjpa/openjpa-xmlstore/2.4.1-SNAPSHOT/openjpa-xmlstore-2.4.1-SNAPSHOT.pom
[JENKINS] Archiving <https://builds.apache.org/job/OpenJPA-trunk-deploy/ws/trunk/openjpa-tools/pom.xml>
to org.apache.openjpa/openjpa-tools/2.4.1-SNAPSHOT/openjpa-tools-2.4.1-SNAPSHOT.pom
[JENKINS] Archiving <https://builds.apache.org/job/OpenJPA-trunk-deploy/ws/trunk/openjpa-tools/openjpa-maven-plugin/pom.xml>
to org.apache.openjpa/openjpa-maven-plugin/2.4.1-SNAPSHOT/openjpa-maven-plugin-2.4.1-SNAPSHOT.pom
[JENKINS] Archiving <https://builds.apache.org/job/OpenJPA-trunk-deploy/ws/trunk/openjpa-examples/simple/pom.xml>
to org.apache.openjpa.openjpa-examples/simple/2.4.1-SNAPSHOT/simple-2.4.1-SNAPSHOT.pom
[JENKINS] Archiving <https://builds.apache.org/job/OpenJPA-trunk-deploy/ws/trunk/openjpa-integration/pom.xml>
to org.apache.openjpa/openjpa-integration/2.4.1-SNAPSHOT/openjpa-integration-2.4.1-SNAPSHOT.pom
[JENKINS] Archiving <https://builds.apache.org/job/OpenJPA-trunk-deploy/ws/trunk/openjpa-persistence-locking/pom.xml>
to org.apache.openjpa/openjpa-persistence-locking/2.4.1-SNAPSHOT/openjpa-persistence-locking-2.4.1-SNAPSHOT.pom
[JENKINS] Archiving <https://builds.apache.org/job/OpenJPA-trunk-deploy/ws/trunk/openjpa-persistence/pom.xml>
to org.apache.openjpa/openjpa-persistence/2.4.1-SNAPSHOT/openjpa-persistence-2.4.1-SNAPSHOT.pom
[JENKINS] Archiving <https://builds.apache.org/job/OpenJPA-trunk-deploy/ws/trunk/openjpa-tools/openjpa-fetch-statistics-was/pom.xml>
to org.apache.openjpa/openjpa-fetch-statistics-was/2.4.1-SNAPSHOT/openjpa-fetch-statistics-was-2.4.1-SNAPSHOT.pom
[JENKINS] Archiving <https://builds.apache.org/job/OpenJPA-trunk-deploy/ws/trunk/openjpa-project/pom.xml>
to org.apache.openjpa/apache-openjpa/2.4.1-SNAPSHOT/apache-openjpa-2.4.1-SNAPSHOT.pom
[JENKINS] Archiving <https://builds.apache.org/job/OpenJPA-trunk-deploy/ws/trunk/openjpa-examples/openbooks/pom.xml>
to org.apache.openjpa.openjpa-examples/openbooks/2.4.1-SNAPSHOT/openbooks-2.4.1-SNAPSHOT.pom
[JENKINS] Archiving <https://builds.apache.org/job/OpenJPA-trunk-deploy/ws/trunk/openjpa-tools/openjpa-fetch-statistics/pom.xml>
to org.apache.openjpa/openjpa-fetch-statistics/2.4.1-SNAPSHOT/openjpa-fetch-statistics-2.4.1-SNAPSHOT.pom
[JENKINS] Archiving <https://builds.apache.org/job/OpenJPA-trunk-deploy/ws/trunk/openjpa-jest/pom.xml>
to org.apache.openjpa/openjpa-jest/2.4.1-SNAPSHOT/openjpa-jest-2.4.1-SNAPSHOT.pom
[JENKINS] Archiving <https://builds.apache.org/job/OpenJPA-trunk-deploy/ws/trunk/openjpa-examples/image-gallery/pom.xml>
to org.apache.openjpa.openjpa-examples/image-gallery/2.4.1-SNAPSHOT/image-gallery-2.4.1-SNAPSHOT.pom
[JENKINS] Archiving <https://builds.apache.org/job/OpenJPA-trunk-deploy/ws/trunk/openjpa-integration/jmx/pom.xml>
to org.apache.openjpa/openjpa-integration-jmx/2.4.1-SNAPSHOT/openjpa-integration-jmx-2.4.1-SNAPSHOT.pom
[JENKINS] Archiving <https://builds.apache.org/job/OpenJPA-trunk-deploy/ws/trunk/openjpa-jdbc/pom.xml>
to org.apache.openjpa/openjpa-jdbc/2.4.1-SNAPSHOT/openjpa-jdbc-2.4.1-SNAPSHOT.pom
[JENKINS] Archiving <https://builds.apache.org/job/OpenJPA-trunk-deploy/ws/trunk/openjpa-integration/examples/pom.xml>
to org.apache.openjpa/openjpa-integration-examples/2.4.1-SNAPSHOT/openjpa-integration-examples-2.4.1-SNAPSHOT.pom
[JENKINS] Archiving <https://builds.apache.org/job/OpenJPA-trunk-deploy/ws/trunk/openjpa-integration/daytrader/pom.xml>
to org.apache.openjpa/openjpa-integration-daytrader/2.4.1-SNAPSHOT/openjpa-integration-daytrader-2.4.1-SNAPSHOT.pom
Sending e-mails to: commits@openjpa.apache.org
channel stopped

Mime
View raw message