openjpa-commits mailing list archives

Site index · List index
Message view « Date » · « Thread »
Top « Date » · « Thread »
From Apache Jenkins Server <jenk...@builds.apache.org>
Subject Build failed in Jenkins: OpenJPA-trunk #1062
Date Fri, 26 Aug 2016 18:14:28 GMT
See <https://builds.apache.org/job/OpenJPA-trunk/1062/changes>

Changes:

[struberg] upgrade pom description to reflect we are JPA-2.1

------------------------------------------
Started by an SCM change
[EnvInject] - Loading node environment variables.
Building remotely on H11 (Ubuntu yahoo-not-h2 ubuntu docker) in workspace <https://builds.apache.org/job/OpenJPA-trunk/ws/>
Updating https://svn.apache.org/repos/asf/openjpa/trunk at revision '2016-08-26T18:12:07.833
+0000'
U         pom.xml
U         openjpa-project/pom.xml
U         openjpa-project/source-assembly.xml
U         openjpa-project/checkstyle.xml
U         openjpa-persistence/src/main/java/org/apache/openjpa/persistence/meta/AnnotationProcessor6.java
U         openjpa-persistence-jdbc/src/test/java/org/apache/openjpa/persistence/query/common/apps/Entity1.java
U         openjpa-persistence-jdbc/src/test/java/org/apache/openjpa/persistence/detach/Entity1.java
U         openjpa-persistence-jdbc/src/test/java/org/apache/openjpa/persistence/enhance/common/apps/Entity1.java
U         openjpa-persistence-jdbc/src/test/java/org/apache/openjpa/persistence/kernel/common/apps/Entity1.java
U         openjpa-persistence-jdbc/src/test/java/org/apache/openjpa/persistence/jdbc/common/apps/mappingApp/Entity1.java
U         openjpa-persistence-jdbc/src/test/java/org/apache/openjpa/persistence/common/apps/Entity1.java
U         openjpa-persistence-jdbc/src/test/java/org/apache/openjpa/persistence/querycache/common/apps/Entity1.java
U         openjpa-persistence-jdbc/src/test/java/org/apache/openjpa/persistence/annotations/common/apps/annotApp/annotype/Entity1.java
U         openjpa-persistence-jdbc/src/test/java/org/apache/openjpa/persistence/annotations/common/apps/annotApp/ddtype/Entity1.java
U         openjpa-persistence-jdbc/src/test/java/org/apache/openjpa/persistence/generationtype/TestTableGeneratorUseSchemaNameProp.java
 U        .
At revision 1757902

Parsing POMs
Established TCP socket on 33881
maven3-agent.jar already up to date
maven3-interceptor.jar already up to date
maven3-interceptor-commons.jar already up to date
[trunk] $ /home/jenkins/tools/java/latest1.6/bin/java -Xmx1280m -XX:MaxPermSize=512m -cp /home/jenkins/jenkins-slave/maven3-agent.jar:/home/jenkins/tools/maven/apache-maven-3.0.4/boot/plexus-classworlds-2.4.jar
org.jvnet.hudson.maven3.agent.Maven3Main /home/jenkins/tools/maven/apache-maven-3.0.4 /home/jenkins/jenkins-slave/slave.jar
/home/jenkins/jenkins-slave/maven3-interceptor.jar /home/jenkins/jenkins-slave/maven3-interceptor-commons.jar
33881
<===[JENKINS REMOTING CAPACITY]===>   channel started
ERROR: [JENKINS-18403] JDK 5 not supported to run Maven; retrying with slave Java and setting
compile/test properties to point to /home/jenkins/tools/java/latest1.6
Established TCP socket on 39325
maven3-agent.jar already up to date
maven3-interceptor.jar already up to date
maven3-interceptor-commons.jar already up to date
[trunk] $ /usr/local/jenkins/java/jdk1.7.0_55/jre/bin/java -Xmx1280m -XX:MaxPermSize=512m
-cp /home/jenkins/jenkins-slave/maven3-agent.jar:/home/jenkins/tools/maven/apache-maven-3.0.4/boot/plexus-classworlds-2.4.jar
org.jvnet.hudson.maven3.agent.Maven3Main /home/jenkins/tools/maven/apache-maven-3.0.4 /home/jenkins/jenkins-slave/slave.jar
/home/jenkins/jenkins-slave/maven3-interceptor.jar /home/jenkins/jenkins-slave/maven3-interceptor-commons.jar
39325
<===[JENKINS REMOTING CAPACITY]===>   channel started
Executing Maven:  -B -f <https://builds.apache.org/job/OpenJPA-trunk/ws/trunk/pom.xml>
-Dmaven.repo.local=/home/jenkins/jenkins-slave/maven-repositories/1 clean install
[INFO] Scanning for projects...
[INFO] ------------------------------------------------------------------------
[INFO] Reactor Build Order:
[INFO] 
[INFO] OpenJPA Parent POM
[INFO] OpenJPA Utilities Library
[INFO] OpenJPA Kernel
[INFO] OpenJPA JDBC
[INFO] OpenJPA Persistence
[INFO] OpenJPA Persistence JDBC
[INFO] OpenJPA Persistence Locking Tests
[INFO] OpenJPA tools
[INFO] OpenJPA Maven Plugin
[INFO] OpenJPA XML Store
[INFO] OpenJPA Slice
[INFO] OpenJPA JEST
[INFO] OpenJPA Aggregate Jar
[INFO] OpenJPA Aggregate Jar with Dependencies
[INFO] OpenJPA Project Docs and Assemblies
[INFO] OpenJPA Examples
[INFO] OpenJPA Examples - Simple
[INFO] OpenJPA Examples - image-gallery
[INFO] OpenJPA Examples - OpenBooks
[INFO] OpenJPA Integration Tests
[INFO] OpenJPA Integration Tests - Daytrader
[INFO] OpenJPA Integration Tests - Examples
[INFO] OpenJPA Integration Tests - SLF4JLogFactory
[INFO] OpenJPA Integration Tests - JPA TCK
[INFO] OpenJPA Integration Tests - Bean Validation
[INFO] OpenJPA Integration Tests - JMX Platform MBeans
[INFO] OpenJPA Fetching Statistic Tool
[INFO] OpenJPA Fetching Statistic Tool -- WAS Bundle
[INFO]                                                                         
[INFO] ------------------------------------------------------------------------
[INFO] Building OpenJPA Parent POM 3.0.0-SNAPSHOT
[INFO] ------------------------------------------------------------------------
[INFO] 
[INFO] --- maven-clean-plugin:3.0.0:clean (default-clean) @ openjpa-parent ---
[INFO] Deleting <https://builds.apache.org/job/OpenJPA-trunk/ws/trunk/target>
[INFO] 
[INFO] --- buildnumber-maven-plugin:1.4:create (default) @ openjpa-parent ---
[INFO] Executing: /bin/sh -c cd '<https://builds.apache.org/job/OpenJPA-trunk/ws/trunk'>
&& 'svn' '--non-interactive' 'info'
[INFO] Working directory: <https://builds.apache.org/job/OpenJPA-trunk/ws/trunk>
[INFO] Storing buildNumber: 1757902 at timestamp: August 26, 2016 at 6:12 PM
[INFO] Executing: /bin/sh -c cd '<https://builds.apache.org/job/OpenJPA-trunk/ws/trunk'>
&& 'svn' '--non-interactive' 'info'
[INFO] Working directory: <https://builds.apache.org/job/OpenJPA-trunk/ws/trunk>
[INFO] Storing buildScmBranch: trunk
[INFO] 
[INFO] --- maven-enforcer-plugin:1.4.1:enforce (default) @ openjpa-parent ---
[INFO] 
[INFO] --- maven-checkstyle-plugin:2.9:checkstyle (default) @ openjpa-parent ---
Setting property: classpath.resource.loader.class => 'org.codehaus.plexus.velocity.ContextClassLoaderResourceLoader'.
Setting property: site.resource.loader.class => 'org.codehaus.plexus.velocity.SiteResourceLoader'.
Setting property: velocimacro.messages.on => 'false'.
Setting property: resource.loader => 'classpath,site'.
Setting property: runtime.log.invalid.references => 'false'.
Setting property: resource.manager.logwhenfound => 'false'.
Setting property: velocimacro.permissions.allow.inline.to.replace.global => 'true'.
Setting property: classpath.resource.loader.class => 'org.codehaus.plexus.velocity.ContextClassLoaderResourceLoader'.
Setting property: site.resource.loader.class => 'org.codehaus.plexus.velocity.SiteResourceLoader'.
Setting property: velocimacro.messages.on => 'false'.
Setting property: resource.loader => 'classpath,site'.
Setting property: runtime.log.invalid.references => 'false'.
Setting property: resource.manager.logwhenfound => 'false'.
[INFO] 
[INFO] --- maven-remote-resources-plugin:1.5:process (process-resource-bundles) @ openjpa-parent
---
[INFO] 
[INFO] --- maven-compiler-plugin:3.5.1:testCompile (test-source-compile) @ openjpa-parent
---
[INFO] No sources to compile
[INFO] 
[INFO] --- maven-site-plugin:3.5.1:attach-descriptor (attach-descriptor) @ openjpa-parent
---
[INFO] 
[INFO] --- ianal-maven-plugin:1.0-alpha-1:verify-legal-files (default) @ openjpa-parent ---
[INFO] 
[INFO] --- apache-rat-plugin:0.11:check (default) @ openjpa-parent ---
[INFO] 51 implicit excludes (use -debug for more details).
[INFO] Exclude: **/.*/**
[INFO] Exclude: **/target/**/*
[INFO] 4925 resources included (use -debug for more details)
[INFO] Rat check: Summary of files. Unapproved: 0 unknown: 0 generated: 0 approved: 4916 licence.
[INFO] 
[INFO] --- maven-install-plugin:2.5.2:install (default-install) @ openjpa-parent ---
[INFO] Installing <https://builds.apache.org/job/OpenJPA-trunk/ws/trunk/pom.xml> to
/home/jenkins/jenkins-slave/maven-repositories/1/org/apache/openjpa/openjpa-parent/3.0.0-SNAPSHOT/openjpa-parent-3.0.0-SNAPSHOT.pom
[INFO] Installing <https://builds.apache.org/job/OpenJPA-trunk/ws/trunk/target/openjpa-parent-3.0.0-SNAPSHOT-site.xml>
to /home/jenkins/jenkins-slave/maven-repositories/1/org/apache/openjpa/openjpa-parent/3.0.0-SNAPSHOT/openjpa-parent-3.0.0-SNAPSHOT-site.xml
[INFO]                                                                         
[INFO] ------------------------------------------------------------------------
[INFO] Building OpenJPA Utilities Library 3.0.0-SNAPSHOT
[INFO] ------------------------------------------------------------------------
[INFO] 
[INFO] --- maven-clean-plugin:3.0.0:clean (default-clean) @ openjpa-lib ---
[INFO] Deleting <https://builds.apache.org/job/OpenJPA-trunk/ws/trunk/openjpa-lib/target>
[INFO] 
[INFO] --- buildnumber-maven-plugin:1.4:create (default) @ openjpa-lib ---
[INFO] 
[INFO] --- maven-enforcer-plugin:1.4.1:enforce (default) @ openjpa-lib ---
[INFO] 
[INFO] --- maven-checkstyle-plugin:2.9:checkstyle (default) @ openjpa-lib ---
[INFO] Starting audit...
Audit done.

[WARNING] Unable to locate Source XRef to link to - DISABLED
[ERROR] VM #image: error : too few arguments to macro. Wanted 5 got 0
[ERROR] VM #image: error : too few arguments to macro. Wanted 5 got 0
[ERROR] VM #displayTree: error : too few arguments to macro. Wanted 2 got 0
[ERROR] VM #menuItem: error : too few arguments to macro. Wanted 1 got 0
[INFO] 
[INFO] --- maven-remote-resources-plugin:1.5:process (process-resource-bundles) @ openjpa-lib
---
[INFO] 
[INFO] --- maven-resources-plugin:2.7:resources (default-resources) @ openjpa-lib ---
[INFO] Using 'UTF-8' encoding to copy filtered resources.
[INFO] Copying 9 resources
[INFO] Copying 3 resources
[INFO] 
[INFO] --- maven-compiler-plugin:3.5.1:compile (default-compile) @ openjpa-lib ---
[INFO] Changes detected - recompiling the module!
[INFO] Compiling 160 source files to <https://builds.apache.org/job/OpenJPA-trunk/ws/trunk/openjpa-lib/target/classes>
[INFO] -------------------------------------------------------------
[ERROR] COMPILATION ERROR : 
[INFO] -------------------------------------------------------------
[ERROR] javac: invalid target release: 1.7
Usage: javac <options> <source files>
use -help for a list of possible options

[INFO] 1 error
[INFO] -------------------------------------------------------------
[INFO] ------------------------------------------------------------------------
[INFO] Reactor Summary:
[INFO] 
[INFO] OpenJPA Parent POM ................................ SUCCESS [1:23.049s]
[INFO] OpenJPA Utilities Library ......................... FAILURE [4.983s]
[INFO] OpenJPA Kernel .................................... SKIPPED
[INFO] OpenJPA JDBC ...................................... SKIPPED
[INFO] OpenJPA Persistence ............................... SKIPPED
[INFO] OpenJPA Persistence JDBC .......................... SKIPPED
[INFO] OpenJPA Persistence Locking Tests ................. SKIPPED
[INFO] OpenJPA tools ..................................... SKIPPED
[INFO] OpenJPA Maven Plugin .............................. SKIPPED
[INFO] OpenJPA XML Store ................................. SKIPPED
[INFO] OpenJPA Slice ..................................... SKIPPED
[INFO] OpenJPA JEST ...................................... SKIPPED
[INFO] OpenJPA Aggregate Jar ............................. SKIPPED
[INFO] OpenJPA Aggregate Jar with Dependencies ........... SKIPPED
[INFO] OpenJPA Project Docs and Assemblies ............... SKIPPED
[INFO] OpenJPA Examples .................................. SKIPPED
[INFO] OpenJPA Examples - Simple ......................... SKIPPED
[INFO] OpenJPA Examples - image-gallery .................. SKIPPED
[INFO] OpenJPA Examples - OpenBooks ...................... SKIPPED
[INFO] OpenJPA Integration Tests ......................... SKIPPED
[INFO] OpenJPA Integration Tests - Daytrader ............. SKIPPED
[INFO] OpenJPA Integration Tests - Examples .............. SKIPPED
[INFO] OpenJPA Integration Tests - SLF4JLogFactory ....... SKIPPED
[INFO] OpenJPA Integration Tests - JPA TCK ............... SKIPPED
[INFO] OpenJPA Integration Tests - Bean Validation ....... SKIPPED
[INFO] OpenJPA Integration Tests - JMX Platform MBeans ... SKIPPED
[INFO] OpenJPA Fetching Statistic Tool ................... SKIPPED
[INFO] OpenJPA Fetching Statistic Tool -- WAS Bundle ..... SKIPPED
[INFO] ------------------------------------------------------------------------
[INFO] BUILD FAILURE
[INFO] ------------------------------------------------------------------------
[INFO] Total time: 1:32.525s
[INFO] Finished at: Fri Aug 26 18:14:16 UTC 2016
[INFO] Final Memory: 35M/724M
[INFO] ------------------------------------------------------------------------
Waiting for Jenkins to finish collecting data[ERROR] Failed to execute goal org.apache.maven.plugins:maven-compiler-plugin:3.5.1:compile
(default-compile) on project openjpa-lib: Compilation failure
[ERROR] javac: invalid target release: 1.7
[ERROR] Usage: javac <options> <source files>
[ERROR] use -help for a list of possible options
[ERROR] -> [Help 1]
[ERROR] 
[ERROR] To see the full stack trace of the errors, re-run Maven with the -e switch.
[ERROR] Re-run Maven using the -X switch to enable full debug logging.
[ERROR] 
[ERROR] For more information about the errors and possible solutions, please read the following
articles:
[ERROR] [Help 1] http://cwiki.apache.org/confluence/display/MAVEN/MojoFailureException
[ERROR] 
[ERROR] After correcting the problems, you can resume the build with the command
[ERROR]   mvn <goals> -rf :openjpa-lib

[JENKINS] Archiving <https://builds.apache.org/job/OpenJPA-trunk/ws/trunk/openjpa-persistence-jdbc/pom.xml>
to org.apache.openjpa/openjpa-persistence-jdbc/3.0.0-SNAPSHOT/openjpa-persistence-jdbc-3.0.0-SNAPSHOT.pom
Compressed 58.16 KB of artifacts by 55.0% relative to #1061
[JENKINS] Archiving <https://builds.apache.org/job/OpenJPA-trunk/ws/trunk/openjpa-examples/openbooks/pom.xml>
to org.apache.openjpa.openjpa-examples/openbooks/3.0.0-SNAPSHOT/openbooks-3.0.0-SNAPSHOT.pom
[JENKINS] Archiving <https://builds.apache.org/job/OpenJPA-trunk/ws/trunk/openjpa-integration/validation/pom.xml>
to org.apache.openjpa/openjpa-integration-validation/3.0.0-SNAPSHOT/openjpa-integration-validation-3.0.0-SNAPSHOT.pom
[JENKINS] Archiving <https://builds.apache.org/job/OpenJPA-trunk/ws/trunk/openjpa-tools/pom.xml>
to org.apache.openjpa/openjpa-tools/3.0.0-SNAPSHOT/openjpa-tools-3.0.0-SNAPSHOT.pom
[JENKINS] Archiving <https://builds.apache.org/job/OpenJPA-trunk/ws/trunk/openjpa-persistence/pom.xml>
to org.apache.openjpa/openjpa-persistence/3.0.0-SNAPSHOT/openjpa-persistence-3.0.0-SNAPSHOT.pom
[JENKINS] Archiving <https://builds.apache.org/job/OpenJPA-trunk/ws/trunk/openjpa-integration/slf4j/pom.xml>
to org.apache.openjpa/openjpa-integration-slf4j/3.0.0-SNAPSHOT/openjpa-integration-slf4j-3.0.0-SNAPSHOT.pom
[JENKINS] Archiving <https://builds.apache.org/job/OpenJPA-trunk/ws/trunk/openjpa-jest/pom.xml>
to org.apache.openjpa/openjpa-jest/3.0.0-SNAPSHOT/openjpa-jest-3.0.0-SNAPSHOT.pom
[JENKINS] Archiving <https://builds.apache.org/job/OpenJPA-trunk/ws/trunk/openjpa-lib/pom.xml>
to org.apache.openjpa/openjpa-lib/3.0.0-SNAPSHOT/openjpa-lib-3.0.0-SNAPSHOT.pom
[JENKINS] Archiving <https://builds.apache.org/job/OpenJPA-trunk/ws/trunk/openjpa-tools/openjpa-fetch-statistics/pom.xml>
to org.apache.openjpa/openjpa-fetch-statistics/3.0.0-SNAPSHOT/openjpa-fetch-statistics-3.0.0-SNAPSHOT.pom
[JENKINS] Archiving <https://builds.apache.org/job/OpenJPA-trunk/ws/trunk/openjpa-integration/pom.xml>
to org.apache.openjpa/openjpa-integration/3.0.0-SNAPSHOT/openjpa-integration-3.0.0-SNAPSHOT.pom
[JENKINS] Archiving <https://builds.apache.org/job/OpenJPA-trunk/ws/trunk/openjpa-examples/image-gallery/pom.xml>
to org.apache.openjpa.openjpa-examples/image-gallery/3.0.0-SNAPSHOT/image-gallery-3.0.0-SNAPSHOT.pom
[JENKINS] Archiving <https://builds.apache.org/job/OpenJPA-trunk/ws/trunk/openjpa-examples/pom.xml>
to org.apache.openjpa/openjpa-examples/3.0.0-SNAPSHOT/openjpa-examples-3.0.0-SNAPSHOT.pom
[JENKINS] Archiving <https://builds.apache.org/job/OpenJPA-trunk/ws/trunk/openjpa-integration/examples/pom.xml>
to org.apache.openjpa/openjpa-integration-examples/3.0.0-SNAPSHOT/openjpa-integration-examples-3.0.0-SNAPSHOT.pom
[JENKINS] Archiving <https://builds.apache.org/job/OpenJPA-trunk/ws/trunk/openjpa-persistence-locking/pom.xml>
to org.apache.openjpa/openjpa-persistence-locking/3.0.0-SNAPSHOT/openjpa-persistence-locking-3.0.0-SNAPSHOT.pom
[JENKINS] Archiving <https://builds.apache.org/job/OpenJPA-trunk/ws/trunk/openjpa-tools/openjpa-fetch-statistics-was/pom.xml>
to org.apache.openjpa/openjpa-fetch-statistics-was/3.0.0-SNAPSHOT/openjpa-fetch-statistics-was-3.0.0-SNAPSHOT.pom
[JENKINS] Archiving <https://builds.apache.org/job/OpenJPA-trunk/ws/trunk/openjpa-xmlstore/pom.xml>
to org.apache.openjpa/openjpa-xmlstore/3.0.0-SNAPSHOT/openjpa-xmlstore-3.0.0-SNAPSHOT.pom
[JENKINS] Archiving <https://builds.apache.org/job/OpenJPA-trunk/ws/trunk/openjpa-integration/tck/pom.xml>
to org.apache.openjpa/openjpa-integration-tck/3.0.0-SNAPSHOT/openjpa-integration-tck-3.0.0-SNAPSHOT.pom
[JENKINS] Archiving <https://builds.apache.org/job/OpenJPA-trunk/ws/trunk/openjpa-all/pom.xml>
to org.apache.openjpa/openjpa-all/3.0.0-SNAPSHOT/openjpa-all-3.0.0-SNAPSHOT.pom
[JENKINS] Archiving <https://builds.apache.org/job/OpenJPA-trunk/ws/trunk/openjpa/pom.xml>
to org.apache.openjpa/openjpa/3.0.0-SNAPSHOT/openjpa-3.0.0-SNAPSHOT.pom
[JENKINS] Archiving <https://builds.apache.org/job/OpenJPA-trunk/ws/trunk/openjpa-examples/simple/pom.xml>
to org.apache.openjpa.openjpa-examples/simple/3.0.0-SNAPSHOT/simple-3.0.0-SNAPSHOT.pom
[JENKINS] Archiving <https://builds.apache.org/job/OpenJPA-trunk/ws/trunk/openjpa-jdbc/pom.xml>
to org.apache.openjpa/openjpa-jdbc/3.0.0-SNAPSHOT/openjpa-jdbc-3.0.0-SNAPSHOT.pom
[JENKINS] Archiving <https://builds.apache.org/job/OpenJPA-trunk/ws/trunk/openjpa-integration/daytrader/pom.xml>
to org.apache.openjpa/openjpa-integration-daytrader/3.0.0-SNAPSHOT/openjpa-integration-daytrader-3.0.0-SNAPSHOT.pom
[JENKINS] Archiving <https://builds.apache.org/job/OpenJPA-trunk/ws/trunk/openjpa-kernel/pom.xml>
to org.apache.openjpa/openjpa-kernel/3.0.0-SNAPSHOT/openjpa-kernel-3.0.0-SNAPSHOT.pom
[JENKINS] Archiving <https://builds.apache.org/job/OpenJPA-trunk/ws/trunk/openjpa-integration/jmx/pom.xml>
to org.apache.openjpa/openjpa-integration-jmx/3.0.0-SNAPSHOT/openjpa-integration-jmx-3.0.0-SNAPSHOT.pom
[JENKINS] Archiving <https://builds.apache.org/job/OpenJPA-trunk/ws/trunk/openjpa-project/pom.xml>
to org.apache.openjpa/apache-openjpa/3.0.0-SNAPSHOT/apache-openjpa-3.0.0-SNAPSHOT.pom
[JENKINS] Archiving <https://builds.apache.org/job/OpenJPA-trunk/ws/trunk/openjpa-tools/openjpa-maven-plugin/pom.xml>
to org.apache.openjpa/openjpa-maven-plugin/3.0.0-SNAPSHOT/openjpa-maven-plugin-3.0.0-SNAPSHOT.pom
[JENKINS] Archiving <https://builds.apache.org/job/OpenJPA-trunk/ws/trunk/openjpa-slice/pom.xml>
to org.apache.openjpa/openjpa-slice/3.0.0-SNAPSHOT/openjpa-slice-3.0.0-SNAPSHOT.pom
[JENKINS] Archiving <https://builds.apache.org/job/OpenJPA-trunk/ws/trunk/pom.xml> to
org.apache.openjpa/openjpa-parent/3.0.0-SNAPSHOT/openjpa-parent-3.0.0-SNAPSHOT.pom
[JENKINS] Archiving <https://builds.apache.org/job/OpenJPA-trunk/ws/trunk/target/openjpa-parent-3.0.0-SNAPSHOT-site.xml>
to org.apache.openjpa/openjpa-parent/3.0.0-SNAPSHOT/openjpa-parent-3.0.0-SNAPSHOT-site.xml
Sending e-mails to: commits@openjpa.apache.org
channel stopped

Mime
View raw message