openjpa-commits mailing list archives

Site index · List index
Message view « Date » · « Thread »
Top « Date » · « Thread »
From Apache Jenkins Server <jenk...@builds.apache.org>
Subject Build failed in Jenkins: OpenJPA-trunk #1094
Date Mon, 27 Feb 2017 16:00:32 GMT
See <https://builds.apache.org/job/OpenJPA-trunk/1094/display/redirect?page=changes>

Changes:

[struberg] OPENJPA-2689 prevent IllegalArgumentException with package scoped OraclePreparedStatementWrapper
classes

------------------------------------------
[...truncated 2.26 MB...]
Downloading: http://repo.maven.apache.org/maven2/org/apache/karaf/deployer/org.apache.karaf.deployer.kar/4.1.0/org.apache.karaf.deployer.kar-4.1.0.pom
Downloaded: http://repo.maven.apache.org/maven2/org/apache/karaf/deployer/org.apache.karaf.deployer.kar/4.1.0/org.apache.karaf.deployer.kar-4.1.0.pom
(5 KB at 295.2 KB/sec)
Downloading: http://repo.maven.apache.org/maven2/org/apache/karaf/kar/org.apache.karaf.kar.core/4.1.0/org.apache.karaf.kar.core-4.1.0.pom
Downloaded: http://repo.maven.apache.org/maven2/org/apache/karaf/kar/org.apache.karaf.kar.core/4.1.0/org.apache.karaf.kar.core-4.1.0.pom
(5 KB at 53.8 KB/sec)
Downloading: http://repo.maven.apache.org/maven2/org/apache/karaf/shell/org.apache.karaf.shell.console/4.1.0/org.apache.karaf.shell.console-4.1.0.pom
Downloaded: http://repo.maven.apache.org/maven2/org/apache/karaf/shell/org.apache.karaf.shell.console/4.1.0/org.apache.karaf.shell.console-4.1.0.pom
(10 KB at 102.8 KB/sec)
Downloading: http://repo.maven.apache.org/maven2/org/apache/karaf/shell/shell/4.1.0/shell-4.1.0.pom
Downloaded: http://repo.maven.apache.org/maven2/org/apache/karaf/shell/shell/4.1.0/shell-4.1.0.pom
(2 KB at 18.8 KB/sec)
Downloading: http://repo.maven.apache.org/maven2/org/apache/karaf/jaas/org.apache.karaf.jaas.modules/4.1.0/org.apache.karaf.jaas.modules-4.1.0.pom
Downloaded: http://repo.maven.apache.org/maven2/org/apache/karaf/jaas/org.apache.karaf.jaas.modules/4.1.0/org.apache.karaf.jaas.modules-4.1.0.pom
(7 KB at 386.7 KB/sec)
Downloading: http://repo.maven.apache.org/maven2/org/apache/karaf/jaas/org.apache.karaf.jaas.config/4.1.0/org.apache.karaf.jaas.config-4.1.0.pom
Downloaded: http://repo.maven.apache.org/maven2/org/apache/karaf/jaas/org.apache.karaf.jaas.config/4.1.0/org.apache.karaf.jaas.config-4.1.0.pom
(5 KB at 53.5 KB/sec)
Downloading: http://repo.maven.apache.org/maven2/org/apache/karaf/shell/org.apache.karaf.shell.core/4.1.0/org.apache.karaf.shell.core-4.1.0.pom
Downloaded: http://repo.maven.apache.org/maven2/org/apache/karaf/shell/org.apache.karaf.shell.core/4.1.0/org.apache.karaf.shell.core-4.1.0.pom
(8 KB at 82.3 KB/sec)
Downloading: http://repo.maven.apache.org/maven2/org/apache/sshd/sshd-core/1.2.0/sshd-core-1.2.0.pom
Downloaded: http://repo.maven.apache.org/maven2/org/apache/sshd/sshd-core/1.2.0/sshd-core-1.2.0.pom
(9 KB at 514.5 KB/sec)
Downloading: http://repo.maven.apache.org/maven2/org/apache/sshd/sshd/1.2.0/sshd-1.2.0.pom
Downloaded: http://repo.maven.apache.org/maven2/org/apache/sshd/sshd/1.2.0/sshd-1.2.0.pom
(50 KB at 2620.9 KB/sec)
Downloading: http://repo.maven.apache.org/maven2/org/apache/karaf/tooling/org.apache.karaf.tools.utils/4.1.0/org.apache.karaf.tools.utils-4.1.0.jar
Downloading: http://repo.maven.apache.org/maven2/org/apache/karaf/profile/org.apache.karaf.profile.core/4.1.0/org.apache.karaf.profile.core-4.1.0.jar
Downloading: http://repo.maven.apache.org/maven2/org/apache/karaf/deployer/org.apache.karaf.deployer.spring/4.1.0/org.apache.karaf.deployer.spring-4.1.0.jar
Downloading: http://repo.maven.apache.org/maven2/org/apache/karaf/deployer/org.apache.karaf.deployer.blueprint/4.1.0/org.apache.karaf.deployer.blueprint-4.1.0.jar
Downloading: http://repo.maven.apache.org/maven2/org/apache/karaf/deployer/org.apache.karaf.deployer.features/4.1.0/org.apache.karaf.deployer.features-4.1.0.jar
Downloaded: http://repo.maven.apache.org/maven2/org/apache/karaf/tooling/org.apache.karaf.tools.utils/4.1.0/org.apache.karaf.tools.utils-4.1.0.jar
(27 KB at 1380.4 KB/sec)
Downloading: http://repo.maven.apache.org/maven2/org/apache/karaf/deployer/org.apache.karaf.deployer.kar/4.1.0/org.apache.karaf.deployer.kar-4.1.0.jar
Downloaded: http://repo.maven.apache.org/maven2/org/apache/karaf/profile/org.apache.karaf.profile.core/4.1.0/org.apache.karaf.profile.core-4.1.0.jar
(177 KB at 6800.3 KB/sec)
Downloading: http://repo.maven.apache.org/maven2/org/apache/karaf/kar/org.apache.karaf.kar.core/4.1.0/org.apache.karaf.kar.core-4.1.0.jar
Downloaded: http://repo.maven.apache.org/maven2/org/apache/karaf/deployer/org.apache.karaf.deployer.spring/4.1.0/org.apache.karaf.deployer.spring-4.1.0.jar
(40 KB at 1636.4 KB/sec)
Downloading: http://repo.maven.apache.org/maven2/org/apache/karaf/shell/org.apache.karaf.shell.console/4.1.0/org.apache.karaf.shell.console-4.1.0.jar
Downloaded: http://repo.maven.apache.org/maven2/org/apache/karaf/deployer/org.apache.karaf.deployer.kar/4.1.0/org.apache.karaf.deployer.kar-4.1.0.jar
(22 KB at 1457.4 KB/sec)
Downloading: http://repo.maven.apache.org/maven2/org/apache/karaf/jaas/org.apache.karaf.jaas.modules/4.1.0/org.apache.karaf.jaas.modules-4.1.0.jar
Downloaded: http://repo.maven.apache.org/maven2/org/apache/karaf/kar/org.apache.karaf.kar.core/4.1.0/org.apache.karaf.kar.core-4.1.0.jar
(75 KB at 4140.2 KB/sec)
Downloading: http://repo.maven.apache.org/maven2/org/apache/karaf/jaas/org.apache.karaf.jaas.config/4.1.0/org.apache.karaf.jaas.config-4.1.0.jar
Downloaded: http://repo.maven.apache.org/maven2/org/apache/karaf/jaas/org.apache.karaf.jaas.config/4.1.0/org.apache.karaf.jaas.config-4.1.0.jar
(42 KB at 2934.2 KB/sec)
Downloading: http://repo.maven.apache.org/maven2/org/apache/karaf/shell/org.apache.karaf.shell.core/4.1.0/org.apache.karaf.shell.core-4.1.0.jar
Downloaded: http://repo.maven.apache.org/maven2/org/apache/karaf/shell/org.apache.karaf.shell.console/4.1.0/org.apache.karaf.shell.console-4.1.0.jar
(212 KB at 5557.9 KB/sec)
Downloading: http://repo.maven.apache.org/maven2/org/apache/sshd/sshd-core/1.2.0/sshd-core-1.2.0.jar
Downloaded: http://repo.maven.apache.org/maven2/org/apache/karaf/shell/org.apache.karaf.shell.core/4.1.0/org.apache.karaf.shell.core-4.1.0.jar
(587 KB at 13958.7 KB/sec)
Downloaded: http://repo.maven.apache.org/maven2/org/apache/karaf/jaas/org.apache.karaf.jaas.modules/4.1.0/org.apache.karaf.jaas.modules-4.1.0.jar
(1211 KB at 16364.2 KB/sec)
Downloaded: http://repo.maven.apache.org/maven2/org/apache/karaf/deployer/org.apache.karaf.deployer.blueprint/4.1.0/org.apache.karaf.deployer.blueprint-4.1.0.jar
(40 KB at 312.7 KB/sec)
Downloaded: http://repo.maven.apache.org/maven2/org/apache/karaf/deployer/org.apache.karaf.deployer.features/4.1.0/org.apache.karaf.deployer.features-4.1.0.jar
(41 KB at 325.9 KB/sec)
Downloaded: http://repo.maven.apache.org/maven2/org/apache/sshd/sshd-core/1.2.0/sshd-core-1.2.0.jar
(1547 KB at 15162.3 KB/sec)
[WARNING] Error injecting: org.apache.karaf.tooling.features.GenerateDescriptorMojo
java.lang.TypeNotPresentException: Type org.apache.karaf.tooling.features.GenerateDescriptorMojo
not present
	at org.sonatype.guice.bean.reflect.URLClassSpace.loadClass(URLClassSpace.java:109)
	at org.sonatype.guice.bean.reflect.NamedClass.load(NamedClass.java:45)
	at org.sonatype.guice.bean.reflect.AbstractDeferredClass.get(AbstractDeferredClass.java:45)
	at com.google.inject.internal.ProviderInternalFactory.provision(ProviderInternalFactory.java:84)
	at com.google.inject.internal.InternalFactoryToInitializableAdapter.provision(InternalFactoryToInitializableAdapter.java:52)
	at com.google.inject.internal.ProviderInternalFactory$1.call(ProviderInternalFactory.java:70)
	at com.google.inject.internal.ProvisionListenerStackCallback$Provision.provision(ProvisionListenerStackCallback.java:100)
	at org.sonatype.guice.plexus.lifecycles.PlexusLifecycleManager.onProvision(PlexusLifecycleManager.java:138)
	at com.google.inject.internal.ProvisionListenerStackCallback$Provision.provision(ProvisionListenerStackCallback.java:108)
	at com.google.inject.internal.ProvisionListenerStackCallback.provision(ProvisionListenerStackCallback.java:55)
	at com.google.inject.internal.ProviderInternalFactory.circularGet(ProviderInternalFactory.java:68)
	at com.google.inject.internal.InternalFactoryToInitializableAdapter.get(InternalFactoryToInitializableAdapter.java:45)
	at com.google.inject.internal.InjectorImpl$3$1.call(InjectorImpl.java:965)
	at com.google.inject.internal.InjectorImpl.callInContext(InjectorImpl.java:1011)
	at com.google.inject.internal.InjectorImpl$3.get(InjectorImpl.java:961)
	at com.google.inject.Scopes$1$1.get(Scopes.java:59)
	at org.sonatype.guice.bean.locators.LazyBeanEntry.getValue(LazyBeanEntry.java:83)
	at org.sonatype.guice.plexus.locators.LazyPlexusBean.getValue(LazyPlexusBean.java:49)
	at org.codehaus.plexus.DefaultPlexusContainer.lookup(DefaultPlexusContainer.java:253)
	at org.codehaus.plexus.DefaultPlexusContainer.lookup(DefaultPlexusContainer.java:245)
	at org.apache.maven.plugin.internal.DefaultMavenPluginManager.getConfiguredMojo(DefaultMavenPluginManager.java:455)
	at org.apache.maven.plugin.DefaultBuildPluginManager.executeMojo(DefaultBuildPluginManager.java:92)
	at org.apache.maven.lifecycle.internal.MojoExecutor.execute(MojoExecutor.java:209)
	at org.apache.maven.lifecycle.internal.MojoExecutor.execute(MojoExecutor.java:153)
	at org.apache.maven.lifecycle.internal.MojoExecutor.execute(MojoExecutor.java:145)
	at org.apache.maven.lifecycle.internal.LifecycleModuleBuilder.buildProject(LifecycleModuleBuilder.java:84)
	at org.apache.maven.lifecycle.internal.LifecycleModuleBuilder.buildProject(LifecycleModuleBuilder.java:59)
	at org.apache.maven.lifecycle.internal.LifecycleStarter.singleThreadedBuild(LifecycleStarter.java:183)
	at org.apache.maven.lifecycle.internal.LifecycleStarter.execute(LifecycleStarter.java:161)
	at org.apache.maven.DefaultMaven.doExecute(DefaultMaven.java:320)
	at org.apache.maven.DefaultMaven.execute(DefaultMaven.java:156)
	at org.jvnet.hudson.maven3.launcher.Maven3Launcher.main(Maven3Launcher.java:117)
	at sun.reflect.NativeMethodAccessorImpl.invoke0(Native Method)
	at sun.reflect.NativeMethodAccessorImpl.invoke(NativeMethodAccessorImpl.java:57)
	at sun.reflect.DelegatingMethodAccessorImpl.invoke(DelegatingMethodAccessorImpl.java:43)
	at java.lang.reflect.Method.invoke(Method.java:606)
	at org.codehaus.plexus.classworlds.launcher.Launcher.launchStandard(Launcher.java:329)
	at org.codehaus.plexus.classworlds.launcher.Launcher.launch(Launcher.java:239)
	at org.jvnet.hudson.maven3.agent.Maven3Main.launch(Maven3Main.java:181)
	at sun.reflect.NativeMethodAccessorImpl.invoke0(Native Method)
	at sun.reflect.NativeMethodAccessorImpl.invoke(NativeMethodAccessorImpl.java:57)
	at sun.reflect.DelegatingMethodAccessorImpl.invoke(DelegatingMethodAccessorImpl.java:43)
	at java.lang.reflect.Method.invoke(Method.java:606)
	at hudson.maven.Maven3Builder.call(Maven3Builder.java:139)
	at hudson.maven.Maven3Builder.call(Maven3Builder.java:70)
	at hudson.remoting.UserRequest.perform(UserRequest.java:153)
	at hudson.remoting.UserRequest.perform(UserRequest.java:50)
	at hudson.remoting.Request$2.run(Request.java:336)
	at hudson.remoting.InterceptingExecutorService$1.call(InterceptingExecutorService.java:68)
	at java.util.concurrent.FutureTask.run(FutureTask.java:262)
	at java.util.concurrent.ThreadPoolExecutor.runWorker(ThreadPoolExecutor.java:1145)
	at java.util.concurrent.ThreadPoolExecutor$Worker.run(ThreadPoolExecutor.java:615)
	at java.lang.Thread.run(Thread.java:745)
Caused by: java.lang.UnsupportedClassVersionError: org/apache/karaf/tooling/features/GenerateDescriptorMojo
: Unsupported major.minor version 52.0
	at java.lang.ClassLoader.defineClass1(Native Method)
	at java.lang.ClassLoader.defineClass(ClassLoader.java:800)
	at java.security.SecureClassLoader.defineClass(SecureClassLoader.java:142)
	at java.net.URLClassLoader.defineClass(URLClassLoader.java:449)
	at java.net.URLClassLoader.access$100(URLClassLoader.java:71)
	at java.net.URLClassLoader$1.run(URLClassLoader.java:361)
	at java.net.URLClassLoader$1.run(URLClassLoader.java:355)
	at java.security.AccessController.doPrivileged(Native Method)
	at java.net.URLClassLoader.findClass(URLClassLoader.java:354)
	at org.codehaus.plexus.classworlds.realm.ClassRealm.loadClassFromSelf(ClassRealm.java:386)
	at org.codehaus.plexus.classworlds.strategy.SelfFirstStrategy.loadClass(SelfFirstStrategy.java:42)
	at org.codehaus.plexus.classworlds.realm.ClassRealm.loadClass(ClassRealm.java:244)
	at org.codehaus.plexus.classworlds.realm.ClassRealm.loadClass(ClassRealm.java:230)
	at org.sonatype.guice.bean.reflect.URLClassSpace.loadClass(URLClassSpace.java:101)
	... 52 more
java.lang.reflect.InvocationTargetException
	at sun.reflect.NativeMethodAccessorImpl.invoke0(Native Method)
	at sun.reflect.NativeMethodAccessorImpl.invoke(NativeMethodAccessorImpl.java:57)
	at sun.reflect.DelegatingMethodAccessorImpl.invoke(DelegatingMethodAccessorImpl.java:43)
	at java.lang.reflect.Method.invoke(Method.java:606)
	at org.codehaus.plexus.classworlds.launcher.Launcher.launchStandard(Launcher.java:329)
	at org.codehaus.plexus.classworlds.launcher.Launcher.launch(Launcher.java:239)
	at org.jvnet.hudson.maven3.agent.Maven3Main.launch(Maven3Main.java:181)
	at sun.reflect.NativeMethodAccessorImpl.invoke0(Native Method)
	at sun.reflect.NativeMethodAccessorImpl.invoke(NativeMethodAccessorImpl.java:57)
	at sun.reflect.DelegatingMethodAccessorImpl.invoke(DelegatingMethodAccessorImpl.java:43)
	at java.lang.reflect.Method.invoke(Method.java:606)
	at hudson.maven.Maven3Builder.call(Maven3Builder.java:139)
	at hudson.maven.Maven3Builder.call(Maven3Builder.java:70)
	at hudson.remoting.UserRequest.perform(UserRequest.java:153)
	at hudson.remoting.UserRequest.perform(UserRequest.java:50)
	at hudson.remoting.Request$2.run(Request.java:336)
	at hudson.remoting.InterceptingExecutorService$1.call(InterceptingExecutorService.java:68)
	at java.util.concurrent.FutureTask.run(FutureTask.java:262)
	at java.util.concurrent.ThreadPoolExecutor.runWorker(ThreadPoolExecutor.java:1145)
	at java.util.concurrent.ThreadPoolExecutor$Worker.run(ThreadPoolExecutor.java:615)
	at java.lang.Thread.run(Thread.java:745)
Caused by: java.lang.UnsupportedClassVersionError: org/apache/karaf/tooling/features/GenerateDescriptorMojo
: Unsupported major.minor version 52.0
	at java.lang.ClassLoader.defineClass1(Native Method)
	at java.lang.ClassLoader.defineClass(ClassLoader.java:800)
	at java.security.SecureClassLoader.defineClass(SecureClassLoader.java:142)
	at java.net.URLClassLoader.defineClass(URLClassLoader.java:449)
	at java.net.URLClassLoader.access$100(URLClassLoader.java:71)
	at java.net.URLClassLoader$1.run(URLClassLoader.java:361)
	at java.net.URLClassLoader$1.run(URLClassLoader.java:355)
	at java.security.AccessController.doPrivileged(Native Method)
	at java.net.URLClassLoader.findClass(URLClassLoader.java:354)
	at org.codehaus.plexus.classworlds.realm.ClassRealm.loadClassFromSelf(ClassRealm.java:386)
	at org.codehaus.plexus.classworlds.strategy.SelfFirstStrategy.loadClass(SelfFirstStrategy.java:42)
	at org.codehaus.plexus.classworlds.realm.ClassRealm.loadClass(ClassRealm.java:244)
	at org.codehaus.plexus.classworlds.realm.ClassRealm.loadClass(ClassRealm.java:230)
	at hudson.maven.ExecutedMojo.getMojoClass(ExecutedMojo.java:126)
	at hudson.maven.ExecutedMojo.<init>(ExecutedMojo.java:99)
	at hudson.maven.Maven3Builder$MavenExecutionListener.recordExecutionTime(Maven3Builder.java:654)
	at hudson.maven.Maven3Builder$MavenExecutionListener.recordMojoEnded(Maven3Builder.java:618)
	at hudson.maven.Maven3Builder$MavenExecutionListener.mojoFailed(Maven3Builder.java:662)
	at org.apache.maven.lifecycle.internal.DefaultExecutionEventCatapult.fire(DefaultExecutionEventCatapult.java:90)
	at org.apache.maven.lifecycle.internal.MojoExecutor.execute(MojoExecutor.java:232)
	at org.apache.maven.lifecycle.internal.MojoExecutor.execute(MojoExecutor.java:153)
	at org.apache.maven.lifecycle.internal.MojoExecutor.execute(MojoExecutor.java:145)
	at org.apache.maven.lifecycle.internal.LifecycleModuleBuilder.buildProject(LifecycleModuleBuilder.java:84)
	at org.apache.maven.lifecycle.internal.LifecycleModuleBuilder.buildProject(LifecycleModuleBuilder.java:59)
	at org.apache.maven.lifecycle.internal.LifecycleStarter.singleThreadedBuild(LifecycleStarter.java:183)
	at org.apache.maven.lifecycle.internal.LifecycleStarter.execute(LifecycleStarter.java:161)
	at org.apache.maven.DefaultMaven.doExecute(DefaultMaven.java:320)
	at org.apache.maven.DefaultMaven.execute(DefaultMaven.java:156)
	at org.jvnet.hudson.maven3.launcher.Maven3Launcher.main(Maven3Launcher.java:117)
	... 21 more
Sending e-mails to: commits@openjpa.apache.org
ERROR: Failed to parse POMs
java.io.IOException: java.lang.reflect.InvocationTargetException
	at hudson.maven.Maven3Builder.call(Maven3Builder.java:179)
	at hudson.maven.Maven3Builder.call(Maven3Builder.java:70)
	at hudson.remoting.UserRequest.perform(UserRequest.java:153)
	at hudson.remoting.UserRequest.perform(UserRequest.java:50)
	at hudson.remoting.Request$2.run(Request.java:336)
	at hudson.remoting.InterceptingExecutorService$1.call(InterceptingExecutorService.java:68)
	at java.util.concurrent.FutureTask.run(FutureTask.java:262)
	at java.util.concurrent.ThreadPoolExecutor.runWorker(ThreadPoolExecutor.java:1145)
	at java.util.concurrent.ThreadPoolExecutor$Worker.run(ThreadPoolExecutor.java:615)
	at java.lang.Thread.run(Thread.java:745)
	at ......remote call to Channel to Maven [/home/jenkins/tools/java/latest1.7/bin/java, -Xmx1280m,
-XX:MaxPermSize=512m, -cp, /home/jenkins/jenkins-slave/maven3-agent.jar:/home/jenkins/tools/maven/apache-maven-3.0.4/boot/plexus-classworlds-2.4.jar,
org.jvnet.hudson.maven3.agent.Maven3Main, /home/jenkins/tools/maven/apache-maven-3.0.4, /home/jenkins/jenkins-slave/slave.jar,
/home/jenkins/jenkins-slave/maven3-interceptor.jar, /home/jenkins/jenkins-slave/maven3-interceptor-commons.jar,
32923](Native Method)
	at hudson.remoting.Channel.attachCallSiteStackTrace(Channel.java:1537)
	at hudson.remoting.UserResponse.retrieve(UserRequest.java:253)
	at hudson.remoting.Channel.call(Channel.java:822)
	at hudson.maven.ProcessCache$MavenProcess.call(ProcessCache.java:161)
	at hudson.maven.MavenModuleSetBuild$MavenModuleSetBuildExecution.doRun(MavenModuleSetBuild.java:873)
	at hudson.model.AbstractBuild$AbstractBuildExecution.run(AbstractBuild.java:534)
	at hudson.model.Run.execute(Run.java:1728)
	at hudson.maven.MavenModuleSetBuild.run(MavenModuleSetBuild.java:544)
	at hudson.model.ResourceController.execute(ResourceController.java:98)
	at hudson.model.Executor.run(Executor.java:404)
Caused by: java.lang.reflect.InvocationTargetException
	at sun.reflect.NativeMethodAccessorImpl.invoke0(Native Method)
	at sun.reflect.NativeMethodAccessorImpl.invoke(NativeMethodAccessorImpl.java:57)
	at sun.reflect.DelegatingMethodAccessorImpl.invoke(DelegatingMethodAccessorImpl.java:43)
	at java.lang.reflect.Method.invoke(Method.java:606)
	at hudson.maven.Maven3Builder.call(Maven3Builder.java:139)
	at hudson.maven.Maven3Builder.call(Maven3Builder.java:70)
	at hudson.remoting.UserRequest.perform(UserRequest.java:153)
	at hudson.remoting.UserRequest.perform(UserRequest.java:50)
	at hudson.remoting.Request$2.run(Request.java:336)
	at hudson.remoting.InterceptingExecutorService$1.call(InterceptingExecutorService.java:68)
	at java.util.concurrent.FutureTask.run(FutureTask.java:262)
	at java.util.concurrent.ThreadPoolExecutor.runWorker(ThreadPoolExecutor.java:1145)
	at java.util.concurrent.ThreadPoolExecutor$Worker.run(ThreadPoolExecutor.java:615)
	at java.lang.Thread.run(Thread.java:745)
Caused by: java.lang.Exception: java.lang.reflect.InvocationTargetException
	at org.jvnet.hudson.maven3.agent.Maven3Main.launch(Maven3Main.java:184)
	... 14 more
Caused by: java.lang.reflect.InvocationTargetException
	at sun.reflect.NativeMethodAccessorImpl.invoke0(Native Method)
	at sun.reflect.NativeMethodAccessorImpl.invoke(NativeMethodAccessorImpl.java:57)
	at sun.reflect.DelegatingMethodAccessorImpl.invoke(DelegatingMethodAccessorImpl.java:43)
	at java.lang.reflect.Method.invoke(Method.java:606)
	at org.codehaus.plexus.classworlds.launcher.Launcher.launchStandard(Launcher.java:329)
	at org.codehaus.plexus.classworlds.launcher.Launcher.launch(Launcher.java:239)
	at org.jvnet.hudson.maven3.agent.Maven3Main.launch(Maven3Main.java:181)
	... 14 more
Caused by: java.lang.UnsupportedClassVersionError: org/apache/karaf/tooling/features/GenerateDescriptorMojo
: Unsupported major.minor version 52.0
	at java.lang.ClassLoader.defineClass1(Native Method)
	at java.lang.ClassLoader.defineClass(ClassLoader.java:800)
	at java.security.SecureClassLoader.defineClass(SecureClassLoader.java:142)
	at java.net.URLClassLoader.defineClass(URLClassLoader.java:449)
	at java.net.URLClassLoader.access$100(URLClassLoader.java:71)
	at java.net.URLClassLoader$1.run(URLClassLoader.java:361)
	at java.net.URLClassLoader$1.run(URLClassLoader.java:355)
	at java.security.AccessController.doPrivileged(Native Method)
	at java.net.URLClassLoader.findClass(URLClassLoader.java:354)
	at org.codehaus.plexus.classworlds.realm.ClassRealm.loadClassFromSelf(ClassRealm.java:386)
	at org.codehaus.plexus.classworlds.strategy.SelfFirstStrategy.loadClass(SelfFirstStrategy.java:42)
	at org.codehaus.plexus.classworlds.realm.ClassRealm.loadClass(ClassRealm.java:244)
	at org.codehaus.plexus.classworlds.realm.ClassRealm.loadClass(ClassRealm.java:230)
	at hudson.maven.ExecutedMojo.getMojoClass(ExecutedMojo.java:126)
	at hudson.maven.ExecutedMojo.<init>(ExecutedMojo.java:99)
	at hudson.maven.Maven3Builder$MavenExecutionListener.recordExecutionTime(Maven3Builder.java:654)
	at hudson.maven.Maven3Builder$MavenExecutionListener.recordMojoEnded(Maven3Builder.java:618)
	at hudson.maven.Maven3Builder$MavenExecutionListener.mojoFailed(Maven3Builder.java:662)
	at org.apache.maven.lifecycle.internal.DefaultExecutionEventCatapult.fire(DefaultExecutionEventCatapult.java:90)
	at org.apache.maven.lifecycle.internal.MojoExecutor.execute(MojoExecutor.java:232)
	at org.apache.maven.lifecycle.internal.MojoExecutor.execute(MojoExecutor.java:153)
	at org.apache.maven.lifecycle.internal.MojoExecutor.execute(MojoExecutor.java:145)
	at org.apache.maven.lifecycle.internal.LifecycleModuleBuilder.buildProject(LifecycleModuleBuilder.java:84)
	at org.apache.maven.lifecycle.internal.LifecycleModuleBuilder.buildProject(LifecycleModuleBuilder.java:59)
	at org.apache.maven.lifecycle.internal.LifecycleStarter.singleThreadedBuild(LifecycleStarter.java:183)
	at org.apache.maven.lifecycle.internal.LifecycleStarter.execute(LifecycleStarter.java:161)
	at org.apache.maven.DefaultMaven.doExecute(DefaultMaven.java:320)
	at org.apache.maven.DefaultMaven.execute(DefaultMaven.java:156)
	at org.jvnet.hudson.maven3.launcher.Maven3Launcher.main(Maven3Launcher.java:117)
	... 21 more
channel stopped

Mime
View raw message