openjpa-commits mailing list archives

Site index · List index
Message view « Date » · « Thread »
Top « Date » · « Thread »
From Apache Jenkins Server <jenk...@builds.apache.org>
Subject Build failed in Jenkins: OpenJPA-Trunk-new #3
Date Wed, 26 Jul 2017 19:01:12 GMT
See <https://builds.apache.org/job/OpenJPA-Trunk-new/3/display/redirect>

------------------------------------------
[...truncated 608.47 KB...]
AU        openjpa-lib/src/main/java/org/apache/openjpa/lib/ant/AbstractTask.java
A         openjpa-lib/src/main/java/org/apache/openjpa/lib/identifier
AU        openjpa-lib/src/main/java/org/apache/openjpa/lib/identifier/Identifier.java
AU        openjpa-lib/src/main/java/org/apache/openjpa/lib/identifier/IdentifierUtilImpl.java
AU        openjpa-lib/src/main/java/org/apache/openjpa/lib/identifier/IdentifierImpl.java
AU        openjpa-lib/src/main/java/org/apache/openjpa/lib/identifier/IdentifierConfiguration.java
AU        openjpa-lib/src/main/java/org/apache/openjpa/lib/identifier/IdentifierRule.java
AU        openjpa-lib/src/main/java/org/apache/openjpa/lib/identifier/IdentifierUtil.java
A         openjpa-lib/src/main/java/org/apache/openjpa/lib/jdbc
AU        openjpa-lib/src/main/java/org/apache/openjpa/lib/jdbc/AbstractJDBCListener.java
AU        openjpa-lib/src/main/java/org/apache/openjpa/lib/jdbc/ConfiguringConnectionDecorator.java
AU        openjpa-lib/src/main/java/org/apache/openjpa/lib/jdbc/ConnectionDecorator.java
AU        openjpa-lib/src/main/java/org/apache/openjpa/lib/jdbc/JDBCEvent.java
AU        openjpa-lib/src/main/java/org/apache/openjpa/lib/jdbc/ReportingSQLException.java
AU        openjpa-lib/src/main/java/org/apache/openjpa/lib/jdbc/DelegatingCallableStatement.java
AU        openjpa-lib/src/main/java/org/apache/openjpa/lib/jdbc/JDBCListener.java
AU        openjpa-lib/src/main/java/org/apache/openjpa/lib/jdbc/LoggingConnectionDecorator.java
AU        openjpa-lib/src/main/java/org/apache/openjpa/lib/jdbc/DelegatingPreparedStatement.java
AU        openjpa-lib/src/main/java/org/apache/openjpa/lib/jdbc/DelegatingResultSet.java
AU        openjpa-lib/src/main/java/org/apache/openjpa/lib/jdbc/DelegatingDataSource.java
A         openjpa-lib/src/main/java/org/apache/openjpa/lib/jdbc/package.html
AU        openjpa-lib/src/main/java/org/apache/openjpa/lib/jdbc/DataSourceLogs.java
AU        openjpa-lib/src/main/java/org/apache/openjpa/lib/jdbc/SQLFormatter.java
AU        openjpa-lib/src/main/java/org/apache/openjpa/lib/jdbc/DelegatingConnection.java
AU        openjpa-lib/src/main/java/org/apache/openjpa/lib/jdbc/JDBCEventConnectionDecorator.java
AU        openjpa-lib/src/main/java/org/apache/openjpa/lib/jdbc/DelegatingStatement.java
AU        openjpa-lib/src/main/java/org/apache/openjpa/lib/jdbc/DelegatingDatabaseMetaData.java
AU        openjpa-lib/src/main/java/org/apache/openjpa/lib/jdbc/DecoratingDataSource.java
A         openjpa-lib/src/main/java/org/apache/openjpa/lib/instrumentation
AU        openjpa-lib/src/main/java/org/apache/openjpa/lib/instrumentation/AbstractInstrumentationProvider.java
AU        openjpa-lib/src/main/java/org/apache/openjpa/lib/instrumentation/Instrument.java
AU        openjpa-lib/src/main/java/org/apache/openjpa/lib/instrumentation/InstrumentationLevel.java
AU        openjpa-lib/src/main/java/org/apache/openjpa/lib/instrumentation/AbstractInstrument.java
AU        openjpa-lib/src/main/java/org/apache/openjpa/lib/instrumentation/InstrumentationProvider.java
AU        openjpa-lib/pom.xml
 U        .
At revision 1803095

Setting ANT_1_9_7_HOME=/home/jenkins/tools/ant/apache-ant-1.9.7
Setting JDK_1_7_LATEST__HOME=/home/jenkins/tools/java/latest1.7
Setting MAVEN_3_0_4_HOME=/home/jenkins/tools/maven/apache-maven-3.0.4
[OpenJPA-Trunk-new] $ /bin/bash -xe /tmp/jenkins199373634019019236.sh
+ export ANT_HOME=/home/jenkins/tools/ant/apache-ant-1.9.7
+ ANT_HOME=/home/jenkins/tools/ant/apache-ant-1.9.7
+ export JAVA_HOME=/home/jenkins/tools/java/latest1.7
+ JAVA_HOME=/home/jenkins/tools/java/latest1.7
+ export M2_HOME=/home/jenkins/tools/maven/apache-maven-3.0.4
+ M2_HOME=/home/jenkins/tools/maven/apache-maven-3.0.4
+ export PATH=/home/jenkins/tools/ant/apache-ant-1.9.7/bin:/home/jenkins/tools/java/latest1.7/bin:/home/jenkins/tools/maven/apache-maven-3.0.4/bin:/home/jenkins/tools/java/latest1.8/bin:/usr/local/sbin:/usr/local/bin:/usr/sbin:/usr/bin:/sbin:/bin:/usr/games:/usr/local/games
+ PATH=/home/jenkins/tools/ant/apache-ant-1.9.7/bin:/home/jenkins/tools/java/latest1.7/bin:/home/jenkins/tools/maven/apache-maven-3.0.4/bin:/home/jenkins/tools/java/latest1.8/bin:/usr/local/sbin:/usr/local/bin:/usr/sbin:/usr/bin:/sbin:/bin:/usr/games:/usr/local/games
+ mvn clean install
[INFO] Scanning for projects...
[WARNING] 
[WARNING] Some problems were encountered while building the effective model for org.apache.openjpa:openjpa-features:pom:3.0.0-SNAPSHOT
[WARNING] 'build.plugins.plugin.version' for org.apache.karaf.tooling:karaf-maven-plugin is
missing. @ line 31, column 12
[WARNING] 'build.plugins.plugin.version' for org.codehaus.mojo:build-helper-maven-plugin is
missing. @ line 49, column 12
[WARNING] 
[WARNING] It is highly recommended to fix these problems because they threaten the stability
of your build.
[WARNING] 
[WARNING] For this reason, future Maven versions might no longer support building such malformed
projects.
[WARNING] 
[INFO] ------------------------------------------------------------------------
[INFO] Reactor Build Order:
[INFO] 
[INFO] OpenJPA Parent POM
[INFO] OpenJPA Utilities Library
[INFO] OpenJPA Kernel
[INFO] OpenJPA JDBC
[INFO] OpenJPA Persistence
[INFO] OpenJPA Persistence JDBC
[INFO] OpenJPA Persistence Locking Tests
[INFO] OpenJPA tools
[INFO] OpenJPA Maven Plugin
[INFO] OpenJPA XML Store
[INFO] OpenJPA Slice
[INFO] OpenJPA JEST
[INFO] OpenJPA Aggregate Jar
[INFO] OpenJPA Aggregate Jar with Dependencies
[INFO] OpenJPA Project Docs and Assemblies
[INFO] OpenJPA Examples
[INFO] OpenJPA Examples - Simple
[INFO] OpenJPA Examples - image-gallery
[INFO] OpenJPA Examples - OpenBooks
[INFO] OpenJPA Integration Tests
[INFO] OpenJPA Integration Tests - Daytrader
[INFO] OpenJPA Integration Tests - Examples
[INFO] OpenJPA Integration Tests - SLF4JLogFactory
[INFO] OpenJPA Integration Tests - JPA TCK
[INFO] OpenJPA Integration Tests - Bean Validation
[INFO] OpenJPA Integration Tests - JMX Platform MBeans
[INFO] OpenJPA Fetching Statistic Tool
[INFO] OpenJPA Fetching Statistic Tool -- WAS Bundle
[INFO] OpenJPA Features
[INFO]                                                                         
[INFO] ------------------------------------------------------------------------
[INFO] Building OpenJPA Parent POM 3.0.0-SNAPSHOT
[INFO] ------------------------------------------------------------------------
[INFO] 
[INFO] --- maven-clean-plugin:3.0.0:clean (default-clean) @ openjpa-parent ---
[INFO] 
[INFO] --- buildnumber-maven-plugin:1.4:create (default) @ openjpa-parent ---
[INFO] Executing: /bin/sh -c cd '<https://builds.apache.org/job/OpenJPA-Trunk-new/ws/'>
&& 'svn' '--non-interactive' 'info'
[INFO] Working directory: <https://builds.apache.org/job/OpenJPA-Trunk-new/ws/>
[INFO] Storing buildNumber: 1803095 at timestamp: July 26, 2017 at 7:01 PM
[INFO] Executing: /bin/sh -c cd '<https://builds.apache.org/job/OpenJPA-Trunk-new/ws/'>
&& 'svn' '--non-interactive' 'info'
[INFO] Working directory: <https://builds.apache.org/job/OpenJPA-Trunk-new/ws/>
[INFO] Storing buildScmBranch: trunk
[INFO] 
[INFO] --- maven-enforcer-plugin:1.4.1:enforce (default) @ openjpa-parent ---
[INFO] 
[INFO] --- maven-checkstyle-plugin:2.9:checkstyle (default) @ openjpa-parent ---
Setting property: classpath.resource.loader.class => 'org.codehaus.plexus.velocity.ContextClassLoaderResourceLoader'.
Setting property: site.resource.loader.class => 'org.codehaus.plexus.velocity.SiteResourceLoader'.
Setting property: velocimacro.messages.on => 'false'.
Setting property: resource.loader => 'classpath,site'.
Setting property: runtime.log.invalid.references => 'false'.
Setting property: resource.manager.logwhenfound => 'false'.
Setting property: velocimacro.permissions.allow.inline.to.replace.global => 'true'.
Setting property: classpath.resource.loader.class => 'org.codehaus.plexus.velocity.ContextClassLoaderResourceLoader'.
Setting property: site.resource.loader.class => 'org.codehaus.plexus.velocity.SiteResourceLoader'.
Setting property: velocimacro.messages.on => 'false'.
Setting property: resource.loader => 'classpath,site'.
Setting property: runtime.log.invalid.references => 'false'.
Setting property: resource.manager.logwhenfound => 'false'.
[INFO] 
[INFO] --- maven-remote-resources-plugin:1.5:process (process-resource-bundles) @ openjpa-parent
---
[INFO] 
[INFO] --- maven-compiler-plugin:3.5.1:testCompile (test-source-compile) @ openjpa-parent
---
[INFO] No sources to compile
[INFO] 
[INFO] --- maven-site-plugin:3.5.1:attach-descriptor (attach-descriptor) @ openjpa-parent
---
[INFO] 
[INFO] --- apache-rat-plugin:0.11:check (default) @ openjpa-parent ---
[INFO] 51 implicit excludes (use -debug for more details).
[INFO] Exclude: **/.*/**
[INFO] Exclude: **/target/**/*
[INFO] 4932 resources included (use -debug for more details)
[INFO] Rat check: Summary of files. Unapproved: 0 unknown: 0 generated: 0 approved: 4923 licence.
[INFO] 
[INFO] --- maven-install-plugin:2.5.2:install (default-install) @ openjpa-parent ---
[INFO] Installing <https://builds.apache.org/job/OpenJPA-Trunk-new/ws/pom.xml> to /home/jenkins/.m2/repository/org/apache/openjpa/openjpa-parent/3.0.0-SNAPSHOT/openjpa-parent-3.0.0-SNAPSHOT.pom
[INFO] Installing <https://builds.apache.org/job/OpenJPA-Trunk-new/ws/target/openjpa-parent-3.0.0-SNAPSHOT-site.xml>
to /home/jenkins/.m2/repository/org/apache/openjpa/openjpa-parent/3.0.0-SNAPSHOT/openjpa-parent-3.0.0-SNAPSHOT-site.xml
[INFO]                                                                         
[INFO] ------------------------------------------------------------------------
[INFO] Building OpenJPA Utilities Library 3.0.0-SNAPSHOT
[INFO] ------------------------------------------------------------------------
Downloading: http://repo.maven.apache.org/maven2/org/apache/ant/ant/1.9.7/ant-1.9.7.pom
4/10 KB   8/10 KB   10/10 KB              Downloaded: http://repo.maven.apache.org/maven2/org/apache/ant/ant/1.9.7/ant-1.9.7.pom
(10 KB at 68.6 KB/sec)
Downloading: http://repo.maven.apache.org/maven2/org/apache/ant/ant-parent/1.9.7/ant-parent-1.9.7.pom
4/6 KB     6/6 KB            Downloaded: http://repo.maven.apache.org/maven2/org/apache/ant/ant-parent/1.9.7/ant-parent-1.9.7.pom
(6 KB at 342.1 KB/sec)
Downloading: http://repo.maven.apache.org/maven2/org/apache/ant/ant-launcher/1.9.7/ant-launcher-1.9.7.pom
3/3 KB            Downloaded: http://repo.maven.apache.org/maven2/org/apache/ant/ant-launcher/1.9.7/ant-launcher-1.9.7.pom
(3 KB at 49.6 KB/sec)
Downloading: http://repo.maven.apache.org/maven2/org/apache/geronimo/specs/geronimo-validation_1.1_spec/1.0/geronimo-validation_1.1_spec-1.0.pom
4/6 KB   6/6 KB            Downloaded: http://repo.maven.apache.org/maven2/org/apache/geronimo/specs/geronimo-validation_1.1_spec/1.0/geronimo-validation_1.1_spec-1.0.pom
(6 KB at 279.2 KB/sec)
Downloading: http://repo.maven.apache.org/maven2/org/apache/ant/ant/1.9.7/ant-1.9.7.jar
Downloading: http://repo.maven.apache.org/maven2/org/apache/ant/ant-launcher/1.9.7/ant-launcher-1.9.7.jar
Downloading: http://repo.maven.apache.org/maven2/org/apache/geronimo/specs/geronimo-validation_1.1_spec/1.0/geronimo-validation_1.1_spec-1.0.jar
3/1989 KB   7/1989 KB   11/1989 KB   15/1989 KB   19/1989 KB   23/1989 KB   23/1989 KB   4/18
KB   27/1989 KB   4/18 KB   27/1989 KB   7/18 KB   31/1989 KB   7/18 KB   31/1989 KB   11/18
KB   35/1989 KB   11/18 KB   35/1989 KB   11/18 KB   4/74 KB   35/1989 KB   14/18 KB   4/74
KB   39/1989 KB   14/18 KB   4/74 KB   39/1989 KB   14/18 KB   7/74 KB   39/1989 KB   18/18
KB   7/74 KB   39/1989 KB   18/18 KB   11/74 KB   43/1989 KB   18/18 KB   11/74 KB   43/1989
KB   18/18 KB   11/74 KB   43/1989 KB   18/18 KB   14/74 KB   47/1989 KB   18/18 KB   14/74
KB   47/1989 KB   18/18 KB   18/74 KB   51/1989 KB   18/18 KB   18/74 KB   51/1989 KB   18/18
KB   22/74 KB   55/1989 KB   18/18 KB   22/74 KB   55/1989 KB   18/18 KB   26/74 KB   59/1989
KB   18/18 KB   26/74 KB   59/1989 KB   18/18 KB   30/74 KB   63/1989 KB   18/18 KB   30/74
KB   63/1989 KB   18/18 KB   34/74 KB   67/1989 KB   18/18 KB   34/74 KB   67/1989 KB   18/18
KB   38/74 KB   71/1989 KB   18/18 KB   38/74 KB   71/1989 KB   18/18 KB   42/74 KB      
                               75/1989 KB   42/74 KB              75/1989 KB   46/74 KB  
Downloaded: http://repo.maven.apache.org/maven2/org/apache/ant/ant-launcher/1.9.7/ant-launcher-1.9.7.jar
(18 KB at 597.8 KB/sec)
79/1989 KB   46/74 KB   79/1989 KB   50/74 KB   83/1989 KB   50/74 KB   83/1989 KB   54/74
KB   87/1989 KB   54/74 KB   87/1989 KB   58/74 KB   91/1989 KB   58/74 KB   91/1989 KB  
62/74 KB   95/1989 KB   62/74 KB   95/1989 KB   66/74 KB   99/1989 KB   66/74 KB   99/1989
KB   70/74 KB   103/1989 KB   70/74 KB   103/1989 KB   74/74 KB   107/1989 KB   74/74 KB 
 107/1989 KB   74/74 KB   111/1989 KB   74/74 KB   115/1989 KB   74/74 KB   119/1989 KB  
74/74 KB   123/1989 KB   74/74 KB   127/1989 KB   74/74 KB   131/1989 KB   74/74 KB   135/1989
KB   74/74 KB   139/1989 KB   74/74 KB   143/1989 KB   74/74 KB   147/1989 KB   74/74 KB 
 151/1989 KB   74/74 KB                            Downloaded: http://repo.maven.apache.org/maven2/org/apache/geronimo/specs/geronimo-validation_1.1_spec/1.0/geronimo-validation_1.1_spec-1.0.jar
(74 KB at 1568.0 KB/sec)
155/1989 KB              159/1989 KB   163/1989 KB   167/1989 KB   171/1989 KB   175/1989
KB   179/1989 KB   183/1989 KB   187/1989 KB   191/1989 KB   195/1989 KB   199/1989 KB   203/1989
KB   207/1989 KB   211/1989 KB   215/1989 KB   219/1989 KB   223/1989 KB   227/1989 KB   231/1989
KB   235/1989 KB   239/1989 KB   243/1989 KB   247/1989 KB   251/1989 KB   255/1989 KB   259/1989
KB   263/1989 KB   267/1989 KB   271/1989 KB   275/1989 KB   279/1989 KB   283/1989 KB   287/1989
KB   291/1989 KB   295/1989 KB   299/1989 KB   303/1989 KB   307/1989 KB   311/1989 KB   315/1989
KB   319/1989 KB   323/1989 KB   327/1989 KB   331/1989 KB   335/1989 KB   339/1989 KB   343/1989
KB   347/1989 KB   351/1989 KB   355/1989 KB   359/1989 KB   363/1989 KB   367/1989 KB   371/1989
KB   375/1989 KB   379/1989 KB   383/1989 KB   387/1989 KB   391/1989 KB   395/1989 KB   399/1989
KB   403/1989 KB   407/1989 KB   411/1989 KB   415/1989 KB   419/1989 KB   423/1989 KB   427/1989
KB   431/1989 KB   435/1989 KB   439/1989 KB   443/1989 KB   447/1989 KB   451/1989 KB   455/1989
KB   459/1989 KB   463/1989 KB   467/1989 KB   471/1989 KB   475/1989 KB   479/1989 KB   483/1989
KB   487/1989 KB   491/1989 KB   495/1989 KB   499/1989 KB   503/1989 KB   507/1989 KB   511/1989
KB   515/1989 KB   519/1989 KB   523/1989 KB   527/1989 KB   531/1989 KB   535/1989 KB   539/1989
KB   543/1989 KB   547/1989 KB   551/1989 KB   555/1989 KB   559/1989 KB   563/1989 KB   567/1989
KB   571/1989 KB   575/1989 KB   579/1989 KB   583/1989 KB   587/1989 KB   591/1989 KB   595/1989
KB   599/1989 KB   603/1989 KB   607/1989 KB   611/1989 KB   615/1989 KB   619/1989 KB   623/1989
KB   627/1989 KB   631/1989 KB   635/1989 KB   639/1989 KB   643/1989 KB   647/1989 KB   651/1989
KB   655/1989 KB   659/1989 KB   663/1989 KB   667/1989 KB   671/1989 KB   675/1989 KB   679/1989
KB   683/1989 KB   687/1989 KB   691/1989 KB   695/1989 KB   699/1989 KB   703/1989 KB   707/1989
KB   711/1989 KB   715/1989 KB   719/1989 KB   723/1989 KB   727/1989 KB   731/1989 KB   735/1989
KB   739/1989 KB   743/1989 KB   747/1989 KB   751/1989 KB   755/1989 KB   759/1989 KB   763/1989
KB   767/1989 KB   771/1989 KB   775/1989 KB   779/1989 KB   783/1989 KB   787/1989 KB   791/1989
KB   795/1989 KB   799/1989 KB   803/1989 KB   807/1989 KB   811/1989 KB   815/1989 KB   819/1989
KB   823/1989 KB   827/1989 KB   831/1989 KB   835/1989 KB   839/1989 KB   843/1989 KB   847/1989
KB   851/1989 KB   855/1989 KB   859/1989 KB   863/1989 KB   867/1989 KB   871/1989 KB   875/1989
KB   879/1989 KB   883/1989 KB   887/1989 KB   891/1989 KB   895/1989 KB   899/1989 KB   903/1989
KB   907/1989 KB   911/1989 KB   915/1989 KB   918/1989 KB   919/1989 KB   923/1989 KB   927/1989
KB   931/1989 KB   933/1989 KB   937/1989 KB   941/1989 KB   945/1989 KB   947/1989 KB   951/1989
KB   955/1989 KB   959/1989 KB   961/1989 KB   965/1989 KB   969/1989 KB   973/1989 KB   976/1989
KB   980/1989 KB   983/1989 KB   987/1989 KB   991/1989 KB   995/1989 KB   997/1989 KB   1001/1989
KB   1005/1989 KB   1007/1989 KB   1011/1989 KB   1015/1989 KB   1019/1989 KB   1022/1989
KB   1026/1989 KB   1030/1989 KB   1034/1989 KB   1038/1989 KB   1042/1989 KB   1046/1989
KB   1046/1989 KB   1050/1989 KB   1054/1989 KB   1058/1989 KB   1062/1989 KB   1063/1989
KB   1067/1989 KB   1071/1989 KB   1073/1989 KB   1077/1989 KB   1081/1989 KB   1085/1989
KB   1089/1989 KB   1090/1989 KB   1094/1989 KB   1098/1989 KB   1102/1989 KB   1106/1989
KB   1107/1989 KB   1110/1989 KB   1114/1989 KB   1118/1989 KB   1122/1989 KB   1126/1989
KB   1127/1989 KB   1131/1989 KB   1135/1989 KB   1139/1989 KB   1143/1989 KB   1144/1989
KB   1148/1989 KB   1152/1989 KB   1156/1989 KB   1160/1989 KB   1164/1989 KB   1168/1989
KB   1172/1989 KB   1174/1989 KB   1178/1989 KB   1182/1989 KB   1186/1989 KB   1190/1989
KB   1192/1989 KB   1196/1989 KB   1200/1989 KB   1204/1989 KB   1208/1989 KB   1212/1989
KB   1216/1989 KB   1220/1989 KB   1224/1989 KB   1228/1989 KB   1232/1989 KB   1236/1989
KB   1237/1989 KB   1241/1989 KB   1245/1989 KB   1249/1989 KB   1253/1989 KB   1257/1989
KB   1261/1989 KB   1265/1989 KB   1269/1989 KB   1273/1989 KB   1277/1989 KB   1281/1989
KB   1285/1989 KB   1289/1989 KB   1293/1989 KB   1297/1989 KB   1301/1989 KB   1301/1989
KB   1305/1989 KB   1309/1989 KB   1313/1989 KB   1317/1989 KB   1321/1989 KB   1325/1989
KB   1329/1989 KB   1333/1989 KB   1337/1989 KB   1340/1989 KB   1344/1989 KB   1348/1989
KB   1352/1989 KB   1356/1989 KB   1360/1989 KB   1364/1989 KB   1364/1989 KB   1368/1989
KB   1372/1989 KB   1376/1989 KB   1380/1989 KB   1384/1989 KB   1386/1989 KB   1390/1989
KB   1394/1989 KB   1398/1989 KB   1402/1989 KB   1406/1989 KB   1407/1989 KB   1411/1989
KB   1415/1989 KB   1419/1989 KB   1423/1989 KB   1427/1989 KB   1431/1989 KB   1435/1989
KB   1439/1989 KB   1443/1989 KB   1447/1989 KB   1449/1989 KB   1453/1989 KB   1457/1989
KB   1461/1989 KB   1465/1989 KB   1469/1989 KB   1471/1989 KB   1475/1989 KB   1479/1989
KB   1483/1989 KB   1487/1989 KB   1491/1989 KB   1492/1989 KB   1496/1989 KB   1500/1989
KB   1504/1989 KB   1508/1989 KB   1512/1989 KB   1516/1989 KB   1520/1989 KB   1524/1989
KB   1528/1989 KB   1531/1989 KB   1535/1989 KB   1539/1989 KB   1543/1989 KB   1547/1989
KB   1551/1989 KB   1555/1989 KB   1555/1989 KB   1559/1989 KB   1563/1989 KB   1567/1989
KB   1571/1989 KB   1575/1989 KB   1578/1989 KB   1582/1989 KB   1586/1989 KB   1590/1989
KB   1594/1989 KB   1598/1989 KB   1602/1989 KB   1606/1989 KB   1610/1989 KB   1614/1989
KB   1618/1989 KB   1619/1989 KB   1623/1989 KB   1627/1989 KB   1631/1989 KB   1635/1989
KB   1639/1989 KB   1643/1989 KB   1643/1989 KB   1647/1989 KB   1651/1989 KB   1655/1989
KB   1659/1989 KB   1663/1989 KB   1667/1989 KB   1667/1989 KB   1671/1989 KB   1675/1989
KB   1679/1989 KB   1683/1989 KB   1687/1989 KB   1691/1989 KB   1695/1989 KB   1699/1989
KB   1703/1989 KB   1707/1989 KB   1708/1989 KB   1712/1989 KB   1716/1989 KB   1720/1989
KB   1724/1989 KB   1728/1989 KB   1732/1989 KB   1734/1989 KB   1738/1989 KB   1742/1989
KB   1746/1989 KB   1746/1989 KB   1750/1989 KB   1754/1989 KB   1758/1989 KB   1762/1989
KB   1766/1989 KB   1770/1989 KB   1772/1989 KB   1776/1989 KB   1780/1989 KB   1784/1989
KB   1788/1989 KB   1792/1989 KB   1796/1989 KB   1797/1989 KB   1801/1989 KB   1805/1989
KB   1809/1989 KB   1810/1989 KB   1814/1989 KB   1818/1989 KB   1822/1989 KB   1826/1989
KB   1830/1989 KB   1834/1989 KB   1837/1989 KB   1841/1989 KB   1844/1989 KB   1848/1989
KB   1852/1989 KB   1856/1989 KB   1860/1989 KB   1864/1989 KB   1868/1989 KB   1872/1989
KB   1876/1989 KB   1880/1989 KB   1884/1989 KB   1888/1989 KB   1892/1989 KB   1896/1989
KB   1900/1989 KB   1900/1989 KB   1904/1989 KB   1908/1989 KB   1912/1989 KB   1916/1989
KB   1920/1989 KB   1924/1989 KB   1928/1989 KB   1932/1989 KB   1936/1989 KB   1937/1989
KB   1941/1989 KB   1945/1989 KB   1949/1989 KB   1953/1989 KB   1957/1989 KB   1961/1989
KB   1965/1989 KB   1965/1989 KB   1969/1989 KB   1973/1989 KB   1977/1989 KB   1981/1989
KB   1985/1989 KB   1989/1989 KB                  Downloaded: http://repo.maven.apache.org/maven2/org/apache/ant/ant/1.9.7/ant-1.9.7.jar
(1989 KB at 9992.3 KB/sec)
[INFO] 
[INFO] --- maven-clean-plugin:3.0.0:clean (default-clean) @ openjpa-lib ---
[INFO] 
[INFO] --- buildnumber-maven-plugin:1.4:create (default) @ openjpa-lib ---
[INFO] 
[INFO] --- maven-enforcer-plugin:1.4.1:enforce (default) @ openjpa-lib ---
[INFO] 
[INFO] --- maven-checkstyle-plugin:2.9:checkstyle (default) @ openjpa-lib ---
[INFO] Starting audit...
Audit done.

[WARNING] Unable to locate Source XRef to link to - DISABLED
[ERROR] VM #image: error : too few arguments to macro. Wanted 5 got 0
[ERROR] VM #image: error : too few arguments to macro. Wanted 5 got 0
[ERROR] VM #displayTree: error : too few arguments to macro. Wanted 2 got 0
[ERROR] VM #menuItem: error : too few arguments to macro. Wanted 1 got 0
[INFO] 
[INFO] --- maven-remote-resources-plugin:1.5:process (process-resource-bundles) @ openjpa-lib
---
[INFO] 
[INFO] --- maven-resources-plugin:2.7:resources (default-resources) @ openjpa-lib ---
[INFO] Using 'UTF-8' encoding to copy filtered resources.
[INFO] Copying 9 resources
[INFO] Copying 3 resources
[INFO] 
[INFO] --- maven-compiler-plugin:3.5.1:compile (default-compile) @ openjpa-lib ---
[INFO] Changes detected - recompiling the module!
[INFO] Compiling 161 source files to <https://builds.apache.org/job/OpenJPA-Trunk-new/ws/openjpa-lib/target/classes>
[INFO] ------------------------------------------------------------------------
[INFO] Reactor Summary:
[INFO] 
[INFO] OpenJPA Parent POM ................................ SUCCESS [7.134s]
[INFO] OpenJPA Utilities Library ......................... FAILURE [3.823s]
[INFO] OpenJPA Kernel .................................... SKIPPED
[INFO] OpenJPA JDBC ...................................... SKIPPED
[INFO] OpenJPA Persistence ............................... SKIPPED
[INFO] OpenJPA Persistence JDBC .......................... SKIPPED
[INFO] OpenJPA Persistence Locking Tests ................. SKIPPED
[INFO] OpenJPA tools ..................................... SKIPPED
[INFO] OpenJPA Maven Plugin .............................. SKIPPED
[INFO] OpenJPA XML Store ................................. SKIPPED
[INFO] OpenJPA Slice ..................................... SKIPPED
[INFO] OpenJPA JEST ...................................... SKIPPED
[INFO] OpenJPA Aggregate Jar ............................. SKIPPED
[INFO] OpenJPA Aggregate Jar with Dependencies ........... SKIPPED
[INFO] OpenJPA Project Docs and Assemblies ............... SKIPPED
[INFO] OpenJPA Examples .................................. SKIPPED
[INFO] OpenJPA Examples - Simple ......................... SKIPPED
[INFO] OpenJPA Examples - image-gallery .................. SKIPPED
[INFO] OpenJPA Examples - OpenBooks ...................... SKIPPED
[INFO] OpenJPA Integration Tests ......................... SKIPPED
[INFO] OpenJPA Integration Tests - Daytrader ............. SKIPPED
[INFO] OpenJPA Integration Tests - Examples .............. SKIPPED
[INFO] OpenJPA Integration Tests - SLF4JLogFactory ....... SKIPPED
[INFO] OpenJPA Integration Tests - JPA TCK ............... SKIPPED
[INFO] OpenJPA Integration Tests - Bean Validation ....... SKIPPED
[INFO] OpenJPA Integration Tests - JMX Platform MBeans ... SKIPPED
[INFO] OpenJPA Fetching Statistic Tool ................... SKIPPED
[INFO] OpenJPA Fetching Statistic Tool -- WAS Bundle ..... SKIPPED
[INFO] OpenJPA Features .................................. SKIPPED
[INFO] ------------------------------------------------------------------------
[INFO] BUILD FAILURE
[INFO] ------------------------------------------------------------------------
[INFO] Total time: 12.725s
[INFO] Finished at: Wed Jul 26 19:01:10 UTC 2017
[INFO] Final Memory: 35M/1447M
[INFO] ------------------------------------------------------------------------
[ERROR] Failed to execute goal org.apache.maven.plugins:maven-compiler-plugin:3.5.1:compile
(default-compile) on project openjpa-lib: Fatal error compiling: invalid target release: 1.8
-> [Help 1]
[ERROR] 
[ERROR] To see the full stack trace of the errors, re-run Maven with the -e switch.
[ERROR] Re-run Maven using the -X switch to enable full debug logging.
[ERROR] 
[ERROR] For more information about the errors and possible solutions, please read the following
articles:
[ERROR] [Help 1] http://cwiki.apache.org/confluence/display/MAVEN/MojoExecutionException
[ERROR] 
[ERROR] After correcting the problems, you can resume the build with the command
[ERROR]   mvn <goals> -rf :openjpa-lib
Build step 'Execute shell' marked build as failure
Archiving artifacts
Setting ANT_1_9_7_HOME=/home/jenkins/tools/ant/apache-ant-1.9.7
Setting JDK_1_7_LATEST__HOME=/home/jenkins/tools/java/latest1.7
Setting MAVEN_3_0_4_HOME=/home/jenkins/tools/maven/apache-maven-3.0.4
Recording test results
Setting ANT_1_9_7_HOME=/home/jenkins/tools/ant/apache-ant-1.9.7
Setting JDK_1_7_LATEST__HOME=/home/jenkins/tools/java/latest1.7
Setting MAVEN_3_0_4_HOME=/home/jenkins/tools/maven/apache-maven-3.0.4
ERROR: Step ?Publish JUnit test result report? failed: No test report files were found. Configuration
error?
Setting ANT_1_9_7_HOME=/home/jenkins/tools/ant/apache-ant-1.9.7
Setting JDK_1_7_LATEST__HOME=/home/jenkins/tools/java/latest1.7
Setting MAVEN_3_0_4_HOME=/home/jenkins/tools/maven/apache-maven-3.0.4

Mime
View raw message