openjpa-commits mailing list archives

Site index · List index
Message view « Date » · « Thread »
Top « Date » · « Thread »
From Apache Jenkins Server <jenk...@builds.apache.org>
Subject Build failed in Jenkins: OpenJPA-2.2.x #4
Date Tue, 18 Jul 2017 18:39:26 GMT
See <https://builds.apache.org/job/OpenJPA-2.2.x/4/display/redirect>

------------------------------------------
Started by user jgrassel
[EnvInject] - Loading node environment variables.
Building remotely on H26 (ubuntu xenial) in workspace <https://builds.apache.org/job/OpenJPA-2.2.x/ws/>
Updating https://svn.apache.org/repos/asf/openjpa/branches/2.2.x at revision '2017-07-18T18:39:15.536
+0000'
At revision 1802322

No changes for https://svn.apache.org/repos/asf/openjpa/branches/2.2.x since the previous
build
Setting ANT_1_9_7_HOME=/home/jenkins/tools/ant/apache-ant-1.9.7
Setting JDK_1_6_LATEST__HOME=/home/jenkins/tools/java/latest1.6
Setting MAVEN_2_2_1_HOME=/home/jenkins/tools/maven/apache-maven-2.2.1
[OpenJPA-2.2.x] $ /bin/bash -xe /tmp/jenkins9117199442916568446.sh
+ export ANT_HOME=/home/jenkins/tools/ant/apache-ant-1.9.7
+ ANT_HOME=/home/jenkins/tools/ant/apache-ant-1.9.7
+ export JAVA_HOME=/home/jenkins/tools/java/latest1.6
+ JAVA_HOME=/home/jenkins/tools/java/latest1.6
+ export M2_HOME=/home/jenkins/tools/maven/apache-maven-2.2.1
+ M2_HOME=/home/jenkins/tools/maven/apache-maven-2.2.1
+ export PATH=/home/jenkins/tools/ant/apache-ant-1.9.7/bin:/home/jenkins/tools/java/latest1.6/bin:/home/jenkins/tools/maven/apache-maven-2.2.1/bin
+ PATH=/home/jenkins/tools/ant/apache-ant-1.9.7/bin:/home/jenkins/tools/java/latest1.6/bin:/home/jenkins/tools/maven/apache-maven-2.2.1/bin
+ mvn clean install
/home/jenkins/tools/maven/apache-maven-2.2.1/bin/mvn: 1: /home/jenkins/tools/maven/apache-maven-2.2.1/bin/mvn:
uname: not found
Error getting environment vars for profile activation: java.io.IOException: Cannot run program
"env": java.io.IOException: error=2, No such file or directory
[WARNING] Failed to initialize environment variable resolver. Skipping environment substitution
in settings.
[WARNING] Failed to initialize environment variable resolver. Skipping environment substitution
in settings.
[INFO] Scanning for projects...
[INFO] Reactor build order: 
[INFO]   OpenJPA Parent POM
[INFO]   OpenJPA Utilities Library
[INFO]   OpenJPA Kernel
[INFO]   OpenJPA JDBC
[INFO]   OpenJPA Persistence
[INFO]   OpenJPA Persistence JDBC
[INFO]   OpenJPA Persistence Locking Tests
[INFO]   OpenJPA tools
[INFO]   OpenJPA Maven Plugin
[INFO]   OpenJPA XML Store
[INFO]   OpenJPA Slice
[INFO]   OpenJPA JEST
[INFO]   OpenJPA Aggregate Jar
[INFO]   OpenJPA Aggregate Jar with Dependencies
[INFO]   OpenJPA Project Docs and Assemblies
[INFO]   OpenJPA Examples
[INFO]   OpenJPA Examples - Simple
[INFO]   OpenJPA Examples - image-gallery
[INFO]   OpenJPA Examples - OpenBooks
[INFO]   OpenJPA Integration Tests
[INFO]   OpenJPA Integration Tests - Daytrader
[INFO]   OpenJPA Integration Tests - Examples
[INFO]   OpenJPA Integration Tests - SLF4JLogFactory
[INFO]   OpenJPA Integration Tests - JPA TCK
[INFO]   OpenJPA Integration Tests - Bean Validation
[INFO]   OpenJPA Integration Tests - JMX Platform MBeans
[WARNING] POM for 'biz.aQute:bndlib:pom:1.15.0:runtime' is invalid.

Its dependencies (if any) will NOT be available to the current build.
[INFO] ------------------------------------------------------------------------
[INFO] Building OpenJPA Parent POM
[INFO]    task-segment: [clean, install]
[INFO] ------------------------------------------------------------------------
[INFO] [clean:clean {execution: default-clean}]
[INFO] [buildnumber:create {execution: default}]
[INFO] Checking for local modifications: skipped.
[INFO] Updating project files from SCM: skipped.
[INFO] Executing: /bin/sh -c cd <https://builds.apache.org/job/OpenJPA-2.2.x/ws/> &&
svn --non-interactive info
[INFO] Working directory: <https://builds.apache.org/job/OpenJPA-2.2.x/ws/>
[WARNING] Cannot get the revision information from the scm repository, proceeding with revision
of offline : 
Exception while executing SCM command.
[INFO] Storing buildNumber: offline at timestamp: July 18, 2017 at 6:39 PM
[INFO] Executing: /bin/sh -c cd <https://builds.apache.org/job/OpenJPA-2.2.x/ws/> &&
svn --non-interactive info
[INFO] Working directory: <https://builds.apache.org/job/OpenJPA-2.2.x/ws/>
[INFO] ------------------------------------------------------------------------
[ERROR] BUILD ERROR
[INFO] ------------------------------------------------------------------------
[INFO] Cannot get the branch information from the scm repository : 
Exception while executing SCM command.

java.io.IOException: error=2, No such file or directory
[INFO] ------------------------------------------------------------------------
[INFO] For more information, run Maven with the -e switch
[INFO] ------------------------------------------------------------------------
[INFO] Total time: 2 seconds
[INFO] Finished at: Tue Jul 18 18:39:25 UTC 2017
[INFO] Final Memory: 36M/1824M
[INFO] ------------------------------------------------------------------------
Build step 'Execute shell' marked build as failure
Archiving artifacts
Setting ANT_1_9_7_HOME=/home/jenkins/tools/ant/apache-ant-1.9.7
Setting JDK_1_6_LATEST__HOME=/home/jenkins/tools/java/latest1.6
Setting MAVEN_2_2_1_HOME=/home/jenkins/tools/maven/apache-maven-2.2.1
Recording test results
Setting ANT_1_9_7_HOME=/home/jenkins/tools/ant/apache-ant-1.9.7
Setting JDK_1_6_LATEST__HOME=/home/jenkins/tools/java/latest1.6
Setting MAVEN_2_2_1_HOME=/home/jenkins/tools/maven/apache-maven-2.2.1
ERROR: Step ?Publish JUnit test result report? failed: No test report files were found. Configuration
error?
Setting ANT_1_9_7_HOME=/home/jenkins/tools/ant/apache-ant-1.9.7
Setting JDK_1_6_LATEST__HOME=/home/jenkins/tools/java/latest1.6
Setting MAVEN_2_2_1_HOME=/home/jenkins/tools/maven/apache-maven-2.2.1

Mime
View raw message