openjpa-commits mailing list archives

Site index · List index
Message view « Date » · « Thread »
Top « Date » · « Thread »
From Apache Jenkins Server <jenk...@builds.apache.org>
Subject Build failed in Jenkins: OpenJPA-2.4.x-jdk8 #9
Date Wed, 03 Jan 2018 15:57:25 GMT
See <https://builds.apache.org/job/OpenJPA-2.4.x-jdk8/9/display/redirect?page=changes>

Changes:

[ilgrosso] OPENJPA-2725 - fix ConcurrentModificationException during unrefed dependents cleanup
/ thanks @eran-levy

------------------------------------------
[...truncated 619.46 KB...]
[INFO] 
[INFO] --- maven-surefire-plugin:2.19.1:test (default-test) @ openjpa-lib ---

-------------------------------------------------------
 T E S T S
-------------------------------------------------------
Java HotSpot(TM) 64-Bit Server VM warning: ignoring option MaxPermSize=512m; support was removed
in 8.0
Running org.apache.openjpa.lib.util.TestLocalizer
Tests run: 7, Failures: 0, Errors: 0, Skipped: 0, Time elapsed: 0.063 sec - in org.apache.openjpa.lib.util.TestLocalizer
Running org.apache.openjpa.lib.util.svn.TestSVNUtils
Tests run: 6, Failures: 0, Errors: 0, Skipped: 0, Time elapsed: 0.001 sec - in org.apache.openjpa.lib.util.svn.TestSVNUtils
Running org.apache.openjpa.lib.util.TestUUIDGenerator
Tests run: 7, Failures: 0, Errors: 0, Skipped: 0, Time elapsed: 0.16 sec - in org.apache.openjpa.lib.util.TestUUIDGenerator
Running org.apache.openjpa.lib.util.TestOptions
Tests run: 2, Failures: 0, Errors: 0, Skipped: 0, Time elapsed: 0.027 sec - in org.apache.openjpa.lib.util.TestOptions
Running org.apache.openjpa.lib.util.TestMultiClassLoader
Tests run: 2, Failures: 0, Errors: 0, Skipped: 0, Time elapsed: 0.007 sec - in org.apache.openjpa.lib.util.TestMultiClassLoader
Running org.apache.openjpa.lib.util.TestReferenceSet
Tests run: 4, Failures: 0, Errors: 0, Skipped: 0, Time elapsed: 0.02 sec - in org.apache.openjpa.lib.util.TestReferenceSet
Running org.apache.openjpa.lib.util.TestPropertiesParser
Tests run: 13, Failures: 0, Errors: 0, Skipped: 0, Time elapsed: 0.206 sec - in org.apache.openjpa.lib.util.TestPropertiesParser
Running org.apache.openjpa.lib.util.TestTemporaryClassLoader
Tests run: 1, Failures: 0, Errors: 0, Skipped: 0, Time elapsed: 0.004 sec - in org.apache.openjpa.lib.util.TestTemporaryClassLoader
Running org.apache.openjpa.lib.util.TestAbstractEventManager
Tests run: 2, Failures: 0, Errors: 0, Skipped: 0, Time elapsed: 0.004 sec - in org.apache.openjpa.lib.util.TestAbstractEventManager
Running org.apache.openjpa.lib.util.TestSimpleRegex
Tests run: 1, Failures: 0, Errors: 0, Skipped: 0, Time elapsed: 0 sec - in org.apache.openjpa.lib.util.TestSimpleRegex
Running org.apache.openjpa.lib.util.TestParameterTemplate
Tests run: 1, Failures: 0, Errors: 0, Skipped: 0, Time elapsed: 0.001 sec - in org.apache.openjpa.lib.util.TestParameterTemplate
Running org.apache.openjpa.lib.util.TestTypedProperties
Tests run: 4, Failures: 0, Errors: 0, Skipped: 0, Time elapsed: 0.001 sec - in org.apache.openjpa.lib.util.TestTypedProperties
Running org.apache.openjpa.lib.xml.TestXMLWriter
Tests run: 1, Failures: 0, Errors: 0, Skipped: 0, Time elapsed: 0.09 sec - in org.apache.openjpa.lib.xml.TestXMLWriter
Running org.apache.openjpa.lib.xml.TestDocTypeReader
Tests run: 3, Failures: 0, Errors: 0, Skipped: 0, Time elapsed: 0.025 sec - in org.apache.openjpa.lib.xml.TestDocTypeReader
Running org.apache.openjpa.lib.rop.TestMergedResultObjectProvider
Tests run: 17, Failures: 0, Errors: 0, Skipped: 0, Time elapsed: 0.035 sec - in org.apache.openjpa.lib.rop.TestMergedResultObjectProvider
Running org.apache.openjpa.lib.rop.TestListResultList
Tests run: 17, Failures: 0, Errors: 0, Skipped: 0, Time elapsed: 0.006 sec - in org.apache.openjpa.lib.rop.TestListResultList
Running org.apache.openjpa.lib.rop.TestWindowResultList
Tests run: 17, Failures: 0, Errors: 0, Skipped: 0, Time elapsed: 0.006 sec - in org.apache.openjpa.lib.rop.TestWindowResultList
Running org.apache.openjpa.lib.rop.TestSoftRandomAccessResultList
Tests run: 17, Failures: 0, Errors: 0, Skipped: 0, Time elapsed: 0.022 sec - in org.apache.openjpa.lib.rop.TestSoftRandomAccessResultList
Running org.apache.openjpa.lib.rop.TestLazyForwardResultList
Tests run: 17, Failures: 0, Errors: 0, Skipped: 0, Time elapsed: 0.019 sec - in org.apache.openjpa.lib.rop.TestLazyForwardResultList
Running org.apache.openjpa.lib.rop.TestRandomAccessResultList
Tests run: 17, Failures: 0, Errors: 0, Skipped: 0, Time elapsed: 0.013 sec - in org.apache.openjpa.lib.rop.TestRandomAccessResultList
Running org.apache.openjpa.lib.rop.TestSimpleResultList
Tests run: 17, Failures: 0, Errors: 0, Skipped: 0, Time elapsed: 0.025 sec - in org.apache.openjpa.lib.rop.TestSimpleResultList
Running org.apache.openjpa.lib.rop.TestRangeResultObjectProvider
Tests run: 17, Failures: 0, Errors: 0, Skipped: 0, Time elapsed: 0.001 sec - in org.apache.openjpa.lib.rop.TestRangeResultObjectProvider
Running org.apache.openjpa.lib.rop.TestEagerResultList
Tests run: 17, Failures: 0, Errors: 0, Skipped: 0, Time elapsed: 0.01 sec - in org.apache.openjpa.lib.rop.TestEagerResultList
Running org.apache.openjpa.lib.rop.TestOrderedMergedResultObjectProvider
Tests run: 17, Failures: 0, Errors: 0, Skipped: 0, Time elapsed: 0.021 sec - in org.apache.openjpa.lib.rop.TestOrderedMergedResultObjectProvider
Running org.apache.openjpa.lib.graph.TestGraph
Tests run: 3, Failures: 0, Errors: 0, Skipped: 0, Time elapsed: 0.002 sec - in org.apache.openjpa.lib.graph.TestGraph
Running org.apache.openjpa.lib.graph.TestDepthFirstAnalysis
Tests run: 4, Failures: 0, Errors: 0, Skipped: 0, Time elapsed: 0.004 sec - in org.apache.openjpa.lib.graph.TestDepthFirstAnalysis
Running org.apache.openjpa.lib.conf.TestConfigurationProviderPrefixes
Tests run: 7, Failures: 0, Errors: 0, Skipped: 0, Time elapsed: 0.01 sec - in org.apache.openjpa.lib.conf.TestConfigurationProviderPrefixes
Running org.apache.openjpa.lib.conf.TestConfigurations
Tests run: 3, Failures: 0, Errors: 0, Skipped: 0, Time elapsed: 0.01 sec - in org.apache.openjpa.lib.conf.TestConfigurations
Running org.apache.openjpa.lib.conf.TestValue
Tests run: 3, Failures: 0, Errors: 0, Skipped: 0, Time elapsed: 0.003 sec - in org.apache.openjpa.lib.conf.TestValue
Running org.apache.openjpa.lib.conf.TestXMLCaseConversions
Tests run: 1, Failures: 0, Errors: 0, Skipped: 0, Time elapsed: 0.009 sec - in org.apache.openjpa.lib.conf.TestXMLCaseConversions
Running org.apache.openjpa.lib.conf.test.TestConfigurationImpl
1  WARN   [main] openjpa.Runtime - The configuration property named "openjpa.ConnectionURL"
was not recognized and will be ignored, although the name closely matches a valid property
called "openjpa.objectKey".
2  WARN   [main] openjpa.Runtime - The configuration property named "openjpa.ConnectionPassword"
was not recognized and will be ignored, although the name closely matches a valid property
called "openjpa.objectKey".
2  WARN   [main] openjpa.Runtime - The configuration property named "openjpa.ConnectionUserName"
was not recognized and will be ignored, although the name closely matches a valid property
called "openjpa.objectKey".
3  WARN   [main] openjpa.Runtime - The configuration property named "openjpa.ConnectionProperties"
was not recognized and will be ignored, although the name closely matches a valid property
called "openjpa.objectKey".
4  WARN   [main] openjpa.Runtime - The configuration property named "openjpa.DynamicEnhancementAgent"
was not recognized and will be ignored.
4  WARN   [main] openjpa.Runtime - The configuration property named "openjpa.ConnectionDriverName"
was not recognized and will be ignored, although the name closely matches a valid property
called "openjpa.objectKey".
1  WARN   [main] openjpa.Runtime - The configuration property named "openjpa.ConnectionURL"
was not recognized and will be ignored, although the name closely matches a valid property
called "openjpa.objectKey".
1  WARN   [main] openjpa.Runtime - The configuration property named "openjpa.ConnectionPassword"
was not recognized and will be ignored, although the name closely matches a valid property
called "openjpa.objectKey".
2  WARN   [main] openjpa.Runtime - The configuration property named "openjpa.ConnectionUserName"
was not recognized and will be ignored, although the name closely matches a valid property
called "openjpa.objectKey".
3  WARN   [main] openjpa.Runtime - The configuration property named "openjpa.ConnectionProperties"
was not recognized and will be ignored, although the name closely matches a valid property
called "openjpa.objectKey".
3  WARN   [main] openjpa.Runtime - The configuration property named "openjpa.DynamicEnhancementAgent"
was not recognized and will be ignored.
4  WARN   [main] openjpa.Runtime - The configuration property named "openjpa.ConnectionDriverName"
was not recognized and will be ignored, although the name closely matches a valid property
called "openjpa.objectKey".
0  WARN   [main] openjpa.Runtime - The configuration property named "openjpa.ConnectionURL"
was not recognized and will be ignored, although the name closely matches a valid property
called "openjpa.objectKey".
1  WARN   [main] openjpa.Runtime - The configuration property named "openjpa.ConnectionPassword"
was not recognized and will be ignored, although the name closely matches a valid property
called "openjpa.objectKey".
1  WARN   [main] openjpa.Runtime - The configuration property named "openjpa.ConnectionUserName"
was not recognized and will be ignored, although the name closely matches a valid property
called "openjpa.objectKey".
2  WARN   [main] openjpa.Runtime - The configuration property named "openjpa.ConnectionProperties"
was not recognized and will be ignored, although the name closely matches a valid property
called "openjpa.objectKey".
3  WARN   [main] openjpa.Runtime - The configuration property named "openjpa.DynamicEnhancementAgent"
was not recognized and will be ignored.
4  WARN   [main] openjpa.Runtime - The configuration property named "openjpa.ConnectionDriverName"
was not recognized and will be ignored, although the name closely matches a valid property
called "openjpa.objectKey".
0  WARN   [main] openjpa.Runtime - The configuration property named "openjpa.ConnectionURL"
was not recognized and will be ignored, although the name closely matches a valid property
called "openjpa.objectKey".
1  WARN   [main] openjpa.Runtime - The configuration property named "openjpa.ConnectionPassword"
was not recognized and will be ignored, although the name closely matches a valid property
called "openjpa.objectKey".
1  WARN   [main] openjpa.Runtime - The configuration property named "openjpa.ConnectionUserName"
was not recognized and will be ignored, although the name closely matches a valid property
called "openjpa.objectKey".
2  WARN   [main] openjpa.Runtime - The configuration property named "openjpa.ConnectionProperties"
was not recognized and will be ignored, although the name closely matches a valid property
called "openjpa.objectKey".
2  WARN   [main] openjpa.Runtime - The configuration property named "openjpa.DynamicEnhancementAgent"
was not recognized and will be ignored.
2  WARN   [main] openjpa.Runtime - The configuration property named "openjpa.ConnectionDriverName"
was not recognized and will be ignored, although the name closely matches a valid property
called "openjpa.objectKey".
Tests run: 8, Failures: 0, Errors: 0, Skipped: 0, Time elapsed: 0.048 sec - in org.apache.openjpa.lib.conf.test.TestConfigurationImpl
Running org.apache.openjpa.lib.conf.test.TestPluginValue
Tests run: 3, Failures: 0, Errors: 0, Skipped: 0, Time elapsed: 0.003 sec - in org.apache.openjpa.lib.conf.test.TestPluginValue
Running org.apache.openjpa.lib.identifier.TestIdentifiers
Tests run: 1, Failures: 0, Errors: 0, Skipped: 0, Time elapsed: 0.005 sec - in org.apache.openjpa.lib.identifier.TestIdentifiers

Results :

Tests run: 257, Failures: 0, Errors: 0, Skipped: 0

[INFO] 
[INFO] --- maven-jar-plugin:2.6:jar (default-jar) @ openjpa-lib ---
[INFO] Building jar: <https://builds.apache.org/job/OpenJPA-2.4.x-jdk8/ws/openjpa-lib/target/openjpa-lib-2.4.3-SNAPSHOT.jar>
[INFO] 
[INFO] --- maven-site-plugin:3.4:attach-descriptor (attach-descriptor) @ openjpa-lib ---
[INFO] 
[INFO] --- maven-jar-plugin:2.6:test-jar (attach-tests) @ openjpa-lib ---
[INFO] Building jar: <https://builds.apache.org/job/OpenJPA-2.4.x-jdk8/ws/openjpa-lib/target/openjpa-lib-2.4.3-SNAPSHOT-tests.jar>
[INFO] 
[INFO] --- ianal-maven-plugin:1.0-alpha-1:verify-legal-files (default) @ openjpa-lib ---
[INFO] Checking legal files in: openjpa-lib-2.4.3-SNAPSHOT.jar
[INFO] Checking legal files in: openjpa-lib-2.4.3-SNAPSHOT-tests.jar
[INFO] 
[INFO] --- apache-rat-plugin:0.11:check (default) @ openjpa-lib ---
[INFO] 51 implicit excludes (use -debug for more details).
[INFO] Exclude: **/.*/**
[INFO] Exclude: **/target/**/*
[INFO] 225 resources included (use -debug for more details)
[INFO] Rat check: Summary of files. Unapproved: 0 unknown: 0 generated: 0 approved: 225 licence.
[INFO] 
[INFO] --- maven-install-plugin:2.5.2:install (default-install) @ openjpa-lib ---
[INFO] Installing <https://builds.apache.org/job/OpenJPA-2.4.x-jdk8/ws/openjpa-lib/target/openjpa-lib-2.4.3-SNAPSHOT.jar>
to /home/jenkins/.m2/repository/org/apache/openjpa/openjpa-lib/2.4.3-SNAPSHOT/openjpa-lib-2.4.3-SNAPSHOT.jar
[INFO] Installing <https://builds.apache.org/job/OpenJPA-2.4.x-jdk8/ws/openjpa-lib/pom.xml>
to /home/jenkins/.m2/repository/org/apache/openjpa/openjpa-lib/2.4.3-SNAPSHOT/openjpa-lib-2.4.3-SNAPSHOT.pom
[INFO] Installing <https://builds.apache.org/job/OpenJPA-2.4.x-jdk8/ws/openjpa-lib/target/openjpa-lib-2.4.3-SNAPSHOT-tests.jar>
to /home/jenkins/.m2/repository/org/apache/openjpa/openjpa-lib/2.4.3-SNAPSHOT/openjpa-lib-2.4.3-SNAPSHOT-tests.jar
[INFO]                                                                         
[INFO] ------------------------------------------------------------------------
[INFO] Building OpenJPA Kernel 2.4.3-SNAPSHOT
[INFO] ------------------------------------------------------------------------
[INFO] 
[INFO] --- maven-clean-plugin:2.5:clean (default-clean) @ openjpa-kernel ---
[INFO] 
[INFO] --- buildnumber-maven-plugin:1.4:create (default) @ openjpa-kernel ---
[INFO] 
[INFO] --- maven-enforcer-plugin:1.3.1:enforce (default) @ openjpa-kernel ---
[INFO] 
[INFO] --- javacc-maven-plugin:2.6:jjtree-javacc (jjtree-javacc-jpql) @ openjpa-kernel ---
Java Compiler Compiler Version 5.0 (Tree Builder)
(type "jjtree" with no arguments for help)
Reading from file <https://builds.apache.org/job/OpenJPA-2.4.x-jdk8/ws/openjpa-kernel/src/main/jjtree/org/apache/openjpa/kernel/jpql/JPQL.jjt>
. . .
File "Node.java" does not exist.  Will create one.
File "JPQLTreeConstants.java" does not exist.  Will create one.
File "JJTJPQLState.java" does not exist.  Will create one.
Annotated grammar generated successfully in <https://builds.apache.org/job/OpenJPA-2.4.x-jdk8/ws/openjpa-kernel/target/javacc-1514995040891/node/JPQL.jj>
Java Compiler Compiler Version 5.0 (Parser Generator)
(type "javacc" with no arguments for help)
Reading from file <https://builds.apache.org/job/OpenJPA-2.4.x-jdk8/ws/openjpa-kernel/target/javacc-1514995040891/node/JPQL.jj>
. . .
Warning: Choice conflict in (...)* construct at line 944, column 17.
         Expansion nested within construct and expansion following construct
         have common prefixes, one of which is: "+"
         Consider using a lookahead of 2 or more for nested expansion.
Warning: Choice conflict in (...)* construct at line 953, column 17.
         Expansion nested within construct and expansion following construct
         have common prefixes, one of which is: "*"
         Consider using a lookahead of 2 or more for nested expansion.
File "TokenMgrError.java" does not exist.  Will create one.
File "ParseException.java" does not exist.  Will create one.
File "Token.java" does not exist.  Will create one.
File "JavaCharStream.java" does not exist.  Will create one.
Parser generated with 0 errors and 2 warnings.
[INFO] Processed 1 grammar
[INFO] 
[INFO] --- maven-checkstyle-plugin:2.9:checkstyle (default) @ openjpa-kernel ---
[INFO] Starting audit...
Audit done.

[WARNING] Unable to locate Source XRef to link to - DISABLED
[INFO] 
[INFO] --- maven-remote-resources-plugin:1.5:process (default) @ openjpa-kernel ---
[INFO] 
[INFO] --- maven-resources-plugin:2.7:resources (default-resources) @ openjpa-kernel ---
[INFO] Using 'UTF-8' encoding to copy filtered resources.
[INFO] Copying 15 resources
[INFO] Copying 3 resources
[INFO] 
[INFO] --- maven-compiler-plugin:3.5.1:compile (default-compile) @ openjpa-kernel ---
[INFO] Changes detected - recompiling the module!
[INFO] Compiling 506 source files to <https://builds.apache.org/job/OpenJPA-2.4.x-jdk8/ws/openjpa-kernel/target/classes>
[INFO] -------------------------------------------------------------
[ERROR] COMPILATION ERROR : 
[INFO] -------------------------------------------------------------
[ERROR] <https://builds.apache.org/job/OpenJPA-2.4.x-jdk8/ws/openjpa-kernel/src/main/java/org/apache/openjpa/kernel/BrokerImpl.java>:[2152,75]
diamond operator is not supported in -source 1.6
  (use -source 7 or higher to enable diamond operator)
[INFO] 1 error
[INFO] -------------------------------------------------------------
[INFO] ------------------------------------------------------------------------
[INFO] Reactor Summary:
[INFO] 
[INFO] OpenJPA Parent POM ................................. SUCCESS [  9.600 s]
[INFO] OpenJPA Utilities Library .......................... SUCCESS [  9.744 s]
[INFO] OpenJPA Kernel ..................................... FAILURE [  4.238 s]
[INFO] OpenJPA JDBC ....................................... SKIPPED
[INFO] OpenJPA Persistence ................................ SKIPPED
[INFO] OpenJPA Persistence JDBC ........................... SKIPPED
[INFO] OpenJPA Persistence Locking Tests .................. SKIPPED
[INFO] OpenJPA tools ...................................... SKIPPED
[INFO] OpenJPA Maven Plugin ............................... SKIPPED
[INFO] OpenJPA XML Store .................................. SKIPPED
[INFO] OpenJPA Slice ...................................... SKIPPED
[INFO] OpenJPA JEST ....................................... SKIPPED
[INFO] OpenJPA Aggregate Jar .............................. SKIPPED
[INFO] OpenJPA Aggregate Jar with Dependencies ............ SKIPPED
[INFO] OpenJPA Project Docs and Assemblies ................ SKIPPED
[INFO] OpenJPA Examples ................................... SKIPPED
[INFO] OpenJPA Examples - Simple .......................... SKIPPED
[INFO] OpenJPA Examples - image-gallery ................... SKIPPED
[INFO] OpenJPA Examples - OpenBooks ....................... SKIPPED
[INFO] OpenJPA Integration Tests .......................... SKIPPED
[INFO] OpenJPA Integration Tests - Daytrader .............. SKIPPED
[INFO] OpenJPA Integration Tests - Examples ............... SKIPPED
[INFO] OpenJPA Integration Tests - SLF4JLogFactory ........ SKIPPED
[INFO] OpenJPA Integration Tests - JPA TCK ................ SKIPPED
[INFO] OpenJPA Integration Tests - Bean Validation ........ SKIPPED
[INFO] OpenJPA Integration Tests - JMX Platform MBeans .... SKIPPED
[INFO] OpenJPA Fetching Statistic Tool .................... SKIPPED
[INFO] OpenJPA Fetching Statistic Tool -- WAS Bundle ...... SKIPPED
[INFO] ------------------------------------------------------------------------
[INFO] BUILD FAILURE
[INFO] ------------------------------------------------------------------------
[INFO] Total time: 24.818 s
[INFO] Finished at: 2018-01-03T15:57:24+00:00
[INFO] Final Memory: 69M/1121M
[INFO] ------------------------------------------------------------------------
[ERROR] Failed to execute goal org.apache.maven.plugins:maven-compiler-plugin:3.5.1:compile
(default-compile) on project openjpa-kernel: Compilation failure
[ERROR] <https://builds.apache.org/job/OpenJPA-2.4.x-jdk8/ws/openjpa-kernel/src/main/java/org/apache/openjpa/kernel/BrokerImpl.java>:[2152,75]
diamond operator is not supported in -source 1.6
[ERROR] (use -source 7 or higher to enable diamond operator)
[ERROR] -> [Help 1]
[ERROR] 
[ERROR] To see the full stack trace of the errors, re-run Maven with the -e switch.
[ERROR] Re-run Maven using the -X switch to enable full debug logging.
[ERROR] 
[ERROR] For more information about the errors and possible solutions, please read the following
articles:
[ERROR] [Help 1] http://cwiki.apache.org/confluence/display/MAVEN/MojoFailureException
[ERROR] 
[ERROR] After correcting the problems, you can resume the build with the command
[ERROR]   mvn <goals> -rf :openjpa-kernel
Build step 'Execute shell' marked build as failure
Archiving artifacts
Setting ANT_1_9_7_HOME=/home/jenkins/tools/ant/apache-ant-1.9.7
Setting MAVEN_3_3_3_HOME=/home/jenkins/tools/maven/apache-maven-3.3.3
Setting JDK_1_8_LATEST__HOME=/home/jenkins/tools/java/latest1.8
Recording test results
Setting ANT_1_9_7_HOME=/home/jenkins/tools/ant/apache-ant-1.9.7
Setting MAVEN_3_3_3_HOME=/home/jenkins/tools/maven/apache-maven-3.3.3
Setting JDK_1_8_LATEST__HOME=/home/jenkins/tools/java/latest1.8
Setting ANT_1_9_7_HOME=/home/jenkins/tools/ant/apache-ant-1.9.7
Setting MAVEN_3_3_3_HOME=/home/jenkins/tools/maven/apache-maven-3.3.3
Setting JDK_1_8_LATEST__HOME=/home/jenkins/tools/java/latest1.8

Mime
View raw message