openjpa-commits mailing list archives

Site index · List index
Message view « Date » · « Thread »
Top « Date » · « Thread »
From Apache Jenkins Server <jenk...@builds.apache.org>
Subject Build failed in Jenkins: OpenJPA-2.4.x-jdk8 #14
Date Wed, 18 Apr 2018 11:58:04 GMT
See <https://builds.apache.org/job/OpenJPA-2.4.x-jdk8/14/display/redirect?page=changes>

Changes:

[struberg] upgrade to xbean-4.8 for java 10+11 support

------------------------------------------
[...truncated 631.80 KB...]
[INFO] Copying 9 resources
[INFO] Copying 3 resources
[INFO] 
[INFO] --- maven-compiler-plugin:3.5.1:compile (default-compile) @ openjpa-lib ---
[INFO] Changes detected - recompiling the module!
[INFO] Compiling 159 source files to <https://builds.apache.org/job/OpenJPA-2.4.x-jdk8/ws/openjpa-lib/target/classes>
[INFO] <https://builds.apache.org/job/OpenJPA-2.4.x-jdk8/ws/openjpa-lib/src/main/java/org/apache/openjpa/lib/rop/SoftRandomAccessResultList.java>:
Some input files use or override a deprecated API.
[INFO] <https://builds.apache.org/job/OpenJPA-2.4.x-jdk8/ws/openjpa-lib/src/main/java/org/apache/openjpa/lib/rop/SoftRandomAccessResultList.java>:
Recompile with -Xlint:deprecation for details.
[INFO] <https://builds.apache.org/job/OpenJPA-2.4.x-jdk8/ws/openjpa-lib/src/main/java/org/apache/openjpa/lib/conf/Value.java>:
Some input files use unchecked or unsafe operations.
[INFO] <https://builds.apache.org/job/OpenJPA-2.4.x-jdk8/ws/openjpa-lib/src/main/java/org/apache/openjpa/lib/conf/Value.java>:
Recompile with -Xlint:unchecked for details.
[INFO] 
[INFO] --- maven-antrun-plugin:1.3:run (set subversion revision) @ openjpa-lib ---
Downloading: https://repo.maven.apache.org/maven2/org/apache/ant/ant-jsch/1.7.1/ant-jsch-1.7.1.pom
3/3 KB         3/3 KB            Downloaded: https://repo.maven.apache.org/maven2/org/apache/ant/ant-jsch/1.7.1/ant-jsch-1.7.1.pom
(3 KB at 158.0 KB/sec)
Downloading: https://repo.maven.apache.org/maven2/com/jcraft/jsch/0.1.29/jsch-0.1.29.pom
965/965 B               Downloaded: https://repo.maven.apache.org/maven2/com/jcraft/jsch/0.1.29/jsch-0.1.29.pom
(965 B at 58.9 KB/sec)
Downloading: https://repo.maven.apache.org/maven2/ant-contrib/ant-contrib/1.0b3/ant-contrib-1.0b3.pom
761/761 B               Downloaded: https://repo.maven.apache.org/maven2/ant-contrib/ant-contrib/1.0b3/ant-contrib-1.0b3.pom
(761 B at 49.5 KB/sec)
Downloading: https://repo.maven.apache.org/maven2/org/apache/ant/ant-jsch/1.7.1/ant-jsch-1.7.1.jar
Downloading: https://repo.maven.apache.org/maven2/com/jcraft/jsch/0.1.29/jsch-0.1.29.jar
Downloading: https://repo.maven.apache.org/maven2/ant-contrib/ant-contrib/1.0b3/ant-contrib-1.0b3.jar
3/31 KB     3/31 KB   3/220 KB   3/31 KB   4/220 KB   5/31 KB   4/220 KB   5/31 KB   7/220
KB   8/31 KB   7/220 KB   8/31 KB   8/220 KB   11/31 KB   8/220 KB   11/31 KB   11/220 KB
  13/31 KB   11/220 KB   13/31 KB   12/220 KB   16/31 KB   12/220 KB   16/31 KB   15/220 KB
  16/31 KB   16/220 KB   19/31 KB   16/220 KB   19/31 KB   19/220 KB   21/31 KB   19/220 KB
  21/31 KB   20/220 KB   24/31 KB   20/220 KB   24/31 KB   23/220 KB   27/31 KB   23/220 KB
  27/31 KB   23/220 KB   3/150 KB   27/31 KB   24/220 KB   3/150 KB   29/31 KB   24/220 KB
  3/150 KB   29/31 KB   24/220 KB   5/150 KB   31/31 KB   24/220 KB   5/150 KB   31/31 KB
  27/220 KB   5/150 KB   31/31 KB   27/220 KB   8/150 KB   31/31 KB   28/220 KB   8/150 KB
  31/31 KB   28/220 KB   11/150 KB   31/31 KB   31/220 KB   11/150 KB   31/31 KB   31/220
KB   13/150 KB   31/31 KB   32/220 KB   13/150 KB   31/31 KB   32/220 KB   16/150 KB   31/31
KB   32/220 KB   19/150 KB   31/31 KB   35/220 KB   19/150 KB   31/31 KB   35/220 KB   21/150
KB   31/31 KB   36/220 KB   21/150 KB   31/31 KB   36/220 KB   24/150 KB   31/31 KB   39/220
KB   24/150 KB   31/31 KB   39/220 KB   27/150 KB   31/31 KB   40/220 KB   27/150 KB   31/31
KB   43/220 KB   27/150 KB   31/31 KB   44/220 KB   27/150 KB   31/31 KB   44/220 KB   29/150
KB   31/31 KB   47/220 KB   29/150 KB   31/31 KB   47/220 KB   32/150 KB   31/31 KB   48/220
KB   32/150 KB   31/31 KB   51/220 KB   32/150 KB   31/31 KB   52/220 KB   32/150 KB   31/31
KB   55/220 KB   32/150 KB   31/31 KB   56/220 KB   32/150 KB   31/31 KB   59/220 KB   32/150
KB   31/31 KB   60/220 KB   32/150 KB   31/31 KB   63/220 KB   32/150 KB   31/31 KB   64/220
KB   32/150 KB   31/31 KB   67/220 KB   32/150 KB   31/31 KB   68/220 KB   32/150 KB   31/31
KB   71/220 KB   32/150 KB   31/31 KB   72/220 KB   32/150 KB   31/31 KB   75/220 KB   32/150
KB   31/31 KB   76/220 KB   32/150 KB   31/31 KB   79/220 KB   32/150 KB   31/31 KB   80/220
KB   32/150 KB   31/31 KB   80/220 KB   36/150 KB   31/31 KB   80/220 KB   40/150 KB   31/31
KB   83/220 KB   40/150 KB   31/31 KB   83/220 KB   44/150 KB   31/31 KB   83/220 KB   48/150
KB   31/31 KB   84/220 KB   48/150 KB   31/31 KB   87/220 KB   48/150 KB   31/31 KB   88/220
KB   48/150 KB   31/31 KB   91/220 KB   48/150 KB   31/31 KB   93/220 KB   48/150 KB   31/31
KB   96/220 KB   48/150 KB   31/31 KB   99/220 KB   48/150 KB   31/31 KB   101/220 KB   48/150
KB   31/31 KB   104/220 KB   48/150 KB   31/31 KB   107/220 KB   48/150 KB   31/31 KB   110/220
KB   48/150 KB   31/31 KB   110/220 KB   52/150 KB   31/31 KB   112/220 KB   52/150 KB   31/31
KB   112/220 KB   56/150 KB   31/31 KB   112/220 KB   60/150 KB   31/31 KB   115/220 KB  
60/150 KB   31/31 KB   115/220 KB   64/150 KB   31/31 KB   117/220 KB   64/150 KB   31/31
KB   120/220 KB   64/150 KB   31/31 KB   123/220 KB   64/150 KB   31/31 KB   126/220 KB  
64/150 KB   31/31 KB   126/220 KB   68/150 KB   31/31 KB   126/220 KB   72/150 KB   31/31
KB   126/220 KB   76/150 KB   31/31 KB   128/220 KB   76/150 KB   31/31 KB   128/220 KB  
80/150 KB   31/31 KB   131/220 KB   80/150 KB   31/31 KB   133/220 KB   80/150 KB   31/31
KB   136/220 KB   80/150 KB   31/31 KB   139/220 KB   80/150 KB   31/31 KB   142/220 KB  
80/150 KB   31/31 KB   144/220 KB   80/150 KB   31/31 KB   144/220 KB   84/150 KB   31/31
KB   144/220 KB   88/150 KB   31/31 KB   144/220 KB   92/150 KB   31/31 KB   144/220 KB  
96/150 KB   31/31 KB   148/220 KB   96/150 KB   31/31 KB   152/220 KB   96/150 KB   31/31
KB   156/220 KB   96/150 KB   31/31 KB   160/220 KB   96/150 KB   31/31 KB   164/220 KB  
96/150 KB   31/31 KB   168/220 KB   96/150 KB   31/31 KB   172/220 KB   96/150 KB   31/31
KB   172/220 KB   100/150 KB   31/31 KB   176/220 KB   100/150 KB   31/31 KB   176/220 KB
  104/150 KB   31/31 KB   176/220 KB   108/150 KB   31/31 KB   176/220 KB   112/150 KB   31/31
KB   176/220 KB   116/150 KB   31/31 KB   180/220 KB   116/150 KB   31/31 KB   184/220 KB
  120/150 KB   31/31 KB   184/220 KB   120/150 KB   31/31 KB   184/220 KB   124/150 KB   31/31
KB   188/220 KB   124/150 KB   31/31 KB   188/220 KB   128/150 KB   31/31 KB   192/220 KB
  128/150 KB   31/31 KB   196/220 KB   128/150 KB   31/31 KB   200/220 KB   128/150 KB   31/31
KB   204/220 KB   128/150 KB   31/31 KB   208/220 KB   128/150 KB   31/31 KB   208/220 KB
  132/150 KB   31/31 KB   212/220 KB   132/150 KB   31/31 KB   212/220 KB   136/150 KB   31/31
KB   216/220 KB   136/150 KB   31/31 KB   216/220 KB   140/150 KB   31/31 KB   220/220 KB
  140/150 KB   31/31 KB   220/220 KB   144/150 KB   31/31 KB   220/220 KB   148/150 KB   31/31
KB   220/220 KB   150/150 KB                                        Downloaded: https://repo.maven.apache.org/maven2/ant-contrib/ant-contrib/1.0b3/ant-contrib-1.0b3.jar
(220 KB at 6257.7 KB/sec)
                                     Downloaded: https://repo.maven.apache.org/maven2/com/jcraft/jsch/0.1.29/jsch-0.1.29.jar
(150 KB at 4161.3 KB/sec)
                                     Downloaded: https://repo.maven.apache.org/maven2/org/apache/ant/ant-jsch/1.7.1/ant-jsch-1.7.1.jar
(31 KB at 319.9 KB/sec)
[INFO] Executing tasks
   [delete] Deleting: <https://builds.apache.org/job/OpenJPA-2.4.x-jdk8/ws/openjpa-lib/pcenhancer.revision.file>
     [echo] Revision: 422266:1829435
     [echo] OpenJPA version: 2.4.3-SNAPSHOT
[INFO] Executed tasks
[INFO] 
[INFO] --- maven-compiler-plugin:3.5.1:testCompile (test-source-compile) @ openjpa-lib ---
[INFO] Changes detected - recompiling the module!
[INFO] Compiling 40 source files to <https://builds.apache.org/job/OpenJPA-2.4.x-jdk8/ws/openjpa-lib/target/test-classes>
[INFO] <https://builds.apache.org/job/OpenJPA-2.4.x-jdk8/ws/openjpa-lib/src/test/java/org/apache/openjpa/lib/util/TestPropertiesParser.java>:
<https://builds.apache.org/job/OpenJPA-2.4.x-jdk8/ws/openjpa-lib/src/test/java/org/apache/openjpa/lib/util/TestPropertiesParser.java>
uses or overrides a deprecated API.
[INFO] <https://builds.apache.org/job/OpenJPA-2.4.x-jdk8/ws/openjpa-lib/src/test/java/org/apache/openjpa/lib/util/TestPropertiesParser.java>:
Recompile with -Xlint:deprecation for details.
[INFO] <https://builds.apache.org/job/OpenJPA-2.4.x-jdk8/ws/openjpa-lib/src/test/java/org/apache/openjpa/lib/test/AbstractTestCase.java>:
Some input files use unchecked or unsafe operations.
[INFO] <https://builds.apache.org/job/OpenJPA-2.4.x-jdk8/ws/openjpa-lib/src/test/java/org/apache/openjpa/lib/test/AbstractTestCase.java>:
Recompile with -Xlint:unchecked for details.
[INFO] 
[INFO] --- maven-resources-plugin:2.7:testResources (default-testResources) @ openjpa-lib
---
[INFO] Using 'UTF-8' encoding to copy filtered resources.
[INFO] Copying 8 resources
[INFO] Copying 3 resources
[INFO] 
[INFO] --- maven-compiler-plugin:3.5.1:testCompile (default-testCompile) @ openjpa-lib ---
[INFO] Changes detected - recompiling the module!
[INFO] Compiling 40 source files to <https://builds.apache.org/job/OpenJPA-2.4.x-jdk8/ws/openjpa-lib/target/test-classes>
[INFO] <https://builds.apache.org/job/OpenJPA-2.4.x-jdk8/ws/openjpa-lib/src/test/java/org/apache/openjpa/lib/util/TestPropertiesParser.java>:
<https://builds.apache.org/job/OpenJPA-2.4.x-jdk8/ws/openjpa-lib/src/test/java/org/apache/openjpa/lib/util/TestPropertiesParser.java>
uses or overrides a deprecated API.
[INFO] <https://builds.apache.org/job/OpenJPA-2.4.x-jdk8/ws/openjpa-lib/src/test/java/org/apache/openjpa/lib/util/TestPropertiesParser.java>:
Recompile with -Xlint:deprecation for details.
[INFO] <https://builds.apache.org/job/OpenJPA-2.4.x-jdk8/ws/openjpa-lib/src/test/java/org/apache/openjpa/lib/test/AbstractTestCase.java>:
Some input files use unchecked or unsafe operations.
[INFO] <https://builds.apache.org/job/OpenJPA-2.4.x-jdk8/ws/openjpa-lib/src/test/java/org/apache/openjpa/lib/test/AbstractTestCase.java>:
Recompile with -Xlint:unchecked for details.
[INFO] 
[INFO] --- maven-surefire-plugin:2.19.1:test (default-test) @ openjpa-lib ---

-------------------------------------------------------
 T E S T S
-------------------------------------------------------
Java HotSpot(TM) 64-Bit Server VM warning: ignoring option MaxPermSize=512m; support was removed
in 8.0
Running org.apache.openjpa.lib.rop.TestRangeResultObjectProvider
Tests run: 17, Failures: 0, Errors: 0, Skipped: 0, Time elapsed: 0.052 sec - in org.apache.openjpa.lib.rop.TestRangeResultObjectProvider
Running org.apache.openjpa.lib.rop.TestOrderedMergedResultObjectProvider
Tests run: 17, Failures: 0, Errors: 0, Skipped: 0, Time elapsed: 0.024 sec - in org.apache.openjpa.lib.rop.TestOrderedMergedResultObjectProvider
Running org.apache.openjpa.lib.rop.TestRandomAccessResultList
Tests run: 17, Failures: 0, Errors: 0, Skipped: 0, Time elapsed: 0.009 sec - in org.apache.openjpa.lib.rop.TestRandomAccessResultList
Running org.apache.openjpa.lib.rop.TestWindowResultList
Tests run: 17, Failures: 0, Errors: 0, Skipped: 0, Time elapsed: 0.006 sec - in org.apache.openjpa.lib.rop.TestWindowResultList
Running org.apache.openjpa.lib.rop.TestMergedResultObjectProvider
Tests run: 17, Failures: 0, Errors: 0, Skipped: 0, Time elapsed: 0.011 sec - in org.apache.openjpa.lib.rop.TestMergedResultObjectProvider
Running org.apache.openjpa.lib.rop.TestLazyForwardResultList
Tests run: 17, Failures: 0, Errors: 0, Skipped: 0, Time elapsed: 0.013 sec - in org.apache.openjpa.lib.rop.TestLazyForwardResultList
Running org.apache.openjpa.lib.rop.TestSimpleResultList
Tests run: 17, Failures: 0, Errors: 0, Skipped: 0, Time elapsed: 0.005 sec - in org.apache.openjpa.lib.rop.TestSimpleResultList
Running org.apache.openjpa.lib.rop.TestListResultList
Tests run: 17, Failures: 0, Errors: 0, Skipped: 0, Time elapsed: 0.006 sec - in org.apache.openjpa.lib.rop.TestListResultList
Running org.apache.openjpa.lib.rop.TestEagerResultList
Tests run: 17, Failures: 0, Errors: 0, Skipped: 0, Time elapsed: 0.005 sec - in org.apache.openjpa.lib.rop.TestEagerResultList
Running org.apache.openjpa.lib.rop.TestSoftRandomAccessResultList
Tests run: 17, Failures: 0, Errors: 0, Skipped: 0, Time elapsed: 0.012 sec - in org.apache.openjpa.lib.rop.TestSoftRandomAccessResultList
Running org.apache.openjpa.lib.util.TestPropertiesParser
Tests run: 13, Failures: 0, Errors: 0, Skipped: 0, Time elapsed: 0.143 sec - in org.apache.openjpa.lib.util.TestPropertiesParser
Running org.apache.openjpa.lib.util.TestTemporaryClassLoader
Tests run: 1, Failures: 0, Errors: 0, Skipped: 0, Time elapsed: 0.003 sec - in org.apache.openjpa.lib.util.TestTemporaryClassLoader
Running org.apache.openjpa.lib.util.TestReferenceSet
Tests run: 4, Failures: 0, Errors: 0, Skipped: 0, Time elapsed: 0.011 sec - in org.apache.openjpa.lib.util.TestReferenceSet
Running org.apache.openjpa.lib.util.TestSimpleRegex
Tests run: 1, Failures: 0, Errors: 0, Skipped: 0, Time elapsed: 0.001 sec - in org.apache.openjpa.lib.util.TestSimpleRegex
Running org.apache.openjpa.lib.util.TestMultiClassLoader
Tests run: 2, Failures: 0, Errors: 0, Skipped: 0, Time elapsed: 0.003 sec - in org.apache.openjpa.lib.util.TestMultiClassLoader
Running org.apache.openjpa.lib.util.TestUUIDGenerator
Tests run: 7, Failures: 0, Errors: 0, Skipped: 0, Time elapsed: 0.11 sec - in org.apache.openjpa.lib.util.TestUUIDGenerator
Running org.apache.openjpa.lib.util.TestParameterTemplate
Tests run: 1, Failures: 0, Errors: 0, Skipped: 0, Time elapsed: 0.001 sec - in org.apache.openjpa.lib.util.TestParameterTemplate
Running org.apache.openjpa.lib.util.TestAbstractEventManager
Tests run: 2, Failures: 0, Errors: 0, Skipped: 0, Time elapsed: 0.002 sec - in org.apache.openjpa.lib.util.TestAbstractEventManager
Running org.apache.openjpa.lib.util.TestTypedProperties
Tests run: 4, Failures: 0, Errors: 0, Skipped: 0, Time elapsed: 0.001 sec - in org.apache.openjpa.lib.util.TestTypedProperties
Running org.apache.openjpa.lib.util.svn.TestSVNUtils
Tests run: 6, Failures: 0, Errors: 0, Skipped: 0, Time elapsed: 0.003 sec - in org.apache.openjpa.lib.util.svn.TestSVNUtils
Running org.apache.openjpa.lib.util.TestLocalizer
Tests run: 7, Failures: 0, Errors: 0, Skipped: 0, Time elapsed: 0.007 sec - in org.apache.openjpa.lib.util.TestLocalizer
Running org.apache.openjpa.lib.util.TestOptions
Tests run: 2, Failures: 0, Errors: 0, Skipped: 0, Time elapsed: 0.016 sec - in org.apache.openjpa.lib.util.TestOptions
Running org.apache.openjpa.lib.graph.TestGraph
Tests run: 3, Failures: 0, Errors: 0, Skipped: 0, Time elapsed: 0.002 sec - in org.apache.openjpa.lib.graph.TestGraph
Running org.apache.openjpa.lib.graph.TestDepthFirstAnalysis
Tests run: 4, Failures: 0, Errors: 0, Skipped: 0, Time elapsed: 0.003 sec - in org.apache.openjpa.lib.graph.TestDepthFirstAnalysis
Running org.apache.openjpa.lib.xml.TestDocTypeReader
Tests run: 3, Failures: 0, Errors: 0, Skipped: 0, Time elapsed: 0.063 sec - in org.apache.openjpa.lib.xml.TestDocTypeReader
Running org.apache.openjpa.lib.xml.TestXMLWriter
Tests run: 1, Failures: 0, Errors: 0, Skipped: 0, Time elapsed: 0.049 sec - in org.apache.openjpa.lib.xml.TestXMLWriter
Running org.apache.openjpa.lib.identifier.TestIdentifiers
Tests run: 1, Failures: 0, Errors: 0, Skipped: 0, Time elapsed: 0.004 sec - in org.apache.openjpa.lib.identifier.TestIdentifiers
Running org.apache.openjpa.lib.conf.test.TestPluginValue
Tests run: 3, Failures: 0, Errors: 0, Skipped: 0, Time elapsed: 0.009 sec - in org.apache.openjpa.lib.conf.test.TestPluginValue
Running org.apache.openjpa.lib.conf.test.TestConfigurationImpl
2  WARN   [main] openjpa.Runtime - The configuration property named "openjpa.ConnectionURL"
was not recognized and will be ignored, although the name closely matches a valid property
called "openjpa.objectKey".
3  WARN   [main] openjpa.Runtime - The configuration property named "openjpa.ConnectionPassword"
was not recognized and will be ignored, although the name closely matches a valid property
called "openjpa.objectKey".
3  WARN   [main] openjpa.Runtime - The configuration property named "openjpa.ConnectionUserName"
was not recognized and will be ignored, although the name closely matches a valid property
called "openjpa.objectKey".
4  WARN   [main] openjpa.Runtime - The configuration property named "openjpa.ConnectionProperties"
was not recognized and will be ignored, although the name closely matches a valid property
called "openjpa.objectKey".
5  WARN   [main] openjpa.Runtime - The configuration property named "openjpa.DynamicEnhancementAgent"
was not recognized and will be ignored.
5  WARN   [main] openjpa.Runtime - The configuration property named "openjpa.ConnectionDriverName"
was not recognized and will be ignored, although the name closely matches a valid property
called "openjpa.objectKey".
0  WARN   [main] openjpa.Runtime - The configuration property named "openjpa.ConnectionURL"
was not recognized and will be ignored, although the name closely matches a valid property
called "openjpa.objectKey".
1  WARN   [main] openjpa.Runtime - The configuration property named "openjpa.ConnectionPassword"
was not recognized and will be ignored, although the name closely matches a valid property
called "openjpa.objectKey".
1  WARN   [main] openjpa.Runtime - The configuration property named "openjpa.ConnectionUserName"
was not recognized and will be ignored, although the name closely matches a valid property
called "openjpa.objectKey".
2  WARN   [main] openjpa.Runtime - The configuration property named "openjpa.ConnectionProperties"
was not recognized and will be ignored, although the name closely matches a valid property
called "openjpa.objectKey".
2  WARN   [main] openjpa.Runtime - The configuration property named "openjpa.DynamicEnhancementAgent"
was not recognized and will be ignored.
3  WARN   [main] openjpa.Runtime - The configuration property named "openjpa.ConnectionDriverName"
was not recognized and will be ignored, although the name closely matches a valid property
called "openjpa.objectKey".
1  WARN   [main] openjpa.Runtime - The configuration property named "openjpa.ConnectionURL"
was not recognized and will be ignored, although the name closely matches a valid property
called "openjpa.objectKey".
1  WARN   [main] openjpa.Runtime - The configuration property named "openjpa.ConnectionPassword"
was not recognized and will be ignored, although the name closely matches a valid property
called "openjpa.objectKey".
1  WARN   [main] openjpa.Runtime - The configuration property named "openjpa.ConnectionUserName"
was not recognized and will be ignored, although the name closely matches a valid property
called "openjpa.objectKey".
2  WARN   [main] openjpa.Runtime - The configuration property named "openjpa.ConnectionProperties"
was not recognized and will be ignored, although the name closely matches a valid property
called "openjpa.objectKey".
2  WARN   [main] openjpa.Runtime - The configuration property named "openjpa.DynamicEnhancementAgent"
was not recognized and will be ignored.
3  WARN   [main] openjpa.Runtime - The configuration property named "openjpa.ConnectionDriverName"
was not recognized and will be ignored, although the name closely matches a valid property
called "openjpa.objectKey".
0  WARN   [main] openjpa.Runtime - The configuration property named "openjpa.ConnectionURL"
was not recognized and will be ignored, although the name closely matches a valid property
called "openjpa.objectKey".
0  WARN   [main] openjpa.Runtime - The configuration property named "openjpa.ConnectionPassword"
was not recognized and will be ignored, although the name closely matches a valid property
called "openjpa.objectKey".
0  WARN   [main] openjpa.Runtime - The configuration property named "openjpa.ConnectionUserName"
was not recognized and will be ignored, although the name closely matches a valid property
called "openjpa.objectKey".
0  WARN   [main] openjpa.Runtime - The configuration property named "openjpa.ConnectionProperties"
was not recognized and will be ignored, although the name closely matches a valid property
called "openjpa.objectKey".
0  WARN   [main] openjpa.Runtime - The configuration property named "openjpa.DynamicEnhancementAgent"
was not recognized and will be ignored.
1  WARN   [main] openjpa.Runtime - The configuration property named "openjpa.ConnectionDriverName"
was not recognized and will be ignored, although the name closely matches a valid property
called "openjpa.objectKey".
Tests run: 8, Failures: 0, Errors: 0, Skipped: 0, Time elapsed: 0.046 sec - in org.apache.openjpa.lib.conf.test.TestConfigurationImpl
Running org.apache.openjpa.lib.conf.TestConfigurationProviderPrefixes
Tests run: 7, Failures: 0, Errors: 0, Skipped: 0, Time elapsed: 0.001 sec - in org.apache.openjpa.lib.conf.TestConfigurationProviderPrefixes
Running org.apache.openjpa.lib.conf.TestXMLCaseConversions
Tests run: 1, Failures: 0, Errors: 0, Skipped: 0, Time elapsed: 0 sec - in org.apache.openjpa.lib.conf.TestXMLCaseConversions
Running org.apache.openjpa.lib.conf.TestValue
Tests run: 3, Failures: 0, Errors: 0, Skipped: 0, Time elapsed: 0.001 sec - in org.apache.openjpa.lib.conf.TestValue
Running org.apache.openjpa.lib.conf.TestConfigurations
Tests run: 3, Failures: 0, Errors: 0, Skipped: 0, Time elapsed: 0.001 sec - in org.apache.openjpa.lib.conf.TestConfigurations

Results :

Tests run: 257, Failures: 0, Errors: 0, Skipped: 0

[INFO] 
[INFO] --- maven-jar-plugin:2.6:jar (default-jar) @ openjpa-lib ---
[INFO] Building jar: <https://builds.apache.org/job/OpenJPA-2.4.x-jdk8/ws/openjpa-lib/target/openjpa-lib-2.4.3-SNAPSHOT.jar>
[INFO] 
[INFO] --- maven-site-plugin:3.4:attach-descriptor (attach-descriptor) @ openjpa-lib ---
[INFO] 
[INFO] --- maven-jar-plugin:2.6:test-jar (attach-tests) @ openjpa-lib ---
[INFO] Building jar: <https://builds.apache.org/job/OpenJPA-2.4.x-jdk8/ws/openjpa-lib/target/openjpa-lib-2.4.3-SNAPSHOT-tests.jar>
[INFO] 
[INFO] --- ianal-maven-plugin:1.0-alpha-1:verify-legal-files (default) @ openjpa-lib ---
[INFO] Checking legal files in: openjpa-lib-2.4.3-SNAPSHOT.jar
[INFO] Checking legal files in: openjpa-lib-2.4.3-SNAPSHOT-tests.jar
[INFO] 
[INFO] --- apache-rat-plugin:0.11:check (default) @ openjpa-lib ---
[INFO] 51 implicit excludes (use -debug for more details).
[INFO] Exclude: **/.*/**
[INFO] Exclude: **/target/**/*
[INFO] 225 resources included (use -debug for more details)
[INFO] Rat check: Summary of files. Unapproved: 0 unknown: 0 generated: 0 approved: 225 licence.
[INFO] 
[INFO] --- maven-install-plugin:2.5.2:install (default-install) @ openjpa-lib ---
[INFO] Installing <https://builds.apache.org/job/OpenJPA-2.4.x-jdk8/ws/openjpa-lib/target/openjpa-lib-2.4.3-SNAPSHOT.jar>
to /home/jenkins/.m2/repository/org/apache/openjpa/openjpa-lib/2.4.3-SNAPSHOT/openjpa-lib-2.4.3-SNAPSHOT.jar
[INFO] Installing <https://builds.apache.org/job/OpenJPA-2.4.x-jdk8/ws/openjpa-lib/pom.xml>
to /home/jenkins/.m2/repository/org/apache/openjpa/openjpa-lib/2.4.3-SNAPSHOT/openjpa-lib-2.4.3-SNAPSHOT.pom
[INFO] Installing <https://builds.apache.org/job/OpenJPA-2.4.x-jdk8/ws/openjpa-lib/target/openjpa-lib-2.4.3-SNAPSHOT-tests.jar>
to /home/jenkins/.m2/repository/org/apache/openjpa/openjpa-lib/2.4.3-SNAPSHOT/openjpa-lib-2.4.3-SNAPSHOT-tests.jar
[INFO]                                                                         
[INFO] ------------------------------------------------------------------------
[INFO] Building OpenJPA Kernel 2.4.3-SNAPSHOT
[INFO] ------------------------------------------------------------------------
Downloading: file://<https://builds.apache.org/job/OpenJPA-2.4.x-jdk8/ws/openjpa-kernel/internal-repository/com/ibm/websphere/websphere_uow_api/0.0.1/websphere_uow_api-0.0.1.pom>
2/2 KB                                        Downloaded: file://<https://builds.apache.org/job/OpenJPA-2.4.x-jdk8/ws/openjpa-kernel/internal-repository/com/ibm/websphere/websphere_uow_api/0.0.1/websphere_uow_api-0.0.1.pom>
(2 KB at 978.5 KB/sec)
Downloading: file://<https://builds.apache.org/job/OpenJPA-2.4.x-jdk8/ws/openjpa-kernel/internal-repository/org/apache/xbean/xbean-asm6-shaded/4.8/xbean-asm6-shaded-4.8.pom>
         Downloading: https://repo.maven.apache.org/maven2/org/apache/xbean/xbean-asm6-shaded/4.8/xbean-asm6-shaded-4.8.pom
         [WARNING] The POM for org.apache.xbean:xbean-asm6-shaded:jar:4.8 is missing, no dependency
information available
Downloading: file://<https://builds.apache.org/job/OpenJPA-2.4.x-jdk8/ws/openjpa-kernel/internal-repository/com/ibm/websphere/websphere_uow_api/0.0.1/websphere_uow_api-0.0.1.jar>
Downloading: file://<https://builds.apache.org/job/OpenJPA-2.4.x-jdk8/ws/openjpa-kernel/internal-repository/org/apache/xbean/xbean-asm6-shaded/4.8/xbean-asm6-shaded-4.8.jar>
4/5 KB   5/5 KB                     Downloaded: file://<https://builds.apache.org/job/OpenJPA-2.4.x-jdk8/ws/openjpa-kernel/internal-repository/com/ibm/websphere/websphere_uow_api/0.0.1/websphere_uow_api-0.0.1.jar>
(5 KB at 1170.2 KB/sec)
Downloading: https://repo.maven.apache.org/maven2/org/apache/xbean/xbean-asm6-shaded/4.8/xbean-asm6-shaded-4.8.jar
         [INFO] ------------------------------------------------------------------------
[INFO] Reactor Summary:
[INFO] 
[INFO] OpenJPA Parent POM ................................. SUCCESS [  6.604 s]
[INFO] OpenJPA Utilities Library .......................... SUCCESS [  9.264 s]
[INFO] OpenJPA Kernel ..................................... FAILURE [  0.260 s]
[INFO] OpenJPA JDBC ....................................... SKIPPED
[INFO] OpenJPA Persistence ................................ SKIPPED
[INFO] OpenJPA Persistence JDBC ........................... SKIPPED
[INFO] OpenJPA Persistence Locking Tests .................. SKIPPED
[INFO] OpenJPA tools ...................................... SKIPPED
[INFO] OpenJPA Maven Plugin ............................... SKIPPED
[INFO] OpenJPA XML Store .................................. SKIPPED
[INFO] OpenJPA Slice ...................................... SKIPPED
[INFO] OpenJPA JEST ....................................... SKIPPED
[INFO] OpenJPA Aggregate Jar .............................. SKIPPED
[INFO] OpenJPA Aggregate Jar with Dependencies ............ SKIPPED
[INFO] OpenJPA Project Docs and Assemblies ................ SKIPPED
[INFO] OpenJPA Examples ................................... SKIPPED
[INFO] OpenJPA Examples - Simple .......................... SKIPPED
[INFO] OpenJPA Examples - image-gallery ................... SKIPPED
[INFO] OpenJPA Examples - OpenBooks ....................... SKIPPED
[INFO] OpenJPA Integration Tests .......................... SKIPPED
[INFO] OpenJPA Integration Tests - Daytrader .............. SKIPPED
[INFO] OpenJPA Integration Tests - Examples ............... SKIPPED
[INFO] OpenJPA Integration Tests - SLF4JLogFactory ........ SKIPPED
[INFO] OpenJPA Integration Tests - JPA TCK ................ SKIPPED
[INFO] OpenJPA Integration Tests - Bean Validation ........ SKIPPED
[INFO] OpenJPA Integration Tests - JMX Platform MBeans .... SKIPPED
[INFO] OpenJPA Fetching Statistic Tool .................... SKIPPED
[INFO] OpenJPA Fetching Statistic Tool -- WAS Bundle ...... SKIPPED
[INFO] ------------------------------------------------------------------------
[INFO] BUILD FAILURE
[INFO] ------------------------------------------------------------------------
[INFO] Total time: 18.030 s
[INFO] Finished at: 2018-04-18T11:58:02+00:00
[INFO] Final Memory: 61M/1757M
[INFO] ------------------------------------------------------------------------
[ERROR] Failed to execute goal on project openjpa-kernel: Could not resolve dependencies for
project org.apache.openjpa:openjpa-kernel:jar:2.4.3-SNAPSHOT: Could not find artifact org.apache.xbean:xbean-asm6-shaded:jar:4.8
in openjpa-internal (file://<https://builds.apache.org/job/OpenJPA-2.4.x-jdk8/ws/openjpa-kernel/internal-repository)>
-> [Help 1]
[ERROR] 
[ERROR] To see the full stack trace of the errors, re-run Maven with the -e switch.
[ERROR] Re-run Maven using the -X switch to enable full debug logging.
[ERROR] 
[ERROR] For more information about the errors and possible solutions, please read the following
articles:
[ERROR] [Help 1] http://cwiki.apache.org/confluence/display/MAVEN/DependencyResolutionException
[ERROR] 
[ERROR] After correcting the problems, you can resume the build with the command
[ERROR]   mvn <goals> -rf :openjpa-kernel
Build step 'Execute shell' marked build as failure
Archiving artifacts
Setting ANT_1_9_7_HOME=/home/jenkins/tools/ant/apache-ant-1.9.7
Setting MAVEN_3_3_3_HOME=/home/jenkins/tools/maven/apache-maven-3.3.3
Setting JDK_1_8_LATEST__HOME=/home/jenkins/tools/java/latest1.8
Recording test results
Setting ANT_1_9_7_HOME=/home/jenkins/tools/ant/apache-ant-1.9.7
Setting MAVEN_3_3_3_HOME=/home/jenkins/tools/maven/apache-maven-3.3.3
Setting JDK_1_8_LATEST__HOME=/home/jenkins/tools/java/latest1.8
Setting ANT_1_9_7_HOME=/home/jenkins/tools/ant/apache-ant-1.9.7
Setting MAVEN_3_3_3_HOME=/home/jenkins/tools/maven/apache-maven-3.3.3
Setting JDK_1_8_LATEST__HOME=/home/jenkins/tools/java/latest1.8

Mime
View raw message