openjpa-commits mailing list archives

Site index · List index
Message view « Date » · « Thread »
Top « Date » · « Thread »
From Apache Jenkins Server <jenk...@builds.apache.org>
Subject Build failed in Jenkins: OpenJPA-2.4.x-jdk8 #13
Date Sun, 15 Apr 2018 10:59:52 GMT
See <https://builds.apache.org/job/OpenJPA-2.4.x-jdk8/13/display/redirect?page=changes>

Changes:

[struberg] OPENJPA-2730 fix assembly for xbean-asm6-shaded

------------------------------------------
[...truncated 630.76 KB...]
[INFO] 
[INFO] --- maven-jar-plugin:2.6:jar (default-jar) @ openjpa-lib ---
[INFO] Building jar: <https://builds.apache.org/job/OpenJPA-2.4.x-jdk8/ws/openjpa-lib/target/openjpa-lib-2.4.3-SNAPSHOT.jar>
[INFO] 
[INFO] --- maven-site-plugin:3.4:attach-descriptor (attach-descriptor) @ openjpa-lib ---
[INFO] 
[INFO] --- maven-jar-plugin:2.6:test-jar (attach-tests) @ openjpa-lib ---
[INFO] Building jar: <https://builds.apache.org/job/OpenJPA-2.4.x-jdk8/ws/openjpa-lib/target/openjpa-lib-2.4.3-SNAPSHOT-tests.jar>
[INFO] 
[INFO] --- ianal-maven-plugin:1.0-alpha-1:verify-legal-files (default) @ openjpa-lib ---
[INFO] Checking legal files in: openjpa-lib-2.4.3-SNAPSHOT.jar
[INFO] Checking legal files in: openjpa-lib-2.4.3-SNAPSHOT-tests.jar
[INFO] 
[INFO] --- apache-rat-plugin:0.11:check (default) @ openjpa-lib ---
[INFO] 51 implicit excludes (use -debug for more details).
[INFO] Exclude: **/.*/**
[INFO] Exclude: **/target/**/*
[INFO] 225 resources included (use -debug for more details)
[INFO] Rat check: Summary of files. Unapproved: 0 unknown: 0 generated: 0 approved: 225 licence.
[INFO] 
[INFO] --- maven-install-plugin:2.5.2:install (default-install) @ openjpa-lib ---
[INFO] Installing <https://builds.apache.org/job/OpenJPA-2.4.x-jdk8/ws/openjpa-lib/target/openjpa-lib-2.4.3-SNAPSHOT.jar>
to /home/jenkins/.m2/repository/org/apache/openjpa/openjpa-lib/2.4.3-SNAPSHOT/openjpa-lib-2.4.3-SNAPSHOT.jar
[INFO] Installing <https://builds.apache.org/job/OpenJPA-2.4.x-jdk8/ws/openjpa-lib/pom.xml>
to /home/jenkins/.m2/repository/org/apache/openjpa/openjpa-lib/2.4.3-SNAPSHOT/openjpa-lib-2.4.3-SNAPSHOT.pom
[INFO] Installing <https://builds.apache.org/job/OpenJPA-2.4.x-jdk8/ws/openjpa-lib/target/openjpa-lib-2.4.3-SNAPSHOT-tests.jar>
to /home/jenkins/.m2/repository/org/apache/openjpa/openjpa-lib/2.4.3-SNAPSHOT/openjpa-lib-2.4.3-SNAPSHOT-tests.jar
[INFO]                                                                         
[INFO] ------------------------------------------------------------------------
[INFO] Building OpenJPA Kernel 2.4.3-SNAPSHOT
[INFO] ------------------------------------------------------------------------
[INFO] 
[INFO] --- maven-clean-plugin:2.5:clean (default-clean) @ openjpa-kernel ---
[INFO] 
[INFO] --- buildnumber-maven-plugin:1.4:create (default) @ openjpa-kernel ---
[INFO] 
[INFO] --- maven-enforcer-plugin:1.3.1:enforce (default) @ openjpa-kernel ---
[INFO] 
[INFO] --- javacc-maven-plugin:2.6:jjtree-javacc (jjtree-javacc-jpql) @ openjpa-kernel ---
Java Compiler Compiler Version 5.0 (Tree Builder)
(type "jjtree" with no arguments for help)
Reading from file <https://builds.apache.org/job/OpenJPA-2.4.x-jdk8/ws/openjpa-kernel/src/main/jjtree/org/apache/openjpa/kernel/jpql/JPQL.jjt>
. . .
File "Node.java" does not exist.  Will create one.
File "JPQLTreeConstants.java" does not exist.  Will create one.
File "JJTJPQLState.java" does not exist.  Will create one.
Annotated grammar generated successfully in <https://builds.apache.org/job/OpenJPA-2.4.x-jdk8/ws/openjpa-kernel/target/javacc-1523789978401/node/JPQL.jj>
Java Compiler Compiler Version 5.0 (Parser Generator)
(type "javacc" with no arguments for help)
Reading from file <https://builds.apache.org/job/OpenJPA-2.4.x-jdk8/ws/openjpa-kernel/target/javacc-1523789978401/node/JPQL.jj>
. . .
Warning: Choice conflict in (...)* construct at line 944, column 17.
         Expansion nested within construct and expansion following construct
         have common prefixes, one of which is: "+"
         Consider using a lookahead of 2 or more for nested expansion.
Warning: Choice conflict in (...)* construct at line 953, column 17.
         Expansion nested within construct and expansion following construct
         have common prefixes, one of which is: "*"
         Consider using a lookahead of 2 or more for nested expansion.
File "TokenMgrError.java" does not exist.  Will create one.
File "ParseException.java" does not exist.  Will create one.
File "Token.java" does not exist.  Will create one.
File "JavaCharStream.java" does not exist.  Will create one.
Parser generated with 0 errors and 2 warnings.
[INFO] Processed 1 grammar
[INFO] 
[INFO] --- maven-checkstyle-plugin:2.9:checkstyle (default) @ openjpa-kernel ---
[INFO] Starting audit...
Audit done.

[WARNING] Unable to locate Source XRef to link to - DISABLED
[INFO] 
[INFO] --- maven-remote-resources-plugin:1.5:process (default) @ openjpa-kernel ---
[INFO] 
[INFO] --- maven-resources-plugin:2.7:resources (default-resources) @ openjpa-kernel ---
[INFO] Using 'UTF-8' encoding to copy filtered resources.
[INFO] Copying 15 resources
[INFO] Copying 3 resources
[INFO] 
[INFO] --- maven-compiler-plugin:3.5.1:compile (default-compile) @ openjpa-kernel ---
[INFO] Changes detected - recompiling the module!
[INFO] Compiling 506 source files to <https://builds.apache.org/job/OpenJPA-2.4.x-jdk8/ws/openjpa-kernel/target/classes>
[INFO] <https://builds.apache.org/job/OpenJPA-2.4.x-jdk8/ws/openjpa-kernel/src/main/java/org/apache/openjpa/kernel/ExpressionStoreQuery.java>:
Some input files use or override a deprecated API.
[INFO] <https://builds.apache.org/job/OpenJPA-2.4.x-jdk8/ws/openjpa-kernel/src/main/java/org/apache/openjpa/kernel/ExpressionStoreQuery.java>:
Recompile with -Xlint:deprecation for details.
[INFO] <https://builds.apache.org/job/OpenJPA-2.4.x-jdk8/ws/openjpa-kernel/src/main/java/org/apache/openjpa/kernel/exps/Val.java>:
Some input files use unchecked or unsafe operations.
[INFO] <https://builds.apache.org/job/OpenJPA-2.4.x-jdk8/ws/openjpa-kernel/src/main/java/org/apache/openjpa/kernel/exps/Val.java>:
Recompile with -Xlint:unchecked for details.
[INFO] 
[INFO] --- maven-antrun-plugin:1.3:run (add-was-interfaces) @ openjpa-kernel ---
[INFO] Executing tasks
[INFO] Executed tasks
[INFO] 
[INFO] --- maven-antrun-plugin:1.3:run (generate-standard-sco-proxies) @ openjpa-kernel ---
[INFO] Executing tasks
org.apache.openjpa.util.java$sql$Date$proxy
org.apache.openjpa.util.java$sql$Time$proxy
org.apache.openjpa.util.java$sql$Timestamp$proxy
org.apache.openjpa.util.java$util$ArrayList$proxy
org.apache.openjpa.util.java$util$Date$proxy
org.apache.openjpa.util.java$util$GregorianCalendar$proxy
org.apache.openjpa.util.java$util$HashMap$proxy
org.apache.openjpa.util.java$util$HashSet$proxy
org.apache.openjpa.util.java$util$Hashtable$proxy
org.apache.openjpa.util.java$util$LinkedList$proxy
org.apache.openjpa.util.java$util$Properties$proxy
org.apache.openjpa.util.java$util$TreeMap$proxy
org.apache.openjpa.util.java$util$TreeSet$proxy
org.apache.openjpa.util.java$util$Vector$proxy
org.apache.openjpa.util.java$util$EnumMap$proxy
org.apache.openjpa.util.java$util$IdentityHashMap$proxy
org.apache.openjpa.util.java$util$LinkedHashMap$proxy
org.apache.openjpa.util.java$util$LinkedHashSet$proxy
org.apache.openjpa.util.java$util$PriorityQueue$proxy
[INFO] Executed tasks
[INFO] 
[INFO] --- maven-compiler-plugin:3.5.1:testCompile (test-source-compile) @ openjpa-kernel
---
[INFO] Changes detected - recompiling the module!
[INFO] Compiling 13 source files to <https://builds.apache.org/job/OpenJPA-2.4.x-jdk8/ws/openjpa-kernel/target/test-classes>
[INFO] <https://builds.apache.org/job/OpenJPA-2.4.x-jdk8/ws/openjpa-kernel/src/test/java/org/apache/openjpa/util/TestProxyManager.java>:
Some input files use unchecked or unsafe operations.
[INFO] <https://builds.apache.org/job/OpenJPA-2.4.x-jdk8/ws/openjpa-kernel/src/test/java/org/apache/openjpa/util/TestProxyManager.java>:
Recompile with -Xlint:unchecked for details.
[INFO] 
[INFO] --- maven-resources-plugin:2.7:testResources (default-testResources) @ openjpa-kernel
---
[INFO] Using 'UTF-8' encoding to copy filtered resources.
[INFO] skip non existing resourceDirectory <https://builds.apache.org/job/OpenJPA-2.4.x-jdk8/ws/openjpa-kernel/src/test/resources>
[INFO] Copying 3 resources
[INFO] 
[INFO] --- maven-compiler-plugin:3.5.1:testCompile (default-testCompile) @ openjpa-kernel
---
[INFO] Changes detected - recompiling the module!
[INFO] Compiling 13 source files to <https://builds.apache.org/job/OpenJPA-2.4.x-jdk8/ws/openjpa-kernel/target/test-classes>
[INFO] <https://builds.apache.org/job/OpenJPA-2.4.x-jdk8/ws/openjpa-kernel/src/test/java/org/apache/openjpa/util/TestProxyManager.java>:
Some input files use unchecked or unsafe operations.
[INFO] <https://builds.apache.org/job/OpenJPA-2.4.x-jdk8/ws/openjpa-kernel/src/test/java/org/apache/openjpa/util/TestProxyManager.java>:
Recompile with -Xlint:unchecked for details.
[INFO] 
[INFO] --- maven-surefire-plugin:2.19.1:test (default-test) @ openjpa-kernel ---

-------------------------------------------------------
 T E S T S
-------------------------------------------------------
Java HotSpot(TM) 64-Bit Server VM warning: ignoring option MaxPermSize=512m; support was removed
in 8.0
Running org.apache.openjpa.enhance.TestAsmAdaptor
Tests run: 1, Failures: 0, Errors: 0, Skipped: 0, Time elapsed: 0.094 sec - in org.apache.openjpa.enhance.TestAsmAdaptor
Running org.apache.openjpa.enhance.TestPCSubclassNameConversion
Tests run: 1, Failures: 0, Errors: 0, Skipped: 0, Time elapsed: 0.047 sec - in org.apache.openjpa.enhance.TestPCSubclassNameConversion
Running org.apache.openjpa.enhance.TestGetDeclaredMethod
Tests run: 3, Failures: 0, Errors: 0, Skipped: 0, Time elapsed: 0.028 sec - in org.apache.openjpa.enhance.TestGetDeclaredMethod
Running org.apache.openjpa.ee.TestOSGiManagedRuntime
Tests run: 4, Failures: 0, Errors: 0, Skipped: 0, Time elapsed: 0.013 sec - in org.apache.openjpa.ee.TestOSGiManagedRuntime
Running org.apache.openjpa.ee.TestWASManagedRuntime
Tests run: 1, Failures: 0, Errors: 0, Skipped: 0, Time elapsed: 0.001 sec - in org.apache.openjpa.ee.TestWASManagedRuntime
Running org.apache.openjpa.conf.TestSpecification
Tests run: 3, Failures: 0, Errors: 0, Skipped: 0, Time elapsed: 0.004 sec - in org.apache.openjpa.conf.TestSpecification
Running org.apache.openjpa.util.TestProxyManager
Tests run: 44, Failures: 0, Errors: 0, Skipped: 0, Time elapsed: 0.376 sec - in org.apache.openjpa.util.TestProxyManager
Running org.apache.openjpa.util.TestResultShape
Tests run: 8, Failures: 0, Errors: 0, Skipped: 0, Time elapsed: 0.018 sec - in org.apache.openjpa.util.TestResultShape
Running org.apache.openjpa.meta.TestJavaTypes
Tests run: 1, Failures: 0, Errors: 0, Skipped: 0, Time elapsed: 0.006 sec - in org.apache.openjpa.meta.TestJavaTypes
Running org.apache.openjpa.meta.TestAccessCode
Tests run: 8, Failures: 0, Errors: 0, Skipped: 0, Time elapsed: 0.008 sec - in org.apache.openjpa.meta.TestAccessCode
Running org.apache.openjpa.meta.TestMemberProvider
Tests run: 2, Failures: 0, Errors: 0, Skipped: 0, Time elapsed: 0.103 sec - in org.apache.openjpa.meta.TestMemberProvider

Results :

Tests run: 76, Failures: 0, Errors: 0, Skipped: 0

[INFO] 
[INFO] --- maven-jar-plugin:2.6:jar (default-jar) @ openjpa-kernel ---
[INFO] Building jar: <https://builds.apache.org/job/OpenJPA-2.4.x-jdk8/ws/openjpa-kernel/target/openjpa-kernel-2.4.3-SNAPSHOT.jar>
[INFO] 
[INFO] --- maven-site-plugin:3.4:attach-descriptor (attach-descriptor) @ openjpa-kernel ---
[INFO] 
[INFO] --- maven-jar-plugin:2.6:test-jar (attach-tests) @ openjpa-kernel ---
[INFO] Building jar: <https://builds.apache.org/job/OpenJPA-2.4.x-jdk8/ws/openjpa-kernel/target/openjpa-kernel-2.4.3-SNAPSHOT-tests.jar>
[INFO] 
[INFO] --- ianal-maven-plugin:1.0-alpha-1:verify-legal-files (default) @ openjpa-kernel ---
[INFO] Checking legal files in: openjpa-kernel-2.4.3-SNAPSHOT.jar
[INFO] Checking legal files in: openjpa-kernel-2.4.3-SNAPSHOT-tests.jar
[INFO] 
[INFO] --- apache-rat-plugin:0.11:check (default) @ openjpa-kernel ---
[INFO] 51 implicit excludes (use -debug for more details).
[INFO] Exclude: **/.*/**
[INFO] Exclude: **/target/**/*
[INFO] 538 resources included (use -debug for more details)
[INFO] Rat check: Summary of files. Unapproved: 0 unknown: 0 generated: 0 approved: 538 licence.
[INFO] 
[INFO] --- maven-install-plugin:2.5.2:install (default-install) @ openjpa-kernel ---
[INFO] Installing <https://builds.apache.org/job/OpenJPA-2.4.x-jdk8/ws/openjpa-kernel/target/openjpa-kernel-2.4.3-SNAPSHOT.jar>
to /home/jenkins/.m2/repository/org/apache/openjpa/openjpa-kernel/2.4.3-SNAPSHOT/openjpa-kernel-2.4.3-SNAPSHOT.jar
[INFO] Installing <https://builds.apache.org/job/OpenJPA-2.4.x-jdk8/ws/openjpa-kernel/pom.xml>
to /home/jenkins/.m2/repository/org/apache/openjpa/openjpa-kernel/2.4.3-SNAPSHOT/openjpa-kernel-2.4.3-SNAPSHOT.pom
[INFO] Installing <https://builds.apache.org/job/OpenJPA-2.4.x-jdk8/ws/openjpa-kernel/target/openjpa-kernel-2.4.3-SNAPSHOT-tests.jar>
to /home/jenkins/.m2/repository/org/apache/openjpa/openjpa-kernel/2.4.3-SNAPSHOT/openjpa-kernel-2.4.3-SNAPSHOT-tests.jar
[INFO]                                                                         
[INFO] ------------------------------------------------------------------------
[INFO] Building OpenJPA JDBC 2.4.3-SNAPSHOT
[INFO] ------------------------------------------------------------------------
Downloading: https://repo.maven.apache.org/maven2/postgresql/postgresql/9.1-901-1.jdbc4/postgresql-9.1-901-1.jdbc4.pom
[WARNING] Failed to create parent directories for tracking file /home/jenkins/.m2/repository/postgresql/postgresql/9.1-901-1.jdbc4/postgresql-9.1-901-1.jdbc4.pom.lastUpdated
[INFO] ------------------------------------------------------------------------
[INFO] Reactor Summary:
[INFO] 
[INFO] OpenJPA Parent POM ................................. SUCCESS [  8.386 s]
[INFO] OpenJPA Utilities Library .......................... SUCCESS [ 12.503 s]
[INFO] OpenJPA Kernel ..................................... SUCCESS [ 11.389 s]
[INFO] OpenJPA JDBC ....................................... FAILURE [  0.600 s]
[INFO] OpenJPA Persistence ................................ SKIPPED
[INFO] OpenJPA Persistence JDBC ........................... SKIPPED
[INFO] OpenJPA Persistence Locking Tests .................. SKIPPED
[INFO] OpenJPA tools ...................................... SKIPPED
[INFO] OpenJPA Maven Plugin ............................... SKIPPED
[INFO] OpenJPA XML Store .................................. SKIPPED
[INFO] OpenJPA Slice ...................................... SKIPPED
[INFO] OpenJPA JEST ....................................... SKIPPED
[INFO] OpenJPA Aggregate Jar .............................. SKIPPED
[INFO] OpenJPA Aggregate Jar with Dependencies ............ SKIPPED
[INFO] OpenJPA Project Docs and Assemblies ................ SKIPPED
[INFO] OpenJPA Examples ................................... SKIPPED
[INFO] OpenJPA Examples - Simple .......................... SKIPPED
[INFO] OpenJPA Examples - image-gallery ................... SKIPPED
[INFO] OpenJPA Examples - OpenBooks ....................... SKIPPED
[INFO] OpenJPA Integration Tests .......................... SKIPPED
[INFO] OpenJPA Integration Tests - Daytrader .............. SKIPPED
[INFO] OpenJPA Integration Tests - Examples ............... SKIPPED
[INFO] OpenJPA Integration Tests - SLF4JLogFactory ........ SKIPPED
[INFO] OpenJPA Integration Tests - JPA TCK ................ SKIPPED
[INFO] OpenJPA Integration Tests - Bean Validation ........ SKIPPED
[INFO] OpenJPA Integration Tests - JMX Platform MBeans .... SKIPPED
[INFO] OpenJPA Fetching Statistic Tool .................... SKIPPED
[INFO] OpenJPA Fetching Statistic Tool -- WAS Bundle ...... SKIPPED
[INFO] ------------------------------------------------------------------------
[INFO] BUILD FAILURE
[INFO] ------------------------------------------------------------------------
[INFO] Total time: 34.317 s
[INFO] Finished at: 2018-04-15T10:59:50+00:00
[INFO] Final Memory: 81M/1895M
[INFO] ------------------------------------------------------------------------
[ERROR] Failed to execute goal on project openjpa-jdbc: Could not resolve dependencies for
project org.apache.openjpa:openjpa-jdbc:jar:2.4.3-SNAPSHOT: Failed to collect dependencies
at postgresql:postgresql:jar:9.1-901-1.jdbc4: Failed to read artifact descriptor for postgresql:postgresql:jar:9.1-901-1.jdbc4:
Could not transfer artifact postgresql:postgresql:pom:9.1-901-1.jdbc4 from/to central (https://repo.maven.apache.org/maven2):
/home/jenkins/.m2/repository/postgresql/postgresql/9.1-901-1.jdbc4/postgresql-9.1-901-1.jdbc4.pom.part.lock
(No such file or directory) -> [Help 1]
[ERROR] 
[ERROR] To see the full stack trace of the errors, re-run Maven with the -e switch.
[ERROR] Re-run Maven using the -X switch to enable full debug logging.
[ERROR] 
[ERROR] For more information about the errors and possible solutions, please read the following
articles:
[ERROR] [Help 1] http://cwiki.apache.org/confluence/display/MAVEN/DependencyResolutionException
[ERROR] 
[ERROR] After correcting the problems, you can resume the build with the command
[ERROR]   mvn <goals> -rf :openjpa-jdbc
Build step 'Execute shell' marked build as failure
Archiving artifacts
Setting ANT_1_9_7_HOME=/home/jenkins/tools/ant/apache-ant-1.9.7
Setting MAVEN_3_3_3_HOME=/home/jenkins/tools/maven/apache-maven-3.3.3
Setting JDK_1_8_LATEST__HOME=/home/jenkins/tools/java/latest1.8
Recording test results
Setting ANT_1_9_7_HOME=/home/jenkins/tools/ant/apache-ant-1.9.7
Setting MAVEN_3_3_3_HOME=/home/jenkins/tools/maven/apache-maven-3.3.3
Setting JDK_1_8_LATEST__HOME=/home/jenkins/tools/java/latest1.8
Setting ANT_1_9_7_HOME=/home/jenkins/tools/ant/apache-ant-1.9.7
Setting MAVEN_3_3_3_HOME=/home/jenkins/tools/maven/apache-maven-3.3.3
Setting JDK_1_8_LATEST__HOME=/home/jenkins/tools/java/latest1.8

Mime
View raw message