openjpa-commits mailing list archives

Site index · List index
Message view « Date » · « Thread »
Top « Date » · « Thread »
From Apache Jenkins Server <jenk...@builds.apache.org>
Subject Build failed in Jenkins: OpenJPA-trunk #13
Date Wed, 18 Apr 2018 12:21:26 GMT
See <https://builds.apache.org/job/OpenJPA-trunk/13/display/redirect?page=changes>

Changes:

[struberg] upgrade to xBean-4.8 for java 10+11 support

------------------------------------------
[...truncated 617.45 KB...]
[INFO] ------------------------------------------------------------------------
[INFO] Building OpenJPA Utilities Library 3.0.0-SNAPSHOT
[INFO] ------------------------------------------------------------------------
Downloading: http://repo.maven.apache.org/maven2/org/apache/ant/ant/1.9.7/ant-1.9.7.pom
4/10 KB   8/10 KB   10/10 KB              Downloaded: http://repo.maven.apache.org/maven2/org/apache/ant/ant/1.9.7/ant-1.9.7.pom
(10 KB at 65.3 KB/sec)
Downloading: http://repo.maven.apache.org/maven2/org/apache/ant/ant-parent/1.9.7/ant-parent-1.9.7.pom
4/6 KB     6/6 KB            Downloaded: http://repo.maven.apache.org/maven2/org/apache/ant/ant-parent/1.9.7/ant-parent-1.9.7.pom
(6 KB at 304.1 KB/sec)
Downloading: http://repo.maven.apache.org/maven2/org/apache/ant/ant-launcher/1.9.7/ant-launcher-1.9.7.pom
3/3 KB            Downloaded: http://repo.maven.apache.org/maven2/org/apache/ant/ant-launcher/1.9.7/ant-launcher-1.9.7.pom
(3 KB at 134.1 KB/sec)
Downloading: http://repo.maven.apache.org/maven2/org/apache/geronimo/specs/geronimo-validation_1.1_spec/1.0/geronimo-validation_1.1_spec-1.0.pom
4/6 KB   6/6 KB            Downloaded: http://repo.maven.apache.org/maven2/org/apache/geronimo/specs/geronimo-validation_1.1_spec/1.0/geronimo-validation_1.1_spec-1.0.pom
(6 KB at 264.5 KB/sec)
Downloading: http://repo.maven.apache.org/maven2/org/apache/ant/ant/1.9.7/ant-1.9.7.jar
Downloading: http://repo.maven.apache.org/maven2/org/apache/ant/ant-launcher/1.9.7/ant-launcher-1.9.7.jar
Downloading: http://repo.maven.apache.org/maven2/org/apache/geronimo/specs/geronimo-validation_1.1_spec/1.0/geronimo-validation_1.1_spec-1.0.jar
4/18 KB   7/18 KB   11/18 KB   14/18 KB   14/18 KB   3/1989 KB   14/18 KB   7/1989 KB   14/18
KB   8/1989 KB   14/18 KB   11/1989 KB   14/18 KB   14/1989 KB   18/18 KB   14/1989 KB   18/18
KB   17/1989 KB   18/18 KB   17/1989 KB   18/18 KB   20/1989 KB   18/18 KB   23/1989 KB  
18/18 KB   25/1989 KB   18/18 KB   29/1989 KB   18/18 KB   30/1989 KB   18/18 KB   31/1989
KB   18/18 KB   35/1989 KB   18/18 KB   37/1989 KB   18/18 KB   41/1989 KB   18/18 KB   42/1989
KB   18/18 KB   46/1989 KB   18/18 KB   50/1989 KB   18/18 KB   51/1989 KB   18/18 KB   54/1989
KB   18/18 KB   55/1989 KB   18/18 KB   59/1989 KB   18/18 KB   61/1989 KB               
           Downloaded: http://repo.maven.apache.org/maven2/org/apache/ant/ant-launcher/1.9.7/ant-launcher-1.9.7.jar
(18 KB at 640.5 KB/sec)
65/1989 KB              65/1989 KB   69/1989 KB   71/1989 KB   75/1989 KB   76/1989 KB   80/1989
KB   82/1989 KB   86/1989 KB   89/1989 KB   93/1989 KB   95/1989 KB   99/1989 KB   100/1989
KB   104/1989 KB   107/1989 KB   109/1989 KB   113/1989 KB   115/1989 KB   119/1989 KB   122/1989
KB   126/1989 KB   129/1989 KB   133/1989 KB   136/1989 KB   140/1989 KB   143/1989 KB   147/1989
KB   150/1989 KB   154/1989 KB   158/1989 KB   158/1989 KB   162/1989 KB   166/1989 KB   167/1989
KB   171/1989 KB   175/1989 KB   175/1989 KB   179/1989 KB   183/1989 KB   184/1989 KB   188/1989
KB   192/1989 KB   192/1989 KB   196/1989 KB   200/1989 KB   201/1989 KB   205/1989 KB   209/1989
KB   209/1989 KB   213/1989 KB   217/1989 KB   218/1989 KB   222/1989 KB   222/1989 KB   226/1989
KB   230/1989 KB   230/1989 KB   234/1989 KB   238/1989 KB   239/1989 KB   243/1989 KB   247/1989
KB   247/1989 KB   251/1989 KB   255/1989 KB   257/1989 KB   261/1989 KB   265/1989 KB   267/1989
KB   271/1989 KB   275/1989 KB   277/1989 KB   281/1989 KB   285/1989 KB   287/1989 KB   291/1989
KB   295/1989 KB   297/1989 KB   301/1989 KB   305/1989 KB   305/1989 KB   309/1989 KB   311/1989
KB   315/1989 KB   319/1989 KB   322/1989 KB   326/1989 KB   329/1989 KB   333/1989 KB   337/1989
KB   341/1989 KB   345/1989 KB   349/1989 KB   353/1989 KB   353/1989 KB   357/1989 KB   361/1989
KB   365/1989 KB   366/1989 KB   370/1989 KB   374/1989 KB   378/1989 KB   379/1989 KB   383/1989
KB   387/1989 KB   391/1989 KB   392/1989 KB   393/1989 KB   397/1989 KB   401/1989 KB   405/1989
KB   407/1989 KB   410/1989 KB   414/1989 KB   418/1989 KB   422/1989 KB   424/1989 KB   428/1989
KB   432/1989 KB   436/1989 KB   438/1989 KB   440/1989 KB   444/1989 KB   448/1989 KB   452/1989
KB   452/1989 KB   456/1989 KB   460/1989 KB   464/1989 KB   467/1989 KB   471/1989 KB   474/1989
KB   478/1989 KB   482/1989 KB   486/1989 KB   489/1989 KB   493/1989 KB   497/1989 KB   501/1989
KB   505/1989 KB   509/1989 KB   513/1989 KB   517/1989 KB   520/1989 KB   524/1989 KB   528/1989
KB   532/1989 KB   536/1989 KB   537/1989 KB   541/1989 KB   545/1989 KB   549/1989 KB   553/1989
KB   554/1989 KB   556/1989 KB   560/1989 KB   564/1989 KB   568/1989 KB   571/1989 KB   575/1989
KB   579/1989 KB   583/1989 KB   587/1989 KB   588/1989 KB   592/1989 KB   596/1989 KB   600/1989
KB   601/1989 KB   605/1989 KB   609/1989 KB   613/1989 KB   617/1989 KB   618/1989 KB   622/1989
KB   626/1989 KB   630/1989 KB   634/1989 KB   635/1989 KB   639/1989 KB   643/1989 KB   645/1989
KB   649/1989 KB   653/1989 KB   657/1989 KB   661/1989 KB   665/1989 KB   669/1989 KB   673/1989
KB   677/1989 KB   681/1989 KB   683/1989 KB   687/1989 KB   691/1989 KB   695/1989 KB   699/1989
KB   701/1989 KB   705/1989 KB   709/1989 KB   713/1989 KB   717/1989 KB   721/1989 KB   725/1989
KB   728/1989 KB   732/1989 KB   736/1989 KB   740/1989 KB   744/1989 KB   748/1989 KB   752/1989
KB   756/1989 KB   760/1989 KB   764/1989 KB   766/1989 KB   770/1989 KB   774/1989 KB   778/1989
KB   782/1989 KB   786/1989 KB   790/1989 KB   792/1989 KB   792/1989 KB   4/74 KB   796/1989
KB   4/74 KB   796/1989 KB   7/74 KB   800/1989 KB   7/74 KB   800/1989 KB   11/74 KB   804/1989
KB   11/74 KB   804/1989 KB   14/74 KB   808/1989 KB   14/74 KB   812/1989 KB   14/74 KB 
 816/1989 KB   14/74 KB   820/1989 KB   14/74 KB   824/1989 KB   14/74 KB   828/1989 KB  
14/74 KB   831/1989 KB   14/74 KB   835/1989 KB   14/74 KB   839/1989 KB   14/74 KB   843/1989
KB   14/74 KB   847/1989 KB   14/74 KB   851/1989 KB   14/74 KB   855/1989 KB   14/74 KB 
 855/1989 KB   14/74 KB   855/1989 KB   18/74 KB   855/1989 KB   22/74 KB   855/1989 KB  
24/74 KB   855/1989 KB   28/74 KB   855/1989 KB   28/74 KB   855/1989 KB   32/74 KB   855/1989
KB   36/74 KB   855/1989 KB   40/74 KB   855/1989 KB   41/74 KB   859/1989 KB   41/74 KB 
 863/1989 KB   41/74 KB   867/1989 KB   41/74 KB   871/1989 KB   41/74 KB   875/1989 KB  
42/74 KB   875/1989 KB   42/74 KB   879/1989 KB   42/74 KB   883/1989 KB   42/74 KB   887/1989
KB   42/74 KB   891/1989 KB   42/74 KB   895/1989 KB   42/74 KB   896/1989 KB   42/74 KB 
 900/1989 KB   42/74 KB   904/1989 KB   42/74 KB   908/1989 KB   42/74 KB   912/1989 KB  
42/74 KB   916/1989 KB   42/74 KB   918/1989 KB   42/74 KB   919/1989 KB   42/74 KB   919/1989
KB   46/74 KB   919/1989 KB   50/74 KB   919/1989 KB   54/74 KB   919/1989 KB   57/74 KB 
 919/1989 KB   61/74 KB   919/1989 KB   65/74 KB   919/1989 KB   69/74 KB   919/1989 KB  
71/74 KB   919/1989 KB   74/74 KB   923/1989 KB   74/74 KB   927/1989 KB   74/74 KB   931/1989
KB   74/74 KB   935/1989 KB   74/74 KB   939/1989 KB   74/74 KB   940/1989 KB   74/74 KB 
 944/1989 KB   74/74 KB   948/1989 KB   74/74 KB   952/1989 KB   74/74 KB   956/1989 KB  
74/74 KB   960/1989 KB   74/74 KB   962/1989 KB   74/74 KB   966/1989 KB   74/74 KB   970/1989
KB   74/74 KB   974/1989 KB   74/74 KB   978/1989 KB   74/74 KB   982/1989 KB   74/74 KB 
 983/1989 KB   74/74 KB   987/1989 KB   74/74 KB   991/1989 KB   74/74 KB   995/1989 KB  
74/74 KB   999/1989 KB   74/74 KB   1003/1989 KB   74/74 KB   1004/1989 KB   74/74 KB   1008/1989
KB   74/74 KB   1012/1989 KB   74/74 KB   1016/1989 KB   74/74 KB   1020/1989 KB   74/74 KB
  1024/1989 KB   74/74 KB   1025/1989 KB   74/74 KB   1029/1989 KB   74/74 KB   1033/1989
KB   74/74 KB   1037/1989 KB   74/74 KB   1041/1989 KB   74/74 KB   1045/1989 KB   74/74 KB
  1046/1989 KB   74/74 KB   1050/1989 KB   74/74 KB   1054/1989 KB   74/74 KB   1058/1989
KB   74/74 KB   1062/1989 KB   74/74 KB   1066/1989 KB   74/74 KB   1069/1989 KB   74/74 KB
  1070/1989 KB   74/74 KB   1074/1989 KB   74/74 KB   1077/1989 KB   74/74 KB   1081/1989
KB   74/74 KB   1085/1989 KB   74/74 KB   1089/1989 KB   74/74 KB   1093/1989 KB   74/74 KB
  1097/1989 KB   74/74 KB   1100/1989 KB   74/74 KB   1104/1989 KB   74/74 KB   1108/1989
KB   74/74 KB   1110/1989 KB   74/74 KB   1114/1989 KB   74/74 KB   1118/1989 KB   74/74 KB
  1122/1989 KB   74/74 KB   1126/1989 KB   74/74 KB   1130/1989 KB   74/74 KB   1133/1989
KB   74/74 KB   1137/1989 KB   74/74 KB   1141/1989 KB   74/74 KB   1145/1989 KB   74/74 KB
  1149/1989 KB   74/74 KB   1153/1989 KB   74/74 KB   1155/1989 KB   74/74 KB   1159/1989
KB   74/74 KB   1163/1989 KB   74/74 KB   1167/1989 KB   74/74 KB   1169/1989 KB   74/74 KB
  1173/1989 KB   74/74 KB   1174/1989 KB   74/74 KB   1178/1989 KB   74/74 KB   1182/1989
KB   74/74 KB   1186/1989 KB   74/74 KB   1190/1989 KB   74/74 KB   1194/1989 KB   74/74 KB
  1196/1989 KB   74/74 KB   1200/1989 KB   74/74 KB   1204/1989 KB   74/74 KB   1208/1989
KB   74/74 KB   1212/1989 KB   74/74 KB   1216/1989 KB   74/74 KB   1220/1989 KB   74/74 KB
  1220/1989 KB   74/74 KB   1224/1989 KB   74/74 KB   1228/1989 KB   74/74 KB   1232/1989
KB   74/74 KB   1236/1989 KB   74/74 KB   1237/1989 KB   74/74 KB   1241/1989 KB   74/74 KB
  1245/1989 KB   74/74 KB   1249/1989 KB   74/74 KB   1253/1989 KB   74/74 KB   1257/1989
KB   74/74 KB   1258/1989 KB   74/74 KB   1262/1989 KB   74/74 KB   1266/1989 KB   74/74 KB
  1270/1989 KB   74/74 KB   1274/1989 KB   74/74 KB   1278/1989 KB   74/74 KB   1282/1989
KB   74/74 KB   1284/1989 KB   74/74 KB   1285/1989 KB   74/74 KB   1289/1989 KB   74/74 KB
  1293/1989 KB   74/74 KB   1297/1989 KB   74/74 KB   1301/1989 KB   74/74 KB   1305/1989
KB   74/74 KB   1309/1989 KB   74/74 KB   1313/1989 KB   74/74 KB   1317/1989 KB   74/74 KB
  1321/1989 KB   74/74 KB   1325/1989 KB   74/74 KB   1326/1989 KB   74/74 KB   1330/1989
KB   74/74 KB   1334/1989 KB   74/74 KB   1338/1989 KB   74/74 KB   1342/1989 KB   74/74 KB
  1345/1989 KB   74/74 KB   1349/1989 KB   74/74 KB   1353/1989 KB   74/74 KB   1357/1989
KB   74/74 KB   1361/1989 KB   74/74 KB   1365/1989 KB   74/74 KB   1366/1989 KB   74/74 KB
  1370/1989 KB   74/74 KB   1374/1989 KB   74/74 KB   1378/1989 KB   74/74 KB   1382/1989
KB   74/74 KB   1386/1989 KB   74/74 KB   1390/1989 KB   74/74 KB   1391/1989 KB   74/74 KB
  1395/1989 KB   74/74 KB   1399/1989 KB   74/74 KB   1403/1989 KB   74/74 KB   1407/1989
KB   74/74 KB   1411/1989 KB   74/74 KB   1415/1989 KB   74/74 KB   1419/1989 KB   74/74 KB
  1423/1989 KB   74/74 KB   1427/1989 KB   74/74 KB   1428/1989 KB   74/74 KB   1432/1989
KB   74/74 KB   1436/1989 KB   74/74 KB   1438/1989 KB   74/74 KB   1442/1989 KB   74/74 KB
  1446/1989 KB   74/74 KB   1450/1989 KB   74/74 KB   1454/1989 KB   74/74 KB   1458/1989
KB   74/74 KB   1462/1989 KB   74/74 KB   1466/1989 KB   74/74 KB   1466/1989 KB   74/74 KB
  1470/1989 KB   74/74 KB   1474/1989 KB   74/74 KB   1478/1989 KB   74/74 KB   1482/1989
KB   74/74 KB   1486/1989 KB   74/74 KB   1490/1989 KB   74/74 KB   1492/1989 KB   74/74 KB
  1496/1989 KB   74/74 KB   1500/1989 KB   74/74 KB   1504/1989 KB   74/74 KB   1508/1989
KB   74/74 KB   1512/1989 KB   74/74 KB   1514/1989 KB   74/74 KB   1518/1989 KB   74/74 KB
  1522/1989 KB   74/74 KB   1526/1989 KB   74/74 KB   1530/1989 KB   74/74 KB   1534/1989
KB   74/74 KB   1538/1989 KB   74/74 KB   1542/1989 KB   74/74 KB   1543/1989 KB   74/74 KB
  1544/1989 KB   74/74 KB   1548/1989 KB   74/74 KB   1552/1989 KB   74/74 KB   1555/1989
KB   74/74 KB   1559/1989 KB   74/74 KB   1563/1989 KB   74/74 KB   1567/1989 KB   74/74 KB
  1571/1989 KB   74/74 KB   1575/1989 KB   74/74 KB   1579/1989 KB   74/74 KB   1583/1989
KB   74/74 KB   1587/1989 KB   74/74 KB   1591/1989 KB   74/74 KB   1595/1989 KB   74/74 KB
  1599/1989 KB   74/74 KB   1603/1989 KB   74/74 KB   1607/1989 KB   74/74 KB   1611/1989
KB   74/74 KB   1612/1989 KB   74/74 KB   1616/1989 KB   74/74 KB   1619/1989 KB   74/74 KB
  1623/1989 KB   74/74 KB   1627/1989 KB   74/74 KB   1631/1989 KB   74/74 KB   1635/1989
KB   74/74 KB   1639/1989 KB   74/74 KB   1643/1989 KB   74/74 KB   1647/1989 KB   74/74 KB
  1650/1989 KB   74/74 KB   1654/1989 KB   74/74 KB   1658/1989 KB   74/74 KB   1662/1989
KB   74/74 KB   1666/1989 KB   74/74 KB   1670/1989 KB   74/74 KB   1674/1989 KB   74/74 KB
  1678/1989 KB   74/74 KB   1682/1989 KB   74/74 KB   1686/1989 KB   74/74 KB   1690/1989
KB   74/74 KB   1694/1989 KB   74/74 KB   1698/1989 KB   74/74 KB   1702/1989 KB   74/74 KB
  1706/1989 KB   74/74 KB   1710/1989 KB   74/74 KB   1714/1989 KB   74/74 KB   1718/1989
KB   74/74 KB   1722/1989 KB   74/74 KB   1726/1989 KB   74/74 KB   1730/1989 KB   74/74 KB
  1734/1989 KB   74/74 KB   1738/1989 KB   74/74 KB   1742/1989 KB   74/74 KB   1746/1989
KB   74/74 KB   1746/1989 KB   74/74 KB   1750/1989 KB   74/74 KB   1754/1989 KB   74/74 KB
  1758/1989 KB   74/74 KB   1762/1989 KB   74/74 KB   1766/1989 KB   74/74 KB   1770/1989
KB   74/74 KB   1774/1989 KB   74/74 KB   1778/1989 KB   74/74 KB   1782/1989 KB   74/74 KB
  1786/1989 KB   74/74 KB   1790/1989 KB   74/74 KB   1794/1989 KB   74/74 KB   1798/1989
KB   74/74 KB   1802/1989 KB   74/74 KB   1806/1989 KB   74/74 KB   1810/1989 KB   74/74 KB
  1814/1989 KB   74/74 KB   1818/1989 KB   74/74 KB   1822/1989 KB   74/74 KB   1826/1989
KB   74/74 KB   1830/1989 KB   74/74 KB   1834/1989 KB   74/74 KB   1838/1989 KB   74/74 KB
  1842/1989 KB   74/74 KB   1842/1989 KB   74/74 KB   1846/1989 KB   74/74 KB   1850/1989
KB   74/74 KB   1854/1989 KB   74/74 KB   1858/1989 KB   74/74 KB   1862/1989 KB   74/74 KB
  1866/1989 KB   74/74 KB   1870/1989 KB   74/74 KB   1874/1989 KB   74/74 KB   1878/1989
KB   74/74 KB   1882/1989 KB   74/74 KB   1886/1989 KB   74/74 KB   1890/1989 KB   74/74 KB
  1894/1989 KB   74/74 KB   1898/1989 KB   74/74 KB   1902/1989 KB   74/74 KB   1906/1989
KB   74/74 KB   1910/1989 KB   74/74 KB   1914/1989 KB   74/74 KB   1918/1989 KB   74/74 KB
  1922/1989 KB   74/74 KB   1926/1989 KB   74/74 KB   1930/1989 KB   74/74 KB   1934/1989
KB   74/74 KB   1937/1989 KB   74/74 KB   1941/1989 KB   74/74 KB   1945/1989 KB   74/74 KB
  1949/1989 KB   74/74 KB   1953/1989 KB   74/74 KB   1957/1989 KB   74/74 KB   1961/1989
KB   74/74 KB   1965/1989 KB   74/74 KB   1969/1989 KB   74/74 KB   1971/1989 KB   74/74 KB
  1975/1989 KB   74/74 KB   1979/1989 KB   74/74 KB   1980/1989 KB   74/74 KB   1981/1989
KB   74/74 KB   1985/1989 KB   74/74 KB   1989/1989 KB   74/74 KB                        
    Downloaded: http://repo.maven.apache.org/maven2/org/apache/ant/ant/1.9.7/ant-1.9.7.jar
(1989 KB at 12427.9 KB/sec)
                          Downloaded: http://repo.maven.apache.org/maven2/org/apache/geronimo/specs/geronimo-validation_1.1_spec/1.0/geronimo-validation_1.1_spec-1.0.jar
(74 KB at 402.7 KB/sec)
[INFO] 
[INFO] --- maven-clean-plugin:3.0.0:clean (default-clean) @ openjpa-lib ---
[INFO] 
[INFO] --- buildnumber-maven-plugin:1.4:create (default) @ openjpa-lib ---
[INFO] 
[INFO] --- maven-enforcer-plugin:1.4.1:enforce (default) @ openjpa-lib ---
[INFO] 
[INFO] --- maven-checkstyle-plugin:2.9:checkstyle (default) @ openjpa-lib ---
[INFO] Starting audit...
Audit done.

[WARNING] Unable to locate Source XRef to link to - DISABLED
[ERROR] VM #image: error : too few arguments to macro. Wanted 5 got 0
[ERROR] VM #image: error : too few arguments to macro. Wanted 5 got 0
[ERROR] VM #displayTree: error : too few arguments to macro. Wanted 2 got 0
[ERROR] VM #menuItem: error : too few arguments to macro. Wanted 1 got 0
[INFO] 
[INFO] --- maven-remote-resources-plugin:1.5:process (process-resource-bundles) @ openjpa-lib
---
[INFO] 
[INFO] --- maven-resources-plugin:2.7:resources (default-resources) @ openjpa-lib ---
[INFO] Using 'UTF-8' encoding to copy filtered resources.
[INFO] Copying 9 resources
[INFO] Copying 3 resources
[INFO] 
[INFO] --- maven-compiler-plugin:3.5.1:compile (default-compile) @ openjpa-lib ---
[INFO] Changes detected - recompiling the module!
[INFO] Compiling 161 source files to <https://builds.apache.org/job/OpenJPA-trunk/ws/openjpa-lib/target/classes>
[INFO] <https://builds.apache.org/job/OpenJPA-trunk/ws/openjpa-lib/src/main/java/org/apache/openjpa/lib/rop/SoftRandomAccessResultList.java>:
Some input files use or override a deprecated API.
[INFO] <https://builds.apache.org/job/OpenJPA-trunk/ws/openjpa-lib/src/main/java/org/apache/openjpa/lib/rop/SoftRandomAccessResultList.java>:
Recompile with -Xlint:deprecation for details.
[INFO] <https://builds.apache.org/job/OpenJPA-trunk/ws/openjpa-lib/src/main/java/org/apache/openjpa/lib/conf/Value.java>:
Some input files use unchecked or unsafe operations.
[INFO] <https://builds.apache.org/job/OpenJPA-trunk/ws/openjpa-lib/src/main/java/org/apache/openjpa/lib/conf/Value.java>:
Recompile with -Xlint:unchecked for details.
[INFO] 
[INFO] --- maven-antrun-plugin:1.3:run (set subversion revision) @ openjpa-lib ---
Downloading: http://repo.maven.apache.org/maven2/com/jcraft/jsch/0.1.29/jsch-0.1.29.jar
4/150 KB                  7/150 KB   11/150 KB   15/150 KB   19/150 KB   23/150 KB   27/150
KB   28/150 KB   32/150 KB   35/150 KB   39/150 KB   42/150 KB   46/150 KB   49/150 KB   53/150
KB   57/150 KB   61/150 KB   64/150 KB   68/150 KB   72/150 KB   72/150 KB   76/150 KB   80/150
KB   81/150 KB   85/150 KB   89/150 KB   89/150 KB   93/150 KB   97/150 KB   98/150 KB   102/150
KB   106/150 KB   107/150 KB   111/150 KB   115/150 KB   117/150 KB   120/150 KB   124/150
KB   128/150 KB   130/150 KB   134/150 KB   138/150 KB   140/150 KB   144/150 KB   148/150
KB   148/150 KB   150/150 KB                Downloaded: http://repo.maven.apache.org/maven2/com/jcraft/jsch/0.1.29/jsch-0.1.29.jar
(150 KB at 4539.6 KB/sec)
[INFO] Executing tasks
   [delete] Deleting: <https://builds.apache.org/job/OpenJPA-trunk/ws/openjpa-lib/pcenhancer.revision.file>
     [echo] Revision: 422266:1829436
     [echo] OpenJPA version: 3.0.0-SNAPSHOT
[INFO] Executed tasks
[INFO] 
[INFO] --- maven-compiler-plugin:3.5.1:testCompile (test-source-compile) @ openjpa-lib ---
[INFO] Changes detected - recompiling the module!
[INFO] Compiling 42 source files to <https://builds.apache.org/job/OpenJPA-trunk/ws/openjpa-lib/target/test-classes>
[INFO] <https://builds.apache.org/job/OpenJPA-trunk/ws/openjpa-lib/src/test/java/org/apache/openjpa/lib/util/TestPropertiesParser.java>:
<https://builds.apache.org/job/OpenJPA-trunk/ws/openjpa-lib/src/test/java/org/apache/openjpa/lib/util/TestPropertiesParser.java>
uses or overrides a deprecated API.
[INFO] <https://builds.apache.org/job/OpenJPA-trunk/ws/openjpa-lib/src/test/java/org/apache/openjpa/lib/util/TestPropertiesParser.java>:
Recompile with -Xlint:deprecation for details.
[INFO] <https://builds.apache.org/job/OpenJPA-trunk/ws/openjpa-lib/src/test/java/org/apache/openjpa/lib/test/AbstractTestCase.java>:
Some input files use unchecked or unsafe operations.
[INFO] <https://builds.apache.org/job/OpenJPA-trunk/ws/openjpa-lib/src/test/java/org/apache/openjpa/lib/test/AbstractTestCase.java>:
Recompile with -Xlint:unchecked for details.
[INFO] 
[INFO] --- maven-resources-plugin:2.7:testResources (default-testResources) @ openjpa-lib
---
[INFO] Using 'UTF-8' encoding to copy filtered resources.
[INFO] Copying 8 resources
[INFO] Copying 3 resources
[INFO] 
[INFO] --- maven-compiler-plugin:3.5.1:testCompile (default-testCompile) @ openjpa-lib ---
[INFO] Changes detected - recompiling the module!
[INFO] Compiling 42 source files to <https://builds.apache.org/job/OpenJPA-trunk/ws/openjpa-lib/target/test-classes>
[INFO] <https://builds.apache.org/job/OpenJPA-trunk/ws/openjpa-lib/src/test/java/org/apache/openjpa/lib/util/TestPropertiesParser.java>:
<https://builds.apache.org/job/OpenJPA-trunk/ws/openjpa-lib/src/test/java/org/apache/openjpa/lib/util/TestPropertiesParser.java>
uses or overrides a deprecated API.
[INFO] <https://builds.apache.org/job/OpenJPA-trunk/ws/openjpa-lib/src/test/java/org/apache/openjpa/lib/util/TestPropertiesParser.java>:
Recompile with -Xlint:deprecation for details.
[INFO] <https://builds.apache.org/job/OpenJPA-trunk/ws/openjpa-lib/src/test/java/org/apache/openjpa/lib/test/AbstractTestCase.java>:
Some input files use unchecked or unsafe operations.
[INFO] <https://builds.apache.org/job/OpenJPA-trunk/ws/openjpa-lib/src/test/java/org/apache/openjpa/lib/test/AbstractTestCase.java>:
Recompile with -Xlint:unchecked for details.
[INFO] 
[INFO] --- maven-surefire-plugin:2.19.1:test (default-test) @ openjpa-lib ---

-------------------------------------------------------
 T E S T S
-------------------------------------------------------
Running org.apache.openjpa.lib.conf.TestXMLCaseConversions
Tests run: 1, Failures: 0, Errors: 0, Skipped: 0, Time elapsed: 0.027 sec - in org.apache.openjpa.lib.conf.TestXMLCaseConversions
Running org.apache.openjpa.lib.conf.TestValue
Tests run: 3, Failures: 0, Errors: 0, Skipped: 0, Time elapsed: 0 sec - in org.apache.openjpa.lib.conf.TestValue
Running org.apache.openjpa.lib.conf.TestConfigurations
Tests run: 3, Failures: 0, Errors: 0, Skipped: 0, Time elapsed: 0.01 sec - in org.apache.openjpa.lib.conf.TestConfigurations
Running org.apache.openjpa.lib.conf.TestConfigurationProviderPrefixes
Tests run: 7, Failures: 0, Errors: 0, Skipped: 0, Time elapsed: 0.022 sec - in org.apache.openjpa.lib.conf.TestConfigurationProviderPrefixes
Running org.apache.openjpa.lib.conf.test.TestPluginValue
Tests run: 3, Failures: 0, Errors: 0, Skipped: 0, Time elapsed: 0.002 sec - in org.apache.openjpa.lib.conf.test.TestPluginValue
Running org.apache.openjpa.lib.conf.test.TestConfigurationImpl
Tests run: 8, Failures: 0, Errors: 0, Skipped: 0, Time elapsed: 0.111 sec - in org.apache.openjpa.lib.conf.test.TestConfigurationImpl
Running org.apache.openjpa.lib.identifier.TestIdentifiers
Tests run: 1, Failures: 0, Errors: 0, Skipped: 0, Time elapsed: 0.004 sec - in org.apache.openjpa.lib.identifier.TestIdentifiers
Running org.apache.openjpa.lib.rop.TestEagerResultList
Tests run: 17, Failures: 0, Errors: 0, Skipped: 0, Time elapsed: 0.013 sec - in org.apache.openjpa.lib.rop.TestEagerResultList
Running org.apache.openjpa.lib.rop.TestMergedResultObjectProvider
Tests run: 17, Failures: 0, Errors: 0, Skipped: 0, Time elapsed: 0.016 sec - in org.apache.openjpa.lib.rop.TestMergedResultObjectProvider
Running org.apache.openjpa.lib.rop.TestLazyForwardResultList
Tests run: 17, Failures: 0, Errors: 0, Skipped: 0, Time elapsed: 0.011 sec - in org.apache.openjpa.lib.rop.TestLazyForwardResultList
Running org.apache.openjpa.lib.rop.TestListResultList
Tests run: 17, Failures: 0, Errors: 0, Skipped: 0, Time elapsed: 0.004 sec - in org.apache.openjpa.lib.rop.TestListResultList
Running org.apache.openjpa.lib.rop.TestSoftRandomAccessResultList
Tests run: 17, Failures: 0, Errors: 0, Skipped: 0, Time elapsed: 0.013 sec - in org.apache.openjpa.lib.rop.TestSoftRandomAccessResultList
Running org.apache.openjpa.lib.rop.TestRandomAccessResultList
Tests run: 17, Failures: 0, Errors: 0, Skipped: 0, Time elapsed: 0.006 sec - in org.apache.openjpa.lib.rop.TestRandomAccessResultList
Running org.apache.openjpa.lib.rop.TestSimpleResultList
Tests run: 17, Failures: 0, Errors: 0, Skipped: 0, Time elapsed: 0.006 sec - in org.apache.openjpa.lib.rop.TestSimpleResultList
Running org.apache.openjpa.lib.rop.TestWindowResultList
Tests run: 17, Failures: 0, Errors: 0, Skipped: 0, Time elapsed: 0.004 sec - in org.apache.openjpa.lib.rop.TestWindowResultList
Running org.apache.openjpa.lib.rop.TestOrderedMergedResultObjectProvider
Tests run: 17, Failures: 0, Errors: 0, Skipped: 0, Time elapsed: 0.022 sec - in org.apache.openjpa.lib.rop.TestOrderedMergedResultObjectProvider
Running org.apache.openjpa.lib.rop.TestRangeResultObjectProvider
Tests run: 17, Failures: 0, Errors: 0, Skipped: 0, Time elapsed: 0.008 sec - in org.apache.openjpa.lib.rop.TestRangeResultObjectProvider
Running org.apache.openjpa.lib.graph.TestGraph
Tests run: 3, Failures: 0, Errors: 0, Skipped: 0, Time elapsed: 0.002 sec - in org.apache.openjpa.lib.graph.TestGraph
Running org.apache.openjpa.lib.graph.TestDepthFirstAnalysis
Tests run: 4, Failures: 0, Errors: 0, Skipped: 0, Time elapsed: 0.003 sec - in org.apache.openjpa.lib.graph.TestDepthFirstAnalysis
Running org.apache.openjpa.lib.xml.TestXMLWriter
Tests run: 1, Failures: 0, Errors: 0, Skipped: 0, Time elapsed: 0.064 sec - in org.apache.openjpa.lib.xml.TestXMLWriter
Running org.apache.openjpa.lib.xml.TestDocTypeReader
Tests run: 3, Failures: 0, Errors: 0, Skipped: 0, Time elapsed: 0.019 sec - in org.apache.openjpa.lib.xml.TestDocTypeReader
Running org.apache.openjpa.lib.util.TestParameterTemplate
Tests run: 1, Failures: 0, Errors: 0, Skipped: 0, Time elapsed: 0.001 sec - in org.apache.openjpa.lib.util.TestParameterTemplate
Running org.apache.openjpa.lib.util.svn.TestSVNUtils
Tests run: 6, Failures: 0, Errors: 0, Skipped: 0, Time elapsed: 0.004 sec - in org.apache.openjpa.lib.util.svn.TestSVNUtils
Running org.apache.openjpa.lib.util.TestPropertiesParser
Tests run: 13, Failures: 0, Errors: 0, Skipped: 0, Time elapsed: 0.066 sec - in org.apache.openjpa.lib.util.TestPropertiesParser
Running org.apache.openjpa.lib.util.TestTypedProperties
Tests run: 4, Failures: 0, Errors: 0, Skipped: 0, Time elapsed: 0.001 sec - in org.apache.openjpa.lib.util.TestTypedProperties
Running org.apache.openjpa.lib.util.TestLocalizer
Tests run: 7, Failures: 0, Errors: 0, Skipped: 0, Time elapsed: 0.005 sec - in org.apache.openjpa.lib.util.TestLocalizer
Running org.apache.openjpa.lib.util.TestOptions
Tests run: 2, Failures: 0, Errors: 0, Skipped: 0, Time elapsed: 0.003 sec - in org.apache.openjpa.lib.util.TestOptions
Running org.apache.openjpa.lib.util.TestMultiClassLoader
Tests run: 2, Failures: 0, Errors: 0, Skipped: 0, Time elapsed: 0.001 sec - in org.apache.openjpa.lib.util.TestMultiClassLoader
Running org.apache.openjpa.lib.util.TestUUIDGenerator
Tests run: 7, Failures: 0, Errors: 0, Skipped: 0, Time elapsed: 0.111 sec - in org.apache.openjpa.lib.util.TestUUIDGenerator
Running org.apache.openjpa.lib.util.TestSimpleRegex
Tests run: 1, Failures: 0, Errors: 0, Skipped: 0, Time elapsed: 0 sec - in org.apache.openjpa.lib.util.TestSimpleRegex
Running org.apache.openjpa.lib.util.StringUtilTest
Tests run: 11, Failures: 0, Errors: 0, Skipped: 3, Time elapsed: 0.032 sec - in org.apache.openjpa.lib.util.StringUtilTest
Running org.apache.openjpa.lib.util.TestAbstractEventManager
Tests run: 2, Failures: 0, Errors: 0, Skipped: 0, Time elapsed: 0 sec - in org.apache.openjpa.lib.util.TestAbstractEventManager
Running org.apache.openjpa.lib.util.TestTemporaryClassLoader
Tests run: 1, Failures: 0, Errors: 0, Skipped: 0, Time elapsed: 0 sec - in org.apache.openjpa.lib.util.TestTemporaryClassLoader
Running org.apache.openjpa.lib.util.TestReferenceSet
Tests run: 4, Failures: 0, Errors: 0, Skipped: 0, Time elapsed: 0.011 sec - in org.apache.openjpa.lib.util.TestReferenceSet
Running org.apache.openjpa.lib.util.ClassUtilTest
Tests run: 5, Failures: 0, Errors: 0, Skipped: 1, Time elapsed: 0.002 sec - in org.apache.openjpa.lib.util.ClassUtilTest

Results :

Tests run: 273, Failures: 0, Errors: 0, Skipped: 4

[INFO] 
[INFO] --- maven-jar-plugin:3.0.2:jar (default-jar) @ openjpa-lib ---
[INFO] Building jar: <https://builds.apache.org/job/OpenJPA-trunk/ws/openjpa-lib/target/openjpa-lib-3.0.0-SNAPSHOT.jar>
[INFO] 
[INFO] --- maven-site-plugin:3.5.1:attach-descriptor (attach-descriptor) @ openjpa-lib ---
[INFO] 
[INFO] --- maven-jar-plugin:3.0.2:test-jar (attach-tests) @ openjpa-lib ---
[INFO] Building jar: <https://builds.apache.org/job/OpenJPA-trunk/ws/openjpa-lib/target/openjpa-lib-3.0.0-SNAPSHOT-tests.jar>
[INFO] 
[INFO] --- apache-rat-plugin:0.11:check (default) @ openjpa-lib ---
[INFO] 51 implicit excludes (use -debug for more details).
[INFO] Exclude: **/.*/**
[INFO] Exclude: **/target/**/*
[INFO] 229 resources included (use -debug for more details)
[INFO] Rat check: Summary of files. Unapproved: 0 unknown: 0 generated: 0 approved: 229 licence.
[INFO] 
[INFO] --- maven-install-plugin:2.5.2:install (default-install) @ openjpa-lib ---
[INFO] Installing <https://builds.apache.org/job/OpenJPA-trunk/ws/openjpa-lib/target/openjpa-lib-3.0.0-SNAPSHOT.jar>
to /home/jenkins/.m2/repository/org/apache/openjpa/openjpa-lib/3.0.0-SNAPSHOT/openjpa-lib-3.0.0-SNAPSHOT.jar
[INFO] Installing <https://builds.apache.org/job/OpenJPA-trunk/ws/openjpa-lib/pom.xml>
to /home/jenkins/.m2/repository/org/apache/openjpa/openjpa-lib/3.0.0-SNAPSHOT/openjpa-lib-3.0.0-SNAPSHOT.pom
[INFO] Installing <https://builds.apache.org/job/OpenJPA-trunk/ws/openjpa-lib/target/openjpa-lib-3.0.0-SNAPSHOT-tests.jar>
to /home/jenkins/.m2/repository/org/apache/openjpa/openjpa-lib/3.0.0-SNAPSHOT/openjpa-lib-3.0.0-SNAPSHOT-tests.jar
[INFO]                                                                         
[INFO] ------------------------------------------------------------------------
[INFO] Building OpenJPA Kernel 3.0.0-SNAPSHOT
[INFO] ------------------------------------------------------------------------
Downloading: file://<https://builds.apache.org/job/OpenJPA-trunk/ws/openjpa-kernel/internal-repository/org/apache/xbean/xbean-asm6-shaded/4.8/xbean-asm6-shaded-4.8.pom>
             Downloading: http://repo.maven.apache.org/maven2/org/apache/xbean/xbean-asm6-shaded/4.8/xbean-asm6-shaded-4.8.pom
             [WARNING] The POM for org.apache.xbean:xbean-asm6-shaded:jar:4.8 is missing,
no dependency information available
Downloading: file://<https://builds.apache.org/job/OpenJPA-trunk/ws/openjpa-kernel/internal-repository/org/apache/xbean/xbean-asm6-shaded/4.8/xbean-asm6-shaded-4.8.jar>
             Downloading: http://repo.maven.apache.org/maven2/org/apache/xbean/xbean-asm6-shaded/4.8/xbean-asm6-shaded-4.8.jar
             [INFO] ------------------------------------------------------------------------
[INFO] Reactor Summary:
[INFO] 
[INFO] OpenJPA Parent POM ................................ SUCCESS [5.498s]
[INFO] OpenJPA Utilities Library ......................... SUCCESS [10.417s]
[INFO] OpenJPA Kernel .................................... FAILURE [0.366s]
[INFO] OpenJPA JDBC ...................................... SKIPPED
[INFO] OpenJPA Persistence ............................... SKIPPED
[INFO] OpenJPA Persistence JDBC .......................... SKIPPED
[INFO] OpenJPA Persistence Locking Tests ................. SKIPPED
[INFO] OpenJPA tools ..................................... SKIPPED
[INFO] OpenJPA Maven Plugin .............................. SKIPPED
[INFO] OpenJPA XML Store ................................. SKIPPED
[INFO] OpenJPA Slice ..................................... SKIPPED
[INFO] OpenJPA JEST ...................................... SKIPPED
[INFO] OpenJPA Aggregate Jar ............................. SKIPPED
[INFO] OpenJPA Aggregate Jar with Dependencies ........... SKIPPED
[INFO] OpenJPA Project Docs and Assemblies ............... SKIPPED
[INFO] OpenJPA Examples .................................. SKIPPED
[INFO] OpenJPA Examples - Simple ......................... SKIPPED
[INFO] OpenJPA Examples - image-gallery .................. SKIPPED
[INFO] OpenJPA Examples - OpenBooks ...................... SKIPPED
[INFO] OpenJPA Integration Tests ......................... SKIPPED
[INFO] OpenJPA Integration Tests - Daytrader ............. SKIPPED
[INFO] OpenJPA Integration Tests - Examples .............. SKIPPED
[INFO] OpenJPA Integration Tests - SLF4JLogFactory ....... SKIPPED
[INFO] OpenJPA Integration Tests - JPA TCK ............... SKIPPED
[INFO] OpenJPA Integration Tests - Bean Validation ....... SKIPPED
[INFO] OpenJPA Integration Tests - JMX Platform MBeans ... SKIPPED
[INFO] OpenJPA Fetching Statistic Tool ................... SKIPPED
[INFO] OpenJPA Fetching Statistic Tool -- WAS Bundle ..... SKIPPED
[INFO] OpenJPA Features .................................. SKIPPED
[INFO] ------------------------------------------------------------------------
[INFO] BUILD FAILURE
[INFO] ------------------------------------------------------------------------
[INFO] Total time: 17.244s
[INFO] Finished at: Wed Apr 18 12:21:24 UTC 2018
[INFO] Final Memory: 50M/1706M
[INFO] ------------------------------------------------------------------------
[ERROR] Failed to execute goal on project openjpa-kernel: Could not resolve dependencies for
project org.apache.openjpa:openjpa-kernel:jar:3.0.0-SNAPSHOT: Could not find artifact org.apache.xbean:xbean-asm6-shaded:jar:4.8
in openjpa-internal (file://<https://builds.apache.org/job/OpenJPA-trunk/ws/openjpa-kernel/internal-repository)>
-> [Help 1]
[ERROR] 
[ERROR] To see the full stack trace of the errors, re-run Maven with the -e switch.
[ERROR] Re-run Maven using the -X switch to enable full debug logging.
[ERROR] 
[ERROR] For more information about the errors and possible solutions, please read the following
articles:
[ERROR] [Help 1] http://cwiki.apache.org/confluence/display/MAVEN/DependencyResolutionException
[ERROR] 
[ERROR] After correcting the problems, you can resume the build with the command
[ERROR]   mvn <goals> -rf :openjpa-kernel
Build step 'Execute shell' marked build as failure
Archiving artifacts
Setting ANT_1_9_7_HOME=/home/jenkins/tools/ant/apache-ant-1.9.7
Setting MAVEN_3_0_4_HOME=/home/jenkins/tools/maven/apache-maven-3.0.4
Setting JDK_1_8_LATEST__HOME=/home/jenkins/tools/java/latest1.8
Recording test results
Setting ANT_1_9_7_HOME=/home/jenkins/tools/ant/apache-ant-1.9.7
Setting MAVEN_3_0_4_HOME=/home/jenkins/tools/maven/apache-maven-3.0.4
Setting JDK_1_8_LATEST__HOME=/home/jenkins/tools/java/latest1.8
Setting ANT_1_9_7_HOME=/home/jenkins/tools/ant/apache-ant-1.9.7
Setting MAVEN_3_0_4_HOME=/home/jenkins/tools/maven/apache-maven-3.0.4
Setting JDK_1_8_LATEST__HOME=/home/jenkins/tools/java/latest1.8

Mime
View raw message