openjpa-commits mailing list archives

Site index · List index
Message view « Date » · « Thread »
Top « Date » · « Thread »
From Apache Jenkins Server <jenk...@builds.apache.org>
Subject Build failed in Jenkins: OpenJPA-2.4.x-jdk8 #15
Date Mon, 14 May 2018 15:51:19 GMT
See <https://builds.apache.org/job/OpenJPA-2.4.x-jdk8/15/display/redirect?page=changes>

Changes:

[dazeydev] OPENJPA-2646: Sporadic NullPointerException and ClassCastException caused by query cache misses in multithreaded environments.

------------------------------------------
[...truncated 10.40 MB...]
  TestJDBCEscapeDate>AbstractPersistenceTestCase.run:206->AbstractPersistenceTestCase.runBare:541->AbstractPersistenceTestCase.runBare:565->AbstractPersistenceTestCase.runTest:578->testJDBCEscape:133 » IllegalMonitorState
  TestJDBCEscapeDate>AbstractPersistenceTestCase.run:206->AbstractPersistenceTestCase.runBare:541->AbstractPersistenceTestCase.runBare:565->AbstractPersistenceTestCase.runTest:578->testMultipleQueryExecutionWithDateLiteral:173 » IllegalMonitorState
  TestJPAQuerySubclassFunc>AbstractPersistenceTestCase.run:206->AbstractPersistenceTestCase.runBare:541->AbstractPersistenceTestCase.runBare:565->setUp:36->AbstractTestCase.deleteAll:203->AbstractTestCase.deleteAll:192 » IllegalMonitorState
  TestJPAQuerySubclassFunc>AbstractPersistenceTestCase.run:206->AbstractPersistenceTestCase.runBare:541->AbstractPersistenceTestCase.runBare:565->setUp:36->AbstractTestCase.deleteAll:203->AbstractTestCase.deleteAll:192 » IllegalMonitorState
  TestLocate>AbstractPersistenceTestCase.run:206->AbstractPersistenceTestCase.runBare:541->AbstractPersistenceTestCase.runBare:565->AbstractPersistenceTestCase.runTest:578->testLocate:43 » IllegalMonitorState
  TestLocate>AbstractPersistenceTestCase.run:206->AbstractPersistenceTestCase.runBare:541->AbstractPersistenceTestCase.runBare:565->AbstractPersistenceTestCase.runTest:578->testLocateInMemory:56 » IllegalMonitorState
  TestMathQueries>AbstractPersistenceTestCase.run:206->AbstractPersistenceTestCase.runBare:541->AbstractPersistenceTestCase.runBare:565->setUp:48->AbstractTestCase.deleteAll:203->AbstractTestCase.deleteAll:192 » IllegalMonitorState
  TestMethodQLQuery>AbstractPersistenceTestCase.run:206->AbstractPersistenceTestCase.runBare:541->AbstractPersistenceTestCase.runBare:565->AbstractPersistenceTestCase.runTest:578->testInvalidMethodReturnType:78 » Persistence
  TestMethodQLQuery>AbstractPersistenceTestCase.run:206->AbstractPersistenceTestCase.runBare:541->AbstractPersistenceTestCase.runBare:565->AbstractPersistenceTestCase.runTest:578->testMethodQLWithParameters:60 » Persistence
  TestMethodQLQuery>AbstractPersistenceTestCase.run:206->AbstractPersistenceTestCase.runBare:541->AbstractPersistenceTestCase.runBare:565->AbstractPersistenceTestCase.runTest:578->testMethodQLWithoutParametersDeclared:70 » Persistence
  TestMethodQLQuery>AbstractPersistenceTestCase.run:206->AbstractPersistenceTestCase.runBare:541->AbstractPersistenceTestCase.runBare:565->AbstractPersistenceTestCase.runTest:578->testVoidMethodReturnType:88 » Persistence
  TestNamedQueries>AbstractPersistenceTestCase.run:206->AbstractPersistenceTestCase.runBare:541->AbstractPersistenceTestCase.runBare:565->setUp:54->AbstractTestCase.deleteAll:203->AbstractTestCase.deleteAll:192 » IllegalMonitorState
  TestNamedQueries>AbstractPersistenceTestCase.run:206->AbstractPersistenceTestCase.runBare:541->AbstractPersistenceTestCase.runBare:565->setUp:54->AbstractTestCase.deleteAll:203->AbstractTestCase.deleteAll:192 » IllegalMonitorState
  TestNamedQueries>AbstractPersistenceTestCase.run:206->AbstractPersistenceTestCase.runBare:541->AbstractPersistenceTestCase.runBare:565->setUp:54->AbstractTestCase.deleteAll:203->AbstractTestCase.deleteAll:192 » IllegalMonitorState
  TestNamedQueries>AbstractPersistenceTestCase.run:206->AbstractPersistenceTestCase.runBare:541->AbstractPersistenceTestCase.runBare:565->setUp:54->AbstractTestCase.deleteAll:203->AbstractTestCase.deleteAll:192 » IllegalMonitorState
  TestNewEntityAsQueryParameter>AbstractPersistenceTestCase.run:206->AbstractPersistenceTestCase.runBare:541->AbstractPersistenceTestCase.runBare:565->AbstractPersistenceTestCase.runTest:578->testQueryWithManagedPersistentInstanceAsParameter:109->queryWithParameter:118 » IllegalMonitorState
  TestNewEntityAsQueryParameter>AbstractPersistenceTestCase.run:206->AbstractPersistenceTestCase.runBare:541->AbstractPersistenceTestCase.runBare:565->AbstractPersistenceTestCase.runTest:578->testQueryWithTransientInstanceAsParameter:88->queryWithParameter:118 » IllegalMonitorState
  TestNewEntityAsQueryParameter>AbstractPersistenceTestCase.run:206->AbstractPersistenceTestCase.runBare:541->AbstractPersistenceTestCase.runBare:565->AbstractPersistenceTestCase.runTest:578->testQueryWithUnmanagedPersistentInstanceAsParameter:99->queryWithParameter:118 » IllegalMonitorState
  TestNewlinesInQueries>AbstractPersistenceTestCase.run:206->AbstractPersistenceTestCase.runBare:541->AbstractPersistenceTestCase.runBare:565->AbstractPersistenceTestCase.runTest:578->testQuery:44 » IllegalMonitorState
  TestOutOfBoundsEx>AbstractPersistenceTestCase.run:206->AbstractPersistenceTestCase.runBare:541->AbstractPersistenceTestCase.runBare:565->AbstractPersistenceTestCase.runTest:578->testOutOfBounds:58 » IllegalMonitorState
  TestProjectionQueryWithIdenticalResult>AbstractPersistenceTestCase.run:206->AbstractPersistenceTestCase.runBare:541->AbstractPersistenceTestCase.runBare:565->AbstractPersistenceTestCase.runTest:578->testDuplicateResultInProjection1:64->executeQuery:111 » IllegalMonitorState
  TestProjectionQueryWithIdenticalResult>AbstractPersistenceTestCase.run:206->AbstractPersistenceTestCase.runBare:541->AbstractPersistenceTestCase.runBare:565->AbstractPersistenceTestCase.runTest:578->testDuplicateResultInProjection2:75->executeQuery:111 » IllegalMonitorState
  TestProjectionQueryWithIdenticalResult>AbstractPersistenceTestCase.run:206->AbstractPersistenceTestCase.runBare:541->AbstractPersistenceTestCase.runBare:565->AbstractPersistenceTestCase.runTest:578->testDuplicateResultInProjection3:87->executeQuery:111 » IllegalMonitorState
  TestProjectionQueryWithIdenticalResult>AbstractPersistenceTestCase.run:206->AbstractPersistenceTestCase.runBare:541->AbstractPersistenceTestCase.runBare:565->AbstractPersistenceTestCase.runTest:578->testDuplicateResultInProjection4:99->executeQuery:111 » IllegalMonitorState
  TestQueryConvertPositionalParameters>AbstractPersistenceTestCase.run:206->AbstractPersistenceTestCase.runBare:541->AbstractPersistenceTestCase.runBare:565->AbstractPersistenceTestCase.runTest:578->testJPQLPositionalStartAtNonOne:92 » IllegalMonitorState
  TestQueryConvertPositionalParameters>AbstractPersistenceTestCase.run:206->AbstractPersistenceTestCase.runBare:541->AbstractPersistenceTestCase.runBare:565->AbstractPersistenceTestCase.runTest:578->testJPQLWithSubQueryPositionalStartAtNonOne:104 » IllegalMonitorState
  TestQueryConvertPositionalParameters>AbstractPersistenceTestCase.run:206->AbstractPersistenceTestCase.runBare:541->AbstractPersistenceTestCase.runBare:565->AbstractPersistenceTestCase.runTest:578->testNamedPositionalStartAtNonOne:82 » IllegalMonitorState
  TestQueryConvertPositionalParameters>AbstractPersistenceTestCase.run:206->AbstractPersistenceTestCase.runBare:541->AbstractPersistenceTestCase.runBare:565->AbstractPersistenceTestCase.runTest:578->testPreparedQueryPositionalStartAtNonOne:120 » IllegalMonitorState
  TestQueryConvertPositionalParameters>AbstractPersistenceTestCase.run:206->AbstractPersistenceTestCase.runBare:541->AbstractPersistenceTestCase.runBare:565->AbstractPersistenceTestCase.runTest:578->testPreparedQueryWithSubQueryPositionalStartAtNonOne:140 » IllegalMonitorState
  TestQueryEscapeCharacters>AbstractPersistenceTestCase.run:206->AbstractPersistenceTestCase.runBare:541->AbstractPersistenceTestCase.runBare:565->setUp:58 » Rollback
  TestQueryEscapeCharacters>AbstractPersistenceTestCase.run:206->AbstractPersistenceTestCase.runBare:541->AbstractPersistenceTestCase.runBare:565->setUp:58 » Rollback
  TestQueryEscapeCharacters>AbstractPersistenceTestCase.run:206->AbstractPersistenceTestCase.runBare:541->AbstractPersistenceTestCase.runBare:565->setUp:58 » Rollback
  TestQueryEscapeCharacters>AbstractPersistenceTestCase.run:206->AbstractPersistenceTestCase.runBare:541->AbstractPersistenceTestCase.runBare:565->setUp:58 » Rollback
  TestQueryEscapeCharacters>AbstractPersistenceTestCase.run:206->AbstractPersistenceTestCase.runBare:541->AbstractPersistenceTestCase.runBare:565->setUp:58 » Rollback
  TestQueryEscapeCharacters>AbstractPersistenceTestCase.run:206->AbstractPersistenceTestCase.runBare:541->AbstractPersistenceTestCase.runBare:565->setUp:58 » Rollback
  TestQueryEscapeCharacters>AbstractPersistenceTestCase.run:206->AbstractPersistenceTestCase.runBare:541->AbstractPersistenceTestCase.runBare:565->AbstractPersistenceTestCase.runTest:578->testWrongEscape:89->performFind:137 » IllegalMonitorState
  TestQueryExcludingSubclasses>AbstractPersistenceTestCase.run:206->AbstractPersistenceTestCase.runBare:541->AbstractPersistenceTestCase.runBare:565->AbstractPersistenceTestCase.runTest:578->testQuery:67 » IllegalMonitorState
  TestQueryExcludingSubclasses>AbstractPersistenceTestCase.run:206->AbstractPersistenceTestCase.runBare:541->AbstractPersistenceTestCase.runBare:565->AbstractPersistenceTestCase.runTest:578->testQueryExcludingSubclasses:84 » IllegalMonitorState
  TestQueryIdOfRelationDoesNotJoin>AbstractPersistenceTestCase.run:206->AbstractPersistenceTestCase.runBare:541->AbstractPersistenceTestCase.runBare:565->AbstractPersistenceTestCase.runTest:578->testQuery:66 » IllegalMonitorState
  TestQueryLock>AbstractPersistenceTestCase.run:206->AbstractPersistenceTestCase.runBare:541->AbstractPersistenceTestCase.runBare:565->setUp:38->AbstractTestCase.deleteAll:203->AbstractTestCase.deleteAll:192 » IllegalMonitorState
  TestQueryLock>AbstractPersistenceTestCase.run:206->AbstractPersistenceTestCase.runBare:541->AbstractPersistenceTestCase.runBare:565->setUp:38->AbstractTestCase.deleteAll:203->AbstractTestCase.deleteAll:192 » IllegalMonitorState
  TestQueryLock>AbstractPersistenceTestCase.run:206->AbstractPersistenceTestCase.runBare:541->AbstractPersistenceTestCase.runBare:565->setUp:38->AbstractTestCase.deleteAll:203->AbstractTestCase.deleteAll:192 » IllegalMonitorState
  TestQueryPagination>AbstractPersistenceTestCase.run:206->AbstractPersistenceTestCase.runBare:541->AbstractPersistenceTestCase.runBare:565->AbstractPersistenceTestCase.runTest:578->testAllResultsFirstFirst:67->helper:76 » IllegalMonitorState
  TestQueryPagination>AbstractPersistenceTestCase.run:206->AbstractPersistenceTestCase.runBare:541->AbstractPersistenceTestCase.runBare:565->AbstractPersistenceTestCase.runTest:578->testAllResultsFirstLast:71->helper:76 » IllegalMonitorState
  TestQueryPagination>AbstractPersistenceTestCase.run:206->AbstractPersistenceTestCase.runBare:541->AbstractPersistenceTestCase.runBare:565->AbstractPersistenceTestCase.runTest:578->testFirstThenMax:51->helper:76 » IllegalMonitorState
  TestQueryPagination>AbstractPersistenceTestCase.run:206->AbstractPersistenceTestCase.runBare:541->AbstractPersistenceTestCase.runBare:565->AbstractPersistenceTestCase.runTest:578->testMaxThenFirst:55->helper:76 » IllegalMonitorState
  TestQueryPagination>AbstractPersistenceTestCase.run:206->AbstractPersistenceTestCase.runBare:541->AbstractPersistenceTestCase.runBare:565->AbstractPersistenceTestCase.runTest:578->testNoResultsFirstFirst:59->helper:76 » IllegalMonitorState
  TestQueryPagination>AbstractPersistenceTestCase.run:206->AbstractPersistenceTestCase.runBare:541->AbstractPersistenceTestCase.runBare:565->AbstractPersistenceTestCase.runTest:578->testNoResultsFirstLast:63->helper:76 » IllegalMonitorState
  TestQueryParameters>AbstractPersistenceTestCase.run:206->AbstractPersistenceTestCase.runBare:541->AbstractPersistenceTestCase.runBare:565->AbstractPersistenceTestCase.runTest:578->testNamedParameterInJPQLQuery:109 » IllegalMonitorState
  TestQueryParameters>AbstractPersistenceTestCase.run:206->AbstractPersistenceTestCase.runBare:541->AbstractPersistenceTestCase.runBare:565->AbstractPersistenceTestCase.runTest:578->testNamedParameterInNamedQuery:231 » IllegalMonitorState
  TestQueryParameters>AbstractPersistenceTestCase.run:206->AbstractPersistenceTestCase.runBare:541->AbstractPersistenceTestCase.runBare:565->AbstractPersistenceTestCase.runTest:578->testNamedParameterInPreparedQuery:195 » IllegalMonitorState
  TestQueryParameters>AbstractPersistenceTestCase.run:206->AbstractPersistenceTestCase.runBare:541->AbstractPersistenceTestCase.runBare:565->AbstractPersistenceTestCase.runTest:578->testNamedParameterMissingInJPQLQuery:136 » IllegalMonitorState
  TestQueryParameters>AbstractPersistenceTestCase.run:206->AbstractPersistenceTestCase.runBare:541->AbstractPersistenceTestCase.runBare:565->AbstractPersistenceTestCase.runTest:578->testNamedParameterMissingInNamedQuery:256 » IllegalMonitorState
  TestQueryParameters>AbstractPersistenceTestCase.run:206->AbstractPersistenceTestCase.runBare:541->AbstractPersistenceTestCase.runBare:565->AbstractPersistenceTestCase.runTest:578->testNamedParameterUsingReservedWord:73 » IllegalMonitorState
  TestQueryParameters>AbstractPersistenceTestCase.run:206->AbstractPersistenceTestCase.runBare:541->AbstractPersistenceTestCase.runBare:565->AbstractPersistenceTestCase.runTest:578->testNamedParameterValueTypeInJPQLQuery:180 » IllegalMonitorState
  TestQueryParameters>AbstractPersistenceTestCase.run:206->AbstractPersistenceTestCase.runBare:541->AbstractPersistenceTestCase.runBare:565->AbstractPersistenceTestCase.runTest:578->testNamedParameterValueTypeInNamedQuery:296 » IllegalMonitorState
  TestQueryParameters>AbstractPersistenceTestCase.run:206->AbstractPersistenceTestCase.runBare:541->AbstractPersistenceTestCase.runBare:565->AbstractPersistenceTestCase.runTest:578->testNamedParameterWrongValueInJPQLQuery:155 » IllegalMonitorState
  TestQueryParameters>AbstractPersistenceTestCase.run:206->AbstractPersistenceTestCase.runBare:541->AbstractPersistenceTestCase.runBare:565->AbstractPersistenceTestCase.runTest:578->testNamedParameterWrongValueInNamedQuery:273 » IllegalMonitorState
  TestQueryParameters>AbstractPersistenceTestCase.run:206->AbstractPersistenceTestCase.runBare:541->AbstractPersistenceTestCase.runBare:565->AbstractPersistenceTestCase.runTest:578->testPositionalParameterInJPQLQuery:91 » IllegalMonitorState
  TestQueryParameters>AbstractPersistenceTestCase.run:206->AbstractPersistenceTestCase.runBare:541->AbstractPersistenceTestCase.runBare:565->AbstractPersistenceTestCase.runTest:578->testPositionalParameterInNamedQuery:214 » IllegalMonitorState
  TestQueryParameters>AbstractPersistenceTestCase.run:206->AbstractPersistenceTestCase.runBare:541->AbstractPersistenceTestCase.runBare:565->AbstractPersistenceTestCase.runTest:578->testPositionalParameterMissingInJPQLQuery:127 » IllegalMonitorState
  TestQueryParameters>AbstractPersistenceTestCase.run:206->AbstractPersistenceTestCase.runBare:541->AbstractPersistenceTestCase.runBare:565->AbstractPersistenceTestCase.runTest:578->testPositionalParameterMissingInNamedQuery:248 » IllegalMonitorState
  TestQueryParameters>AbstractPersistenceTestCase.run:206->AbstractPersistenceTestCase.runBare:541->AbstractPersistenceTestCase.runBare:565->AbstractPersistenceTestCase.runTest:578->testPositionalParameterValueTypeInJPQLQuery:165 » IllegalMonitorState
  TestQueryParameters>AbstractPersistenceTestCase.run:206->AbstractPersistenceTestCase.runBare:541->AbstractPersistenceTestCase.runBare:565->AbstractPersistenceTestCase.runTest:578->testPositionalParameterValueTypeInNamedQuery:282 » IllegalMonitorState
  TestQueryParameters>AbstractPersistenceTestCase.run:206->AbstractPersistenceTestCase.runBare:541->AbstractPersistenceTestCase.runBare:565->AbstractPersistenceTestCase.runTest:578->testPositionalParameterWrongValueInJPQLQuery:145 » IllegalMonitorState
  TestQueryParameters>AbstractPersistenceTestCase.run:206->AbstractPersistenceTestCase.runBare:541->AbstractPersistenceTestCase.runBare:565->AbstractPersistenceTestCase.runTest:578->testPositionalParameterWrongValueInNamedQuery:264 » IllegalMonitorState
  TestQueryResultClassAPI>AbstractPersistenceTestCase.run:206->AbstractPersistenceTestCase.runBare:541->AbstractPersistenceTestCase.runBare:565->AbstractPersistenceTestCase.runTest:578->testQueryWithResultClass:63 » IllegalMonitorState
  TestQueryResults>AbstractPersistenceTestCase.run:206->AbstractPersistenceTestCase.runBare:541->AbstractPersistenceTestCase.runBare:565->setUp:49->AbstractTestCase.deleteAll:203->AbstractTestCase.deleteAll:192 » IllegalMonitorState
  TestQueryResults>AbstractPersistenceTestCase.run:206->AbstractPersistenceTestCase.runBare:541->AbstractPersistenceTestCase.runBare:565->setUp:49->AbstractTestCase.deleteAll:203->AbstractTestCase.deleteAll:192 » IllegalMonitorState
  TestQueryResults>AbstractPersistenceTestCase.run:206->AbstractPersistenceTestCase.runBare:541->AbstractPersistenceTestCase.runBare:565->setUp:49->AbstractTestCase.deleteAll:203->AbstractTestCase.deleteAll:192 » IllegalMonitorState
  TestQueryResults>AbstractPersistenceTestCase.run:206->AbstractPersistenceTestCase.runBare:541->AbstractPersistenceTestCase.runBare:565->setUp:49->AbstractTestCase.deleteAll:203->AbstractTestCase.deleteAll:192 » IllegalMonitorState
  TestQueryResults>AbstractPersistenceTestCase.run:206->AbstractPersistenceTestCase.runBare:541->AbstractPersistenceTestCase.runBare:565->setUp:49->AbstractTestCase.deleteAll:203->AbstractTestCase.deleteAll:192 » IllegalMonitorState
  TestQueryResults>AbstractPersistenceTestCase.run:206->AbstractPersistenceTestCase.runBare:541->AbstractPersistenceTestCase.runBare:565->setUp:49->AbstractTestCase.deleteAll:203->AbstractTestCase.deleteAll:192 » IllegalMonitorState
  TestQueryResults>AbstractPersistenceTestCase.run:206->AbstractPersistenceTestCase.runBare:541->AbstractPersistenceTestCase.runBare:565->setUp:49->AbstractTestCase.deleteAll:203->AbstractTestCase.deleteAll:192 » IllegalMonitorState
  TestQueryResults>AbstractPersistenceTestCase.run:206->AbstractPersistenceTestCase.runBare:541->AbstractPersistenceTestCase.runBare:565->setUp:49->AbstractTestCase.deleteAll:203->AbstractTestCase.deleteAll:192 » IllegalMonitorState
  TestQueryResults>AbstractPersistenceTestCase.run:206->AbstractPersistenceTestCase.runBare:541->AbstractPersistenceTestCase.runBare:565->setUp:49->AbstractTestCase.deleteAll:203->AbstractTestCase.deleteAll:192 » IllegalMonitorState
  TestQueryResults>AbstractPersistenceTestCase.run:206->AbstractPersistenceTestCase.runBare:541->AbstractPersistenceTestCase.runBare:565->setUp:49->AbstractTestCase.deleteAll:203->AbstractTestCase.deleteAll:192 » IllegalMonitorState
  TestQueryResults>AbstractPersistenceTestCase.run:206->AbstractPersistenceTestCase.runBare:541->AbstractPersistenceTestCase.runBare:565->setUp:49->AbstractTestCase.deleteAll:203->AbstractTestCase.deleteAll:192 » IllegalMonitorState
  TestQueryResults>AbstractPersistenceTestCase.run:206->AbstractPersistenceTestCase.runBare:541->AbstractPersistenceTestCase.runBare:565->setUp:49->AbstractTestCase.deleteAll:203->AbstractTestCase.deleteAll:192 » IllegalMonitorState
  TestQueryResults>AbstractPersistenceTestCase.run:206->AbstractPersistenceTestCase.runBare:541->AbstractPersistenceTestCase.runBare:565->setUp:49->AbstractTestCase.deleteAll:203->AbstractTestCase.deleteAll:192 » IllegalMonitorState
  TestQueryResults>AbstractPersistenceTestCase.run:206->AbstractPersistenceTestCase.runBare:541->AbstractPersistenceTestCase.runBare:565->setUp:49->AbstractTestCase.deleteAll:203->AbstractTestCase.deleteAll:192 » IllegalMonitorState
  TestQueryResults>AbstractPersistenceTestCase.run:206->AbstractPersistenceTestCase.runBare:541->AbstractPersistenceTestCase.runBare:565->setUp:49->AbstractTestCase.deleteAll:203->AbstractTestCase.deleteAll:192 » IllegalMonitorState
  TestQueryResults>AbstractPersistenceTestCase.run:206->AbstractPersistenceTestCase.runBare:541->AbstractPersistenceTestCase.runBare:565->setUp:49->AbstractTestCase.deleteAll:203->AbstractTestCase.deleteAll:192 » IllegalMonitorState
  TestQueryResults>AbstractPersistenceTestCase.run:206->AbstractPersistenceTestCase.runBare:541->AbstractPersistenceTestCase.runBare:565->setUp:49->AbstractTestCase.deleteAll:203->AbstractTestCase.deleteAll:192 » IllegalMonitorState
  TestQueryResults>AbstractPersistenceTestCase.run:206->AbstractPersistenceTestCase.runBare:541->AbstractPersistenceTestCase.runBare:565->setUp:49->AbstractTestCase.deleteAll:203->AbstractTestCase.deleteAll:192 » IllegalMonitorState
  TestQueryResults>AbstractPersistenceTestCase.run:206->AbstractPersistenceTestCase.runBare:541->AbstractPersistenceTestCase.runBare:565->setUp:49->AbstractTestCase.deleteAll:203->AbstractTestCase.deleteAll:192 » IllegalMonitorState
  TestQueryResults>AbstractPersistenceTestCase.run:206->AbstractPersistenceTestCase.runBare:541->AbstractPersistenceTestCase.runBare:565->setUp:49->AbstractTestCase.deleteAll:203->AbstractTestCase.deleteAll:192 » IllegalMonitorState
  TestQueryResults>AbstractPersistenceTestCase.run:206->AbstractPersistenceTestCase.runBare:541->AbstractPersistenceTestCase.runBare:565->setUp:49->AbstractTestCase.deleteAll:203->AbstractTestCase.deleteAll:192 » IllegalMonitorState
  TestQueryResults>AbstractPersistenceTestCase.run:206->AbstractPersistenceTestCase.runBare:541->AbstractPersistenceTestCase.runBare:565->setUp:49->AbstractTestCase.deleteAll:203->AbstractTestCase.deleteAll:192 » IllegalMonitorState
  TestQueryResults>AbstractPersistenceTestCase.run:206->AbstractPersistenceTestCase.runBare:541->AbstractPersistenceTestCase.runBare:565->setUp:49->AbstractTestCase.deleteAll:203->AbstractTestCase.deleteAll:192 » IllegalMonitorState
  TestQueryResults>AbstractPersistenceTestCase.run:206->AbstractPersistenceTestCase.runBare:541->AbstractPersistenceTestCase.runBare:565->setUp:49->AbstractTestCase.deleteAll:203->AbstractTestCase.deleteAll:192 » IllegalMonitorState
  TestQueryTimeout>AbstractPersistenceTestCase.run:206->AbstractPersistenceTestCase.runBare:541->AbstractPersistenceTestCase.runBare:565->AbstractPersistenceTestCase.runTest:578->testQueryTimeout1a:163 » Persistence
  TestQueryTimeout>AbstractPersistenceTestCase.run:206->AbstractPersistenceTestCase.runBare:541->AbstractPersistenceTestCase.runBare:565->AbstractPersistenceTestCase.runTest:578->testQueryTimeout1c:205 » IllegalMonitorState
  TestQueryTimeout>AbstractPersistenceTestCase.run:206->AbstractPersistenceTestCase.runBare:541->AbstractPersistenceTestCase.runBare:565->AbstractPersistenceTestCase.runTest:578->testQueryTimeout21b:268 » Persistence
  TestQueryTimeout>AbstractPersistenceTestCase.run:206->AbstractPersistenceTestCase.runBare:541->AbstractPersistenceTestCase.runBare:565->AbstractPersistenceTestCase.runTest:578->testQueryTimeout22a:313 » Persistence
  TestQueryTimeout>AbstractPersistenceTestCase.run:206->AbstractPersistenceTestCase.runBare:541->AbstractPersistenceTestCase.runBare:565->AbstractPersistenceTestCase.runTest:578->testQueryTimeout23b:363 » Persistence
  TestQueryTimeout>AbstractPersistenceTestCase.run:206->AbstractPersistenceTestCase.runBare:541->AbstractPersistenceTestCase.runBare:565->AbstractPersistenceTestCase.runTest:578->testQueryTimeout32a:517 » Persistence
  TestQueryTimeout>AbstractPersistenceTestCase.run:206->AbstractPersistenceTestCase.runBare:541->AbstractPersistenceTestCase.runBare:565->AbstractPersistenceTestCase.runTest:578->testQueryTimeout33b:576 » Persistence
  TestQueryTimeout>AbstractPersistenceTestCase.run:206->AbstractPersistenceTestCase.runBare:541->AbstractPersistenceTestCase.runBare:565->AbstractPersistenceTestCase.runTest:578->testQueryTimeout4:731 » Persistence
  TestResultSetMapping>AbstractPersistenceTestCase.run:206->AbstractPersistenceTestCase.runBare:541->AbstractPersistenceTestCase.runBare:565->AbstractPersistenceTestCase.runTest:578->testSimpleQuery:44 » Persistence
  TestSimple>AbstractPersistenceTestCase.run:206->AbstractPersistenceTestCase.runBare:541->AbstractPersistenceTestCase.runBare:565->setUp:37->AbstractTestCase.deleteAll:203->AbstractTestCase.deleteAll:192 » IllegalMonitorState
  TestSubquery>AbstractPersistenceTestCase.run:206->AbstractPersistenceTestCase.runBare:541->AbstractPersistenceTestCase.runBare:565->AbstractPersistenceTestCase.runTest:578->testSubSelectMaxDateRange:286 » IllegalMonitorState
  TestSubquery>AbstractPersistenceTestCase.run:206->AbstractPersistenceTestCase.runBare:541->AbstractPersistenceTestCase.runBare:565->AbstractPersistenceTestCase.runTest:578->testSubquery:244 » IllegalMonitorState
  TestSubquery>AbstractPersistenceTestCase.run:206->AbstractPersistenceTestCase.runBare:541->AbstractPersistenceTestCase.runBare:565->AbstractPersistenceTestCase.runTest:578->testSubquery2:229 » IllegalMonitorState
  TestSubquery>AbstractPersistenceTestCase.run:206->AbstractPersistenceTestCase.runBare:541->AbstractPersistenceTestCase.runBare:565->AbstractPersistenceTestCase.runTest:578->testUpdateWithCorrelatedSubquery:300 » IllegalMonitorState
  TestSubstring>AbstractPersistenceTestCase.run:206->AbstractPersistenceTestCase.runBare:541->AbstractPersistenceTestCase.runBare:565->AbstractPersistenceTestCase.runTest:578->testMultiCharacterSubstringInWhere:63 » IllegalMonitorState
  TestSubstring>AbstractPersistenceTestCase.run:206->AbstractPersistenceTestCase.runBare:541->AbstractPersistenceTestCase.runBare:565->AbstractPersistenceTestCase.runTest:578->testSingleCharacterSubstringInWhere:54 » IllegalMonitorState
  TestSubstring>AbstractPersistenceTestCase.run:206->AbstractPersistenceTestCase.runBare:541->AbstractPersistenceTestCase.runBare:565->AbstractPersistenceTestCase.runTest:578->testSubstringInMemory:87 » IllegalMonitorState
  TestSubstring>AbstractPersistenceTestCase.run:206->AbstractPersistenceTestCase.runBare:541->AbstractPersistenceTestCase.runBare:565->AbstractPersistenceTestCase.runTest:578->testSubstringInSelect:76 » IllegalMonitorState
  TestSubstring>AbstractPersistenceTestCase.run:206->AbstractPersistenceTestCase.runBare:541->AbstractPersistenceTestCase.runBare:565->AbstractPersistenceTestCase.runTest:578->testSubstringWithExpressionsInWhere:97 » IllegalMonitorState
  TestTimeoutException>AbstractPersistenceTestCase.run:206->AbstractPersistenceTestCase.runBare:541->AbstractPersistenceTestCase.runBare:565->AbstractPersistenceTestCase.runTest:578->testQueryTimeOutExceptionWhileQueryingWithLocksOnAlreadyLockedEntities:79 » IllegalMonitorState
  TestWildCardCount>AbstractPersistenceTestCase.run:206->AbstractPersistenceTestCase.runBare:541->AbstractPersistenceTestCase.runBare:565->AbstractPersistenceTestCase.runTest:578->testWildCardForCountInMultipleProjectTerms:60->executeAndAssert:69->executeAndAssert:76 » Persistence
  TestWildCardCount>AbstractPersistenceTestCase.run:206->AbstractPersistenceTestCase.runBare:541->AbstractPersistenceTestCase.runBare:565->AbstractPersistenceTestCase.runTest:578->testWildCardForCountInMultipleProjectTermsButCountIsNotFirstTerm:65->executeAndAssert:69->executeAndAssert:76 » Persistence
  TestWildCardCount>AbstractPersistenceTestCase.run:206->AbstractPersistenceTestCase.runBare:541->AbstractPersistenceTestCase.runBare:565->AbstractPersistenceTestCase.runTest:578->testWildCardForCountInSingleProjectTerm:55->executeAndAssert:69->executeAndAssert:76 » Persistence
  TestJPQLMultiSelectTypedResults>AbstractPersistenceTestCase.run:206->AbstractPersistenceTestCase.runBare:541->AbstractPersistenceTestCase.runBare:565->AbstractPersistenceTestCase.runTest:578->testMultiSelect:150 » IllegalMonitorState
  TestJPQLMultiSelectTypedResults>AbstractPersistenceTestCase.run:206->AbstractPersistenceTestCase.runBare:541->AbstractPersistenceTestCase.runBare:565->AbstractPersistenceTestCase.runTest:578->testMultipleConstructor:110 » IllegalMonitorState
  TestJPQLMultiSelectTypedResults>AbstractPersistenceTestCase.run:206->AbstractPersistenceTestCase.runBare:541->AbstractPersistenceTestCase.runBare:565->AbstractPersistenceTestCase.runTest:578->testMultipleConstructorMixWithMultiSelect:125 » IllegalMonitorState
  TestResultSetMapping>AbstractPersistenceTestCase.run:206->AbstractPersistenceTestCase.runBare:541->AbstractPersistenceTestCase.runBare:565->AbstractPersistenceTestCase.runTest:578->testQuery:51 » Persistence
  TestSQLResultSetMapping>AbstractPersistenceTestCase.run:206->AbstractPersistenceTestCase.runBare:541->AbstractPersistenceTestCase.runBare:565->AbstractPersistenceTestCase.runTest:578->testMappingCorrectID:118 » Persistence
  TestSQLResultSetMapping>AbstractPersistenceTestCase.run:206->AbstractPersistenceTestCase.runBare:541->AbstractPersistenceTestCase.runBare:565->AbstractPersistenceTestCase.runTest:578->testMappingNoException:85 » Persistence
  TestQueryCacheWithDataCache>AbstractPersistenceTestCase.run:206->AbstractPersistenceTestCase.runBare:541->AbstractPersistenceTestCase.runBare:565->AbstractPersistenceTestCase.runTest:578->testWithFetchPlan:43->populate:85 » Rollback
  TestQuerySQLCache>AbstractPersistenceTestCase.run:206->AbstractPersistenceTestCase.runBare:541->AbstractPersistenceTestCase.runBare:565->AbstractPersistenceTestCase.runTest:578->testNullParamsWithNamedQuery01:140 » IllegalMonitorState
  TestQuerySQLCache>AbstractPersistenceTestCase.run:206->AbstractPersistenceTestCase.runBare:541->AbstractPersistenceTestCase.runBare:565->AbstractPersistenceTestCase.runTest:578->testNullParamsWithNamedQuery02:184 » IllegalMonitorState
  TestQuerySQLCache>AbstractPersistenceTestCase.run:206->AbstractPersistenceTestCase.runBare:541->AbstractPersistenceTestCase.runBare:565->AbstractPersistenceTestCase.runTest:578->testNullParamsWithNumericPosition01:60 » IllegalMonitorState
  TestQuerySQLCache>AbstractPersistenceTestCase.run:206->AbstractPersistenceTestCase.runBare:541->AbstractPersistenceTestCase.runBare:565->AbstractPersistenceTestCase.runTest:578->testNullParamsWithNumericPosition02:101 » IllegalMonitorState
  TestBulkUpdatesAndEmbeddedFields>AbstractPersistenceTestCase.run:206->AbstractPersistenceTestCase.runBare:541->AbstractPersistenceTestCase.runBare:565->AbstractPersistenceTestCase.runTest:578->testBulkUpdateOfEmbeddedField:43 » IllegalMonitorState
  TestCascadingOneManyWithForeignKey>AbstractPersistenceTestCase.run:206->AbstractPersistenceTestCase.runBare:541->AbstractPersistenceTestCase.runBare:565->AbstractPersistenceTestCase.runTest:578->testDelete:93->assertRemoved:103 » IllegalMonitorState
  TestEagerBidiSQL>AbstractPersistenceTestCase.run:206->AbstractPersistenceTestCase.runBare:541->AbstractPersistenceTestCase.runBare:565->AbstractPersistenceTestCase.runTest:578->testEagerNonOwnerOneToOneQuery:187 » IllegalMonitorState
  TestEagerBidiSQL>AbstractPersistenceTestCase.run:206->AbstractPersistenceTestCase.runBare:541->AbstractPersistenceTestCase.runBare:565->AbstractPersistenceTestCase.runTest:578->testEagerOwnerOneToManyQuery:133 » IllegalMonitorState
  TestEagerBidiSQL>AbstractPersistenceTestCase.run:206->AbstractPersistenceTestCase.runBare:541->AbstractPersistenceTestCase.runBare:565->AbstractPersistenceTestCase.runTest:578->testEagerOwnerOneToOneQuery:161 » IllegalMonitorState
  TestIdOrderedOneMany>AbstractPersistenceTestCase.run:206->AbstractPersistenceTestCase.runBare:541->AbstractPersistenceTestCase.runBare:565->setUp:62 » Rollback
  TestIncompleteRelationship>AbstractPersistenceTestCase.run:206->AbstractPersistenceTestCase.runBare:541->AbstractPersistenceTestCase.runBare:565->AbstractPersistenceTestCase.runTest:578->testIncompleteRelationship:73 » IllegalMonitorState
  TestInverseEagerSQL>AbstractPersistenceTestCase.run:206->AbstractPersistenceTestCase.runBare:541->AbstractPersistenceTestCase.runBare:565->AbstractPersistenceTestCase.runTest:578->testManyToManyEagerEagerInverseLazyQuery:317 » IllegalMonitorState
  TestInverseEagerSQL>AbstractPersistenceTestCase.run:206->AbstractPersistenceTestCase.runBare:541->AbstractPersistenceTestCase.runBare:565->AbstractPersistenceTestCase.runTest:578->testOneToManyEagerInverseLazyQuery:285 » IllegalMonitorState
  TestInverseEagerSQL>AbstractPersistenceTestCase.run:206->AbstractPersistenceTestCase.runBare:541->AbstractPersistenceTestCase.runBare:565->AbstractPersistenceTestCase.runTest:578->testOneToManyInheritanceQuery:223 » IllegalMonitorState
  TestInverseEagerSQL>AbstractPersistenceTestCase.run:206->AbstractPersistenceTestCase.runBare:541->AbstractPersistenceTestCase.runBare:565->AbstractPersistenceTestCase.runTest:578->testOneToManyInverseEagerQuery:171 » IllegalMonitorState
  TestInverseEagerSQL>AbstractPersistenceTestCase.run:206->AbstractPersistenceTestCase.runBare:541->AbstractPersistenceTestCase.runBare:565->AbstractPersistenceTestCase.runTest:578->testOneToOneInverseEagerQuery:199 » IllegalMonitorState
  TestInverseEagerSQL>AbstractPersistenceTestCase.run:206->AbstractPersistenceTestCase.runBare:541->AbstractPersistenceTestCase.runBare:565->AbstractPersistenceTestCase.runTest:578->testSourceOrphanRemoval:404->SingleEMFTestCase.count:137->SingleEMFTestCase.count:127 » IllegalMonitorState
  TestInverseEagerSQL>AbstractPersistenceTestCase.run:206->AbstractPersistenceTestCase.runBare:541->AbstractPersistenceTestCase.runBare:565->AbstractPersistenceTestCase.runTest:578->testTargetOrphanRemoval:344->SingleEMFTestCase.count:137->SingleEMFTestCase.count:127 » IllegalMonitorState
  TestJoinedInheritanceHierarchy>AbstractPersistenceTestCase.run:206->AbstractPersistenceTestCase.runBare:541->AbstractPersistenceTestCase.runBare:565->AbstractPersistenceTestCase.runTest:578->testInverseRelationNotNull:55 » IllegalMonitorState
  TestJoinedInheritanceHierarchyWithCache>AbstractPersistenceTestCase.run:206->AbstractPersistenceTestCase.runBare:541->AbstractPersistenceTestCase.runBare:565->AbstractPersistenceTestCase.runTest:578->testCacheSqlGeneration:55 » Rollback
  TestManyEagerSQL>AbstractPersistenceTestCase.run:206->AbstractPersistenceTestCase.runBare:541->AbstractPersistenceTestCase.runBare:565->AbstractPersistenceTestCase.runTest:578->testManyToOneEagerQuery:81 » IllegalMonitorState
  TestManyEagerSQL>AbstractPersistenceTestCase.run:206->AbstractPersistenceTestCase.runBare:541->AbstractPersistenceTestCase.runBare:565->AbstractPersistenceTestCase.runTest:578->testManyToOneLazyQuery:119 » IllegalMonitorState
  TestManyEagerSQL>AbstractPersistenceTestCase.run:206->AbstractPersistenceTestCase.runBare:541->AbstractPersistenceTestCase.runBare:565->AbstractPersistenceTestCase.runTest:578->testOneToManyEagerQuery:164 » IllegalMonitorState
  TestManyEagerSQL>AbstractPersistenceTestCase.run:206->AbstractPersistenceTestCase.runBare:541->AbstractPersistenceTestCase.runBare:565->AbstractPersistenceTestCase.runTest:578->testOneToOneChildQuery:237 » IllegalMonitorState
  TestManyEagerSQL>AbstractPersistenceTestCase.run:206->AbstractPersistenceTestCase.runBare:541->AbstractPersistenceTestCase.runBare:565->AbstractPersistenceTestCase.runTest:578->testOneToOneParentQuery:210 » IllegalMonitorState
  TestManyOneAsId>AbstractPersistenceTestCase.run:206->AbstractPersistenceTestCase.runBare:541->AbstractPersistenceTestCase.runBare:565->AbstractPersistenceTestCase.runTest:578->testCompoundQuery:342 » IllegalMonitorState
  TestManyOneAsId>AbstractPersistenceTestCase.run:206->AbstractPersistenceTestCase.runBare:541->AbstractPersistenceTestCase.runBare:565->AbstractPersistenceTestCase.runTest:578->testDataStoreQuery:330 » IllegalMonitorState
  TestManyOneAsId>AbstractPersistenceTestCase.run:206->AbstractPersistenceTestCase.runBare:541->AbstractPersistenceTestCase.runBare:565->AbstractPersistenceTestCase.runTest:578->testQuery:305 » IllegalMonitorState
  TestMultipleSameTypedEmbeddedWithEagerRelations>AbstractPersistenceTestCase.run:206->AbstractPersistenceTestCase.runBare:541->AbstractPersistenceTestCase.runBare:565->AbstractPersistenceTestCase.runTest:578->testQuery:67 » IllegalMonitorState
  TestOneOneNulls>AbstractPersistenceTestCase.run:206->AbstractPersistenceTestCase.runBare:541->AbstractPersistenceTestCase.runBare:565->AbstractPersistenceTestCase.runTest:578->testQueryOneToOneNullChild:115 » IllegalMonitorState
  TestOneOneNulls>AbstractPersistenceTestCase.run:206->AbstractPersistenceTestCase.runBare:541->AbstractPersistenceTestCase.runBare:565->AbstractPersistenceTestCase.runTest:578->testQueryOneToOneNullParent:130 » IllegalMonitorState
  TestParallelEagerMap>AbstractPersistenceTestCase.run:206->AbstractPersistenceTestCase.runBare:541->AbstractPersistenceTestCase.runBare:565->AbstractPersistenceTestCase.runTest:578->testParentNotNull:59 » IllegalMonitorState
  TestRelationFieldAsPrimaryKeyAndForeignKey>AbstractPersistenceTestCase.run:206->AbstractPersistenceTestCase.runBare:541->AbstractPersistenceTestCase.runBare:565->setUp:87 » Rollback
  TestRelationFieldAsPrimaryKeyAndForeignKey>AbstractPersistenceTestCase.run:206->AbstractPersistenceTestCase.runBare:541->AbstractPersistenceTestCase.runBare:565->AbstractPersistenceTestCase.runTest:578->testQuery:155 » IllegalMonitorState
  TestRelationFieldAsPrimaryKeyAndForeignKey>AbstractPersistenceTestCase.run:206->AbstractPersistenceTestCase.runBare:541->AbstractPersistenceTestCase.runBare:565->setUp:87 » Rollback
  TestBasicAnnotation>AbstractPersistenceTestCase.run:206->AbstractPersistenceTestCase.runBare:541->AbstractPersistenceTestCase.runBare:565->AbstractPersistenceTestCase.runTest:578->testEagerFetchType:67 » IllegalMonitorState
  TestCaseInsensitiveKeywordsInJPQL>AbstractPersistenceTestCase.run:206->AbstractPersistenceTestCase.runBare:541->AbstractPersistenceTestCase.runBare:565->AbstractPersistenceTestCase.runTest:578->testCaseInsensitiveBooleans:48 » IllegalMonitorState
  TestEntityManagerClear>AbstractPersistenceTestCase.run:206->AbstractPersistenceTestCase.runBare:541->AbstractPersistenceTestCase.runBare:565->AbstractPersistenceTestCase.runTest:578->testClear:85->SingleEMTestCase.query:155 » IllegalMonitorState
  TestEntityManagerClear>AbstractPersistenceTestCase.run:206->AbstractPersistenceTestCase.runBare:541->AbstractPersistenceTestCase.runBare:565->AbstractPersistenceTestCase.runTest:578->testNewClearMerge:109->SingleEMTestCase.query:155 » IllegalMonitorState
  TestEntityManagerClear>AbstractPersistenceTestCase.run:206->AbstractPersistenceTestCase.runBare:541->AbstractPersistenceTestCase.runBare:565->AbstractPersistenceTestCase.runTest:578->testUpdateClearMerge:143->SingleEMTestCase.query:155 » IllegalMonitorState
  TestEntityManagerClear>AbstractPersistenceTestCase.run:206->AbstractPersistenceTestCase.runBare:541->AbstractPersistenceTestCase.runBare:565->AbstractPersistenceTestCase.runTest:578->testUpdateClearUpdateMerge:184->SingleEMTestCase.query:155 » IllegalMonitorState
  TestEntityManagerClear>AbstractPersistenceTestCase.run:206->AbstractPersistenceTestCase.runBare:541->AbstractPersistenceTestCase.runBare:565->AbstractPersistenceTestCase.runTest:578->testUpdateFlushClearUpdateMerge:221->SingleEMTestCase.query:155 » IllegalMonitorState
  TestEntityManagerMerge>AbstractPersistenceTestCase.run:206->AbstractPersistenceTestCase.runBare:541->AbstractPersistenceTestCase.runBare:565->AbstractPersistenceTestCase.runTest:578->testMergeExistingEntity:102 » IllegalMonitorState
  TestEntityManagerMethodsThrowAfterClose>AbstractPersistenceTestCase.run:206->AbstractPersistenceTestCase.runBare:541->AbstractPersistenceTestCase.runBare:565->AbstractPersistenceTestCase.runTest:578->testCreateQueryAfterClose:177 » IllegalMonitorState
  TestPersistence>AbstractPersistenceTestCase.run:206->AbstractPersistenceTestCase.runBare:541->AbstractPersistenceTestCase.runBare:565->AbstractPersistenceTestCase.runTest:578->testQuery:78 » IllegalMonitorState
  TestRefresh>AbstractPersistenceTestCase.run:206->AbstractPersistenceTestCase.runBare:541->AbstractPersistenceTestCase.runBare:565->AbstractPersistenceTestCase.runTest:578->testFindWithCacheRetrieveProperty:141 » Rollback
  TestRefresh>AbstractPersistenceTestCase.run:206->AbstractPersistenceTestCase.runBare:541->AbstractPersistenceTestCase.runBare:565->AbstractPersistenceTestCase.runTest:578->testFlushRefreshNewInstance:46 » Persistence
  TestRefresh>AbstractPersistenceTestCase.run:206->AbstractPersistenceTestCase.runBare:541->AbstractPersistenceTestCase.runBare:565->AbstractPersistenceTestCase.runTest:578->testRefreshBypassL2Cache:64 » Rollback
  TestRefresh>AbstractPersistenceTestCase.run:206->AbstractPersistenceTestCase.runBare:541->AbstractPersistenceTestCase.runBare:565->AbstractPersistenceTestCase.runTest:578->testRefreshWithCacheRetrieveProperty:181 » Rollback
  TestLibService>AbstractPersistenceTestCase.run:206->AbstractPersistenceTestCase.runBare:541->AbstractPersistenceTestCase.runBare:565->setUp:53 » IllegalMonitorState
  TestLibService>AbstractPersistenceTestCase.run:206->AbstractPersistenceTestCase.runBare:541->AbstractPersistenceTestCase.runBare:565->setUp:53 » IllegalMonitorState
  TestLibService>AbstractPersistenceTestCase.run:206->AbstractPersistenceTestCase.runBare:541->AbstractPersistenceTestCase.runBare:565->setUp:53 » IllegalMonitorState
  TestLibService>AbstractPersistenceTestCase.run:206->AbstractPersistenceTestCase.runBare:541->AbstractPersistenceTestCase.runBare:565->setUp:53 » IllegalMonitorState
  TestTemporalTimestamp>AbstractPersistenceTestCase.run:206->AbstractPersistenceTestCase.runBare:541->AbstractPersistenceTestCase.runBare:565->setUp:75->loadDB:158 » Persistence
  TestTemporalTimestamp>AbstractPersistenceTestCase.run:206->AbstractPersistenceTestCase.runBare:541->AbstractPersistenceTestCase.runBare:565->setUp:75->loadDB:158 » Persistence
  TestTemporalTimestamp>AbstractPersistenceTestCase.run:206->AbstractPersistenceTestCase.runBare:541->AbstractPersistenceTestCase.runBare:565->setUp:75->loadDB:158 » Persistence
  TestValidationMode>AbstractPersistenceTestCase.run:206->AbstractPersistenceTestCase.runBare:541->AbstractPersistenceTestCase.runBare:565->AbstractPersistenceTestCase.runTest:578->testUniqueLifecycleManager:292 » Rollback
  TestSimpleXmlEntity>AbstractPersistenceTestCase.run:206->AbstractPersistenceTestCase.runBare:541->AbstractPersistenceTestCase.runBare:565->AbstractPersistenceTestCase.runTest:578->testNamedEntityInDynamicQuery:67 » IllegalMonitorState
  TestSimpleXmlEntity>AbstractPersistenceTestCase.run:206->AbstractPersistenceTestCase.runBare:541->AbstractPersistenceTestCase.runBare:565->AbstractPersistenceTestCase.runTest:578->testNamedQueryInXmlNamedEntity:53 » IllegalMonitorState
  TestSimpleXmlEntity>AbstractPersistenceTestCase.run:206->AbstractPersistenceTestCase.runBare:541->AbstractPersistenceTestCase.runBare:565->AbstractPersistenceTestCase.runTest:578->testNamedQueryInXmlUsingShortClassName:58 » IllegalMonitorState
  TestSimpleXmlEntity>AbstractPersistenceTestCase.run:206->AbstractPersistenceTestCase.runBare:541->AbstractPersistenceTestCase.runBare:565->AbstractPersistenceTestCase.runTest:578->testShortClassNameInDynamicQuery:72 » IllegalMonitorState
  TestMergeComplexKey>AbstractPersistenceTestCase.run:206->AbstractPersistenceTestCase.runBare:541->AbstractPersistenceTestCase.runBare:565->AbstractPersistenceTestCase.runTest:578->test:37->createDate:63 » IllegalMonitorState

Tests run: 3087, Failures: 52, Errors: 1724, Skipped: 0

[INFO] ------------------------------------------------------------------------
[INFO] Reactor Summary:
[INFO] 
[INFO] OpenJPA Parent POM ................................. SUCCESS [ 10.685 s]
[INFO] OpenJPA Utilities Library .......................... SUCCESS [ 11.997 s]
[INFO] OpenJPA Kernel ..................................... SUCCESS [ 11.115 s]
[INFO] OpenJPA JDBC ....................................... SUCCESS [  8.455 s]
[INFO] OpenJPA Persistence ................................ SUCCESS [  5.003 s]
[INFO] OpenJPA Persistence JDBC ........................... FAILURE [23:15 min]
[INFO] OpenJPA Persistence Locking Tests .................. SKIPPED
[INFO] OpenJPA tools ...................................... SKIPPED
[INFO] OpenJPA Maven Plugin ............................... SKIPPED
[INFO] OpenJPA XML Store .................................. SKIPPED
[INFO] OpenJPA Slice ...................................... SKIPPED
[INFO] OpenJPA JEST ....................................... SKIPPED
[INFO] OpenJPA Aggregate Jar .............................. SKIPPED
[INFO] OpenJPA Aggregate Jar with Dependencies ............ SKIPPED
[INFO] OpenJPA Project Docs and Assemblies ................ SKIPPED
[INFO] OpenJPA Examples ................................... SKIPPED
[INFO] OpenJPA Examples - Simple .......................... SKIPPED
[INFO] OpenJPA Examples - image-gallery ................... SKIPPED
[INFO] OpenJPA Examples - OpenBooks ....................... SKIPPED
[INFO] OpenJPA Integration Tests .......................... SKIPPED
[INFO] OpenJPA Integration Tests - Daytrader .............. SKIPPED
[INFO] OpenJPA Integration Tests - Examples ............... SKIPPED
[INFO] OpenJPA Integration Tests - SLF4JLogFactory ........ SKIPPED
[INFO] OpenJPA Integration Tests - JPA TCK ................ SKIPPED
[INFO] OpenJPA Integration Tests - Bean Validation ........ SKIPPED
[INFO] OpenJPA Integration Tests - JMX Platform MBeans .... SKIPPED
[INFO] OpenJPA Fetching Statistic Tool .................... SKIPPED
[INFO] OpenJPA Fetching Statistic Tool -- WAS Bundle ...... SKIPPED
[INFO] ------------------------------------------------------------------------
[INFO] BUILD FAILURE
[INFO] ------------------------------------------------------------------------
[INFO] Total time: 24:04 min
[INFO] Finished at: 2018-05-14T15:51:15+00:00
[INFO] Final Memory: 99M/2213M
[INFO] ------------------------------------------------------------------------
[ERROR] Failed to execute goal org.apache.maven.plugins:maven-surefire-plugin:2.19.1:test (default-test) on project openjpa-persistence-jdbc: There are test failures.
[ERROR] 
[ERROR] Please refer to <https://builds.apache.org/job/OpenJPA-2.4.x-jdk8/ws/openjpa-persistence-jdbc/target/surefire-reports> for the individual test results.
[ERROR] -> [Help 1]
[ERROR] 
[ERROR] To see the full stack trace of the errors, re-run Maven with the -e switch.
[ERROR] Re-run Maven using the -X switch to enable full debug logging.
[ERROR] 
[ERROR] For more information about the errors and possible solutions, please read the following articles:
[ERROR] [Help 1] http://cwiki.apache.org/confluence/display/MAVEN/MojoFailureException
[ERROR] 
[ERROR] After correcting the problems, you can resume the build with the command
[ERROR]   mvn <goals> -rf :openjpa-persistence-jdbc
Build step 'Execute shell' marked build as failure
Archiving artifacts
Setting ANT_1_9_7_HOME=/home/jenkins/tools/ant/apache-ant-1.9.7
Setting MAVEN_3_3_3_HOME=/home/jenkins/tools/maven/apache-maven-3.3.3
Setting JDK_1_8_LATEST__HOME=/home/jenkins/tools/java/latest1.8
Recording test results
Setting ANT_1_9_7_HOME=/home/jenkins/tools/ant/apache-ant-1.9.7
Setting MAVEN_3_3_3_HOME=/home/jenkins/tools/maven/apache-maven-3.3.3
Setting JDK_1_8_LATEST__HOME=/home/jenkins/tools/java/latest1.8
Setting ANT_1_9_7_HOME=/home/jenkins/tools/ant/apache-ant-1.9.7
Setting MAVEN_3_3_3_HOME=/home/jenkins/tools/maven/apache-maven-3.3.3
Setting JDK_1_8_LATEST__HOME=/home/jenkins/tools/java/latest1.8


Mime
View raw message