openjpa-commits mailing list archives

Site index · List index
Message view « Date » · « Thread »
Top « Date » · « Thread »
From Apache Jenkins Server <jenk...@builds.apache.org>
Subject Build failed in Jenkins: OpenJPA-2.4.x-jdk8 #20
Date Wed, 27 Jun 2018 14:54:34 GMT
See <https://builds.apache.org/job/OpenJPA-2.4.x-jdk8/20/display/redirect?page=changes>

Changes:

[struberg] pin down the tag name to just the version

this is what we used to have historically

------------------------------------------
[...truncated 4.64 MB...]
	at java.lang.Class.forName(Class.java:264)
	at org.apache.openjpa.persistence.validation.ValidationUtils.setupValidation(ValidationUtils.java:76)
	at org.apache.openjpa.persistence.PersistenceProviderImpl.loadValidator(PersistenceProviderImpl.java:323)
	at org.apache.openjpa.persistence.PersistenceProviderImpl.createEntityManagerFactory(PersistenceProviderImpl.java:102)
	at org.apache.openjpa.persistence.OpenJPAPersistence.createEntityManagerFactory(OpenJPAPersistence.java:129)
	at org.apache.openjpa.persistence.validation.TestValidationFactory.testValidationFactory4(TestValidationFactory.java:146)
	at sun.reflect.NativeMethodAccessorImpl.invoke0(Native Method)
	at sun.reflect.NativeMethodAccessorImpl.invoke(NativeMethodAccessorImpl.java:62)
	at sun.reflect.DelegatingMethodAccessorImpl.invoke(DelegatingMethodAccessorImpl.java:43)
	at java.lang.reflect.Method.invoke(Method.java:498)
	at junit.framework.TestCase.runTest(TestCase.java:176)
	at org.apache.openjpa.persistence.test.AbstractPersistenceTestCase.runTest(AbstractPersistenceTestCase.java:578)
	at junit.framework.TestCase.runBare(TestCase.java:141)
	at org.apache.openjpa.persistence.test.AbstractPersistenceTestCase.runBare(AbstractPersistenceTestCase.java:565)
	at org.apache.openjpa.persistence.test.AbstractPersistenceTestCase.runBare(AbstractPersistenceTestCase.java:541)
	at junit.framework.TestResult$1.protect(TestResult.java:122)
	at junit.framework.TestResult.runProtected(TestResult.java:142)
	at junit.framework.TestResult.run(TestResult.java:125)
	at junit.framework.TestCase.run(TestCase.java:129)
	at org.apache.openjpa.persistence.test.AbstractPersistenceTestCase.run(AbstractPersistenceTestCase.java:206)
	at junit.framework.TestSuite.runTest(TestSuite.java:252)
	at junit.framework.TestSuite.run(TestSuite.java:247)
	at org.junit.internal.runners.JUnit38ClassRunner.run(JUnit38ClassRunner.java:86)
	at org.apache.maven.surefire.junit4.JUnit4Provider.execute(JUnit4Provider.java:367)
	at org.apache.maven.surefire.junit4.JUnit4Provider.executeWithRerun(JUnit4Provider.java:274)
	at org.apache.maven.surefire.junit4.JUnit4Provider.executeTestSet(JUnit4Provider.java:238)
	at org.apache.maven.surefire.junit4.JUnit4Provider.invoke(JUnit4Provider.java:161)
	at org.apache.maven.surefire.booter.ForkedBooter.invokeProviderInSameClassLoader(ForkedBooter.java:290)
	at org.apache.maven.surefire.booter.ForkedBooter.runSuitesInProcess(ForkedBooter.java:242)
	at org.apache.maven.surefire.booter.ForkedBooter.main(ForkedBooter.java:121)

2  simple-callback-mode  ERROR  [main] openjpa.Runtime - Failed to create a provider for "simple-callback-mode".<openjpa-2.4.4-SNAPSHOT-r422266:1834505
fatal 6 error> org.apache.openjpa.validation.ValidationUnavailableException: A fatal error
occurred while trying to create the required validation provider.
	at org.apache.openjpa.persistence.validation.ValidationUtils.setupValidation(ValidationUtils.java:85)
	at org.apache.openjpa.persistence.PersistenceProviderImpl.loadValidator(PersistenceProviderImpl.java:323)
	at org.apache.openjpa.persistence.PersistenceProviderImpl.createEntityManagerFactory(PersistenceProviderImpl.java:102)
	at org.apache.openjpa.persistence.OpenJPAPersistence.createEntityManagerFactory(OpenJPAPersistence.java:129)
	at org.apache.openjpa.persistence.validation.TestValidationFactory.testValidationFactory4(TestValidationFactory.java:146)
	at sun.reflect.NativeMethodAccessorImpl.invoke0(Native Method)
	at sun.reflect.NativeMethodAccessorImpl.invoke(NativeMethodAccessorImpl.java:62)
	at sun.reflect.DelegatingMethodAccessorImpl.invoke(DelegatingMethodAccessorImpl.java:43)
	at java.lang.reflect.Method.invoke(Method.java:498)
	at junit.framework.TestCase.runTest(TestCase.java:176)
	at org.apache.openjpa.persistence.test.AbstractPersistenceTestCase.runTest(AbstractPersistenceTestCase.java:578)
	at junit.framework.TestCase.runBare(TestCase.java:141)
	at org.apache.openjpa.persistence.test.AbstractPersistenceTestCase.runBare(AbstractPersistenceTestCase.java:565)
	at org.apache.openjpa.persistence.test.AbstractPersistenceTestCase.runBare(AbstractPersistenceTestCase.java:541)
	at junit.framework.TestResult$1.protect(TestResult.java:122)
	at junit.framework.TestResult.runProtected(TestResult.java:142)
	at junit.framework.TestResult.run(TestResult.java:125)
	at junit.framework.TestCase.run(TestCase.java:129)
	at org.apache.openjpa.persistence.test.AbstractPersistenceTestCase.run(AbstractPersistenceTestCase.java:206)
	at junit.framework.TestSuite.runTest(TestSuite.java:252)
	at junit.framework.TestSuite.run(TestSuite.java:247)
	at org.junit.internal.runners.JUnit38ClassRunner.run(JUnit38ClassRunner.java:86)
	at org.apache.maven.surefire.junit4.JUnit4Provider.execute(JUnit4Provider.java:367)
	at org.apache.maven.surefire.junit4.JUnit4Provider.executeWithRerun(JUnit4Provider.java:274)
	at org.apache.maven.surefire.junit4.JUnit4Provider.executeTestSet(JUnit4Provider.java:238)
	at org.apache.maven.surefire.junit4.JUnit4Provider.invoke(JUnit4Provider.java:161)
	at org.apache.maven.surefire.booter.ForkedBooter.invokeProviderInSameClassLoader(ForkedBooter.java:290)
	at org.apache.maven.surefire.booter.ForkedBooter.runSuitesInProcess(ForkedBooter.java:242)
	at org.apache.maven.surefire.booter.ForkedBooter.main(ForkedBooter.java:121)
Caused by: java.lang.RuntimeException: java.lang.ClassNotFoundException: javax.validation.ValidationException
	... 29 more
Caused by: java.lang.ClassNotFoundException: javax.validation.ValidationException
	at java.net.URLClassLoader.findClass(URLClassLoader.java:381)
	at java.lang.ClassLoader.loadClass(ClassLoader.java:424)
	at sun.misc.Launcher$AppClassLoader.loadClass(Launcher.java:349)
	at java.lang.ClassLoader.loadClass(ClassLoader.java:357)
	at java.lang.Class.forName0(Native Method)
	at java.lang.Class.forName(Class.java:264)
	at org.apache.openjpa.persistence.validation.ValidationUtils.setupValidation(ValidationUtils.java:76)
	... 28 more

5  test  INFO   [main] openjpa.jdbc.JDBC - Using dictionary class "org.apache.openjpa.jdbc.sql.DerbyDictionary".
Tests run: 4, Failures: 0, Errors: 0, Skipped: 0, Time elapsed: 0.035 sec - in org.apache.openjpa.persistence.validation.TestValidationFactory
Running org.apache.openjpa.persistence.validation.TestValidationMode
1  simple  INFO   [main] openjpa.jdbc.JDBC - Using dictionary class "org.apache.openjpa.jdbc.sql.DerbyDictionary".
4  test  INFO   [main] openjpa.jdbc.JDBC - Using dictionary class "org.apache.openjpa.jdbc.sql.DerbyDictionary".
1  simple-auto-mode  INFO   [main] openjpa.jdbc.JDBC - Using dictionary class "org.apache.openjpa.jdbc.sql.DerbyDictionary".
4  test  INFO   [main] openjpa.jdbc.JDBC - Using dictionary class "org.apache.openjpa.jdbc.sql.DerbyDictionary".
0  simple-none-mode  INFO   [main] openjpa.jdbc.JDBC - Using dictionary class "org.apache.openjpa.jdbc.sql.DerbyDictionary".
3  test  INFO   [main] openjpa.jdbc.JDBC - Using dictionary class "org.apache.openjpa.jdbc.sql.DerbyDictionary".
1  simple-callback-mode  ERROR  [main] openjpa.Runtime - A fatal error occurred while trying
to create the required validation provider.java.lang.ClassNotFoundException: javax.validation.ValidationException
	at java.net.URLClassLoader.findClass(URLClassLoader.java:381)
	at java.lang.ClassLoader.loadClass(ClassLoader.java:424)
	at sun.misc.Launcher$AppClassLoader.loadClass(Launcher.java:349)
	at java.lang.ClassLoader.loadClass(ClassLoader.java:357)
	at java.lang.Class.forName0(Native Method)
	at java.lang.Class.forName(Class.java:264)
	at org.apache.openjpa.persistence.validation.ValidationUtils.setupValidation(ValidationUtils.java:76)
	at org.apache.openjpa.persistence.PersistenceProviderImpl.loadValidator(PersistenceProviderImpl.java:323)
	at org.apache.openjpa.persistence.PersistenceProviderImpl.createEntityManagerFactory(PersistenceProviderImpl.java:102)
	at org.apache.openjpa.persistence.OpenJPAPersistence.createEntityManagerFactory(OpenJPAPersistence.java:129)
	at org.apache.openjpa.persistence.OpenJPAPersistence.createEntityManagerFactory(OpenJPAPersistence.java:111)
	at org.apache.openjpa.persistence.validation.TestValidationMode.testValidationMode4(TestValidationMode.java:138)
	at sun.reflect.NativeMethodAccessorImpl.invoke0(Native Method)
	at sun.reflect.NativeMethodAccessorImpl.invoke(NativeMethodAccessorImpl.java:62)
	at sun.reflect.DelegatingMethodAccessorImpl.invoke(DelegatingMethodAccessorImpl.java:43)
	at java.lang.reflect.Method.invoke(Method.java:498)
	at junit.framework.TestCase.runTest(TestCase.java:176)
	at org.apache.openjpa.persistence.test.AbstractPersistenceTestCase.runTest(AbstractPersistenceTestCase.java:578)
	at junit.framework.TestCase.runBare(TestCase.java:141)
	at org.apache.openjpa.persistence.test.AbstractPersistenceTestCase.runBare(AbstractPersistenceTestCase.java:565)
	at org.apache.openjpa.persistence.test.AbstractPersistenceTestCase.runBare(AbstractPersistenceTestCase.java:541)
	at junit.framework.TestResult$1.protect(TestResult.java:122)
	at junit.framework.TestResult.runProtected(TestResult.java:142)
	at junit.framework.TestResult.run(TestResult.java:125)
	at junit.framework.TestCase.run(TestCase.java:129)
	at org.apache.openjpa.persistence.test.AbstractPersistenceTestCase.run(AbstractPersistenceTestCase.java:206)
	at junit.framework.TestSuite.runTest(TestSuite.java:252)
	at junit.framework.TestSuite.run(TestSuite.java:247)
	at org.junit.internal.runners.JUnit38ClassRunner.run(JUnit38ClassRunner.java:86)
	at org.apache.maven.surefire.junit4.JUnit4Provider.execute(JUnit4Provider.java:367)
	at org.apache.maven.surefire.junit4.JUnit4Provider.executeWithRerun(JUnit4Provider.java:274)
	at org.apache.maven.surefire.junit4.JUnit4Provider.executeTestSet(JUnit4Provider.java:238)
	at org.apache.maven.surefire.junit4.JUnit4Provider.invoke(JUnit4Provider.java:161)
	at org.apache.maven.surefire.booter.ForkedBooter.invokeProviderInSameClassLoader(ForkedBooter.java:290)
	at org.apache.maven.surefire.booter.ForkedBooter.runSuitesInProcess(ForkedBooter.java:242)
	at org.apache.maven.surefire.booter.ForkedBooter.main(ForkedBooter.java:121)

1  simple-callback-mode  ERROR  [main] openjpa.Runtime - Failed to create a provider for "simple-callback-mode".<openjpa-2.4.4-SNAPSHOT-r422266:1834505
fatal 6 error> org.apache.openjpa.validation.ValidationUnavailableException: A fatal error
occurred while trying to create the required validation provider.
	at org.apache.openjpa.persistence.validation.ValidationUtils.setupValidation(ValidationUtils.java:85)
	at org.apache.openjpa.persistence.PersistenceProviderImpl.loadValidator(PersistenceProviderImpl.java:323)
	at org.apache.openjpa.persistence.PersistenceProviderImpl.createEntityManagerFactory(PersistenceProviderImpl.java:102)
	at org.apache.openjpa.persistence.OpenJPAPersistence.createEntityManagerFactory(OpenJPAPersistence.java:129)
	at org.apache.openjpa.persistence.OpenJPAPersistence.createEntityManagerFactory(OpenJPAPersistence.java:111)
	at org.apache.openjpa.persistence.validation.TestValidationMode.testValidationMode4(TestValidationMode.java:138)
	at sun.reflect.NativeMethodAccessorImpl.invoke0(Native Method)
	at sun.reflect.NativeMethodAccessorImpl.invoke(NativeMethodAccessorImpl.java:62)
	at sun.reflect.DelegatingMethodAccessorImpl.invoke(DelegatingMethodAccessorImpl.java:43)
	at java.lang.reflect.Method.invoke(Method.java:498)
	at junit.framework.TestCase.runTest(TestCase.java:176)
	at org.apache.openjpa.persistence.test.AbstractPersistenceTestCase.runTest(AbstractPersistenceTestCase.java:578)
	at junit.framework.TestCase.runBare(TestCase.java:141)
	at org.apache.openjpa.persistence.test.AbstractPersistenceTestCase.runBare(AbstractPersistenceTestCase.java:565)
	at org.apache.openjpa.persistence.test.AbstractPersistenceTestCase.runBare(AbstractPersistenceTestCase.java:541)
	at junit.framework.TestResult$1.protect(TestResult.java:122)
	at junit.framework.TestResult.runProtected(TestResult.java:142)
	at junit.framework.TestResult.run(TestResult.java:125)
	at junit.framework.TestCase.run(TestCase.java:129)
	at org.apache.openjpa.persistence.test.AbstractPersistenceTestCase.run(AbstractPersistenceTestCase.java:206)
	at junit.framework.TestSuite.runTest(TestSuite.java:252)
	at junit.framework.TestSuite.run(TestSuite.java:247)
	at org.junit.internal.runners.JUnit38ClassRunner.run(JUnit38ClassRunner.java:86)
	at org.apache.maven.surefire.junit4.JUnit4Provider.execute(JUnit4Provider.java:367)
	at org.apache.maven.surefire.junit4.JUnit4Provider.executeWithRerun(JUnit4Provider.java:274)
	at org.apache.maven.surefire.junit4.JUnit4Provider.executeTestSet(JUnit4Provider.java:238)
	at org.apache.maven.surefire.junit4.JUnit4Provider.invoke(JUnit4Provider.java:161)
	at org.apache.maven.surefire.booter.ForkedBooter.invokeProviderInSameClassLoader(ForkedBooter.java:290)
	at org.apache.maven.surefire.booter.ForkedBooter.runSuitesInProcess(ForkedBooter.java:242)
	at org.apache.maven.surefire.booter.ForkedBooter.main(ForkedBooter.java:121)
Caused by: java.lang.RuntimeException: java.lang.ClassNotFoundException: javax.validation.ValidationException
	... 30 more
Caused by: java.lang.ClassNotFoundException: javax.validation.ValidationException
	at java.net.URLClassLoader.findClass(URLClassLoader.java:381)
	at java.lang.ClassLoader.loadClass(ClassLoader.java:424)
	at sun.misc.Launcher$AppClassLoader.loadClass(Launcher.java:349)
	at java.lang.ClassLoader.loadClass(ClassLoader.java:357)
	at java.lang.Class.forName0(Native Method)
	at java.lang.Class.forName(Class.java:264)
	at org.apache.openjpa.persistence.validation.ValidationUtils.setupValidation(ValidationUtils.java:76)
	... 29 more

3  test  INFO   [main] openjpa.jdbc.JDBC - Using dictionary class "org.apache.openjpa.jdbc.sql.DerbyDictionary".
0  simple  INFO   [main] openjpa.jdbc.JDBC - Using dictionary class "org.apache.openjpa.jdbc.sql.DerbyDictionary".
4  test  INFO   [main] openjpa.jdbc.JDBC - Using dictionary class "org.apache.openjpa.jdbc.sql.DerbyDictionary".
0  simple-callback-mode  INFO   [main] openjpa.jdbc.JDBC - Using dictionary class "org.apache.openjpa.jdbc.sql.DerbyDictionary".
3  test  INFO   [main] openjpa.jdbc.JDBC - Using dictionary class "org.apache.openjpa.jdbc.sql.DerbyDictionary".
0  simple-callback-mode  INFO   [main] openjpa.jdbc.JDBC - Using dictionary class "org.apache.openjpa.jdbc.sql.DerbyDictionary".
6  test  INFO   [main] openjpa.jdbc.JDBC - Using dictionary class "org.apache.openjpa.jdbc.sql.DerbyDictionary".
1  simple  INFO   [main] openjpa.Runtime - Starting OpenJPA 2.4.4-SNAPSHOT
1  simple  INFO   [main] openjpa.jdbc.JDBC - Using dictionary class "org.apache.openjpa.jdbc.sql.DerbyDictionary".
5  simple  INFO   [main] openjpa.jdbc.JDBC - Connected to Apache Derby version 10.10 using
JDBC driver Apache Derby Embedded JDBC Driver version 10.12.1.1 - (1704137). 
115  test  INFO   [main] openjpa.jdbc.JDBC - Using dictionary class "org.apache.openjpa.jdbc.sql.DerbyDictionary".
Tests run: 8, Failures: 0, Errors: 0, Skipped: 0, Time elapsed: 0.24 sec - in org.apache.openjpa.persistence.validation.TestValidationMode
Running org.apache.openjpa.persistence.optlockex.timestamp.TestTimestampOptLockEx
1  test  INFO   [main] openjpa.jdbc.JDBC - Using dictionary class "org.apache.openjpa.jdbc.sql.DerbyDictionary".
Tests run: 1, Failures: 0, Errors: 0, Skipped: 0, Time elapsed: 0.008 sec - in org.apache.openjpa.persistence.optlockex.timestamp.TestTimestampOptLockEx

Results :

Tests in error: 
  TestTableGeneratorUseSchemaNameProp>AbstractPersistenceTestCase.run:206->AbstractPersistenceTestCase.runBare:541->AbstractPersistenceTestCase.runBare:565->AbstractPersistenceTestCase.runTest:578->testNoSchemaAndSchemaFactory:51
ยป Rollback

Tests run: 3087, Failures: 0, Errors: 1, Skipped: 0

[INFO] ------------------------------------------------------------------------
[INFO] Reactor Summary:
[INFO] 
[INFO] OpenJPA Parent POM ................................. SUCCESS [  9.769 s]
[INFO] OpenJPA Utilities Library .......................... SUCCESS [ 12.407 s]
[INFO] OpenJPA Kernel ..................................... SUCCESS [ 12.466 s]
[INFO] OpenJPA JDBC ....................................... SUCCESS [  8.288 s]
[INFO] OpenJPA Persistence ................................ SUCCESS [  4.929 s]
[INFO] OpenJPA Persistence JDBC ........................... FAILURE [24:53 min]
[INFO] OpenJPA Persistence Locking Tests .................. SKIPPED
[INFO] OpenJPA tools ...................................... SKIPPED
[INFO] OpenJPA Maven Plugin ............................... SKIPPED
[INFO] OpenJPA XML Store .................................. SKIPPED
[INFO] OpenJPA Slice ...................................... SKIPPED
[INFO] OpenJPA JEST ....................................... SKIPPED
[INFO] OpenJPA Aggregate Jar .............................. SKIPPED
[INFO] OpenJPA Aggregate Jar with Dependencies ............ SKIPPED
[INFO] OpenJPA Project Docs and Assemblies ................ SKIPPED
[INFO] OpenJPA Examples ................................... SKIPPED
[INFO] OpenJPA Examples - Simple .......................... SKIPPED
[INFO] OpenJPA Examples - image-gallery ................... SKIPPED
[INFO] OpenJPA Examples - OpenBooks ....................... SKIPPED
[INFO] OpenJPA Integration Tests .......................... SKIPPED
[INFO] OpenJPA Integration Tests - Daytrader .............. SKIPPED
[INFO] OpenJPA Integration Tests - Examples ............... SKIPPED
[INFO] OpenJPA Integration Tests - SLF4JLogFactory ........ SKIPPED
[INFO] OpenJPA Integration Tests - JPA TCK ................ SKIPPED
[INFO] OpenJPA Integration Tests - Bean Validation ........ SKIPPED
[INFO] OpenJPA Integration Tests - JMX Platform MBeans .... SKIPPED
[INFO] OpenJPA Fetching Statistic Tool .................... SKIPPED
[INFO] OpenJPA Fetching Statistic Tool -- WAS Bundle ...... SKIPPED
[INFO] ------------------------------------------------------------------------
[INFO] BUILD FAILURE
[INFO] ------------------------------------------------------------------------
[INFO] Total time: 25:42 min
[INFO] Finished at: 2018-06-27T14:54:31+00:00
[INFO] Final Memory: 105M/2015M
[INFO] ------------------------------------------------------------------------
[ERROR] Failed to execute goal org.apache.maven.plugins:maven-surefire-plugin:2.19.1:test
(default-test) on project openjpa-persistence-jdbc: There are test failures.
[ERROR] 
[ERROR] Please refer to <https://builds.apache.org/job/OpenJPA-2.4.x-jdk8/ws/openjpa-persistence-jdbc/target/surefire-reports>
for the individual test results.
[ERROR] -> [Help 1]
[ERROR] 
[ERROR] To see the full stack trace of the errors, re-run Maven with the -e switch.
[ERROR] Re-run Maven using the -X switch to enable full debug logging.
[ERROR] 
[ERROR] For more information about the errors and possible solutions, please read the following
articles:
[ERROR] [Help 1] http://cwiki.apache.org/confluence/display/MAVEN/MojoFailureException
[ERROR] 
[ERROR] After correcting the problems, you can resume the build with the command
[ERROR]   mvn <goals> -rf :openjpa-persistence-jdbc
Build step 'Execute shell' marked build as failure
Archiving artifacts
Setting ANT_1_9_7_HOME=/home/jenkins/tools/ant/apache-ant-1.9.7
Setting MAVEN_3_3_3_HOME=/home/jenkins/tools/maven/apache-maven-3.3.3
Setting JDK_1_8_LATEST__HOME=/home/jenkins/tools/java/latest1.8
Recording test results
Setting ANT_1_9_7_HOME=/home/jenkins/tools/ant/apache-ant-1.9.7
Setting MAVEN_3_3_3_HOME=/home/jenkins/tools/maven/apache-maven-3.3.3
Setting JDK_1_8_LATEST__HOME=/home/jenkins/tools/java/latest1.8
Setting ANT_1_9_7_HOME=/home/jenkins/tools/ant/apache-ant-1.9.7
Setting MAVEN_3_3_3_HOME=/home/jenkins/tools/maven/apache-maven-3.3.3
Setting JDK_1_8_LATEST__HOME=/home/jenkins/tools/java/latest1.8

Mime
View raw message