openjpa-commits mailing list archives

Site index · List index
Message view « Date » · « Thread »
Top « Date » · « Thread »
From Apache Jenkins Server <jenk...@builds.apache.org>
Subject Build failed in Jenkins: OpenJPA-trunk #24
Date Thu, 28 Jun 2018 10:32:41 GMT
See <https://builds.apache.org/job/OpenJPA-trunk/24/display/redirect?page=changes>

Changes:

[ilgrosso] Fix javadocs links (missing file)

[ilgrosso] Fix javadocs links (missing file)

[ilgrosso] Fix javadocs links

------------------------------------------
[...truncated 1.47 MB...]
Running org.apache.openjpa.persistence.jdbc.query.cache.TestQueryTimestampEviction
Tests run: 5, Failures: 0, Errors: 0, Skipped: 0, Time elapsed: 1.263 sec - in org.apache.openjpa.persistence.jdbc.query.cache.TestQueryTimestampEviction
Running org.apache.openjpa.persistence.jdbc.query.cache.TestQueryDefaultEviction
Tests run: 3, Failures: 0, Errors: 0, Skipped: 0, Time elapsed: 0.223 sec - in org.apache.openjpa.persistence.jdbc.query.cache.TestQueryDefaultEviction
Running org.apache.openjpa.persistence.jdbc.query.cache.TestNonPrimaryKeyQueryParameters
Tests run: 5, Failures: 0, Errors: 0, Skipped: 0, Time elapsed: 0.413 sec - in org.apache.openjpa.persistence.jdbc.query.cache.TestNonPrimaryKeyQueryParameters
Running org.apache.openjpa.persistence.jdbc.query.TestAggregateQueryWithNoResult
Tests run: 5, Failures: 0, Errors: 0, Skipped: 0, Time elapsed: 0.139 sec - in org.apache.openjpa.persistence.jdbc.query.TestAggregateQueryWithNoResult
Running org.apache.openjpa.persistence.jdbc.query.TestQueryParameterBinding
Tests run: 23, Failures: 0, Errors: 0, Skipped: 0, Time elapsed: 1.526 sec - in org.apache.openjpa.persistence.jdbc.query.TestQueryParameterBinding
Running org.apache.openjpa.persistence.jdbc.query.xml.TestTableNameInXml
Tests run: 3, Failures: 0, Errors: 0, Skipped: 0, Time elapsed: 0.252 sec - in org.apache.openjpa.persistence.jdbc.query.xml.TestTableNameInXml
Running org.apache.openjpa.persistence.jdbc.query.sub.TestSubQuery
Tests run: 1, Failures: 0, Errors: 0, Skipped: 0, Time elapsed: 0.436 sec - in org.apache.openjpa.persistence.jdbc.query.sub.TestSubQuery
Running org.apache.openjpa.persistence.jdbc.query.TestNativeQueryProcedures
Tests run: 4, Failures: 0, Errors: 0, Skipped: 0, Time elapsed: 0.708 sec - in org.apache.openjpa.persistence.jdbc.query.TestNativeQueryProcedures
Running org.apache.openjpa.persistence.jdbc.query.TestHintedQuery
Tests run: 1, Failures: 0, Errors: 0, Skipped: 0, Time elapsed: 0.215 sec - in org.apache.openjpa.persistence.jdbc.query.TestHintedQuery
Running org.apache.openjpa.persistence.jdbc.TestIsolationLevelOverride
Tests run: 3, Failures: 0, Errors: 0, Skipped: 0, Time elapsed: 0.076 sec - in org.apache.openjpa.persistence.jdbc.TestIsolationLevelOverride
Running org.apache.openjpa.persistence.jdbc.strategy.TestHandlerStrategy
Tests run: 1, Failures: 0, Errors: 0, Skipped: 0, Time elapsed: 1.474 sec - in org.apache.openjpa.persistence.jdbc.strategy.TestHandlerStrategy
Running org.apache.openjpa.persistence.jdbc.strategy.TestStrategyAnnotaion
Tests run: 1, Failures: 0, Errors: 0, Skipped: 0, Time elapsed: 0.477 sec - in org.apache.openjpa.persistence.jdbc.strategy.TestStrategyAnnotaion
Running org.apache.openjpa.persistence.jdbc.meta.TestUseSchemaElement
Tests run: 1, Failures: 0, Errors: 0, Skipped: 0, Time elapsed: 0.282 sec - in org.apache.openjpa.persistence.jdbc.meta.TestUseSchemaElement
Running org.apache.openjpa.persistence.jdbc.meta.TestEJBCustomMapping
Tests run: 2, Failures: 0, Errors: 0, Skipped: 0, Time elapsed: 0.558 sec - in org.apache.openjpa.persistence.jdbc.meta.TestEJBCustomMapping
Running org.apache.openjpa.persistence.jdbc.meta.TestEJBInverseOneToOne
Tests run: 1, Failures: 0, Errors: 0, Skipped: 0, Time elapsed: 0.091 sec - in org.apache.openjpa.persistence.jdbc.meta.TestEJBInverseOneToOne
Running org.apache.openjpa.persistence.jdbc.meta.TestRangeQuery
Tests run: 1, Failures: 0, Errors: 0, Skipped: 0, Time elapsed: 0.204 sec - in org.apache.openjpa.persistence.jdbc.meta.TestRangeQuery
Running org.apache.openjpa.persistence.jdbc.xml.TestNonstandardMappingXML
Tests run: 15, Failures: 0, Errors: 0, Skipped: 0, Time elapsed: 20.444 sec - in org.apache.openjpa.persistence.jdbc.xml.TestNonstandardMappingXML
Running org.apache.openjpa.persistence.jdbc.TestSelectForUpdateOverride
Tests run: 1, Failures: 0, Errors: 0, Skipped: 0, Time elapsed: 0.049 sec - in org.apache.openjpa.persistence.jdbc.TestSelectForUpdateOverride
Running org.apache.openjpa.persistence.jdbc.annotations.TestEmbeddedId
Tests run: 6, Failures: 0, Errors: 0, Skipped: 0, Time elapsed: 0.434 sec - in org.apache.openjpa.persistence.jdbc.annotations.TestEmbeddedId
Running org.apache.openjpa.persistence.jdbc.annotations.TestMultiColumnVersion
Tests run: 7, Failures: 0, Errors: 0, Skipped: 0, Time elapsed: 1.541 sec - in org.apache.openjpa.persistence.jdbc.annotations.TestMultiColumnVersion
Running org.apache.openjpa.persistence.jdbc.annotations.TestMultiColumnVersionXML
Tests run: 7, Failures: 0, Errors: 0, Skipped: 0, Time elapsed: 0.624 sec - in org.apache.openjpa.persistence.jdbc.annotations.TestMultiColumnVersionXML
Running org.apache.openjpa.persistence.jdbc.annotations.TestVersion
Tests run: 7, Failures: 0, Errors: 0, Skipped: 0, Time elapsed: 5.749 sec - in org.apache.openjpa.persistence.jdbc.annotations.TestVersion
Running org.apache.openjpa.persistence.jdbc.annotations.TestDiscriminator
Tests run: 1, Failures: 0, Errors: 0, Skipped: 0, Time elapsed: 0.046 sec - in org.apache.openjpa.persistence.jdbc.annotations.TestDiscriminator
Running org.apache.openjpa.persistence.jdbc.annotations.TestTablePerClassInheritance
Tests run: 2, Failures: 0, Errors: 0, Skipped: 0, Time elapsed: 0.118 sec - in org.apache.openjpa.persistence.jdbc.annotations.TestTablePerClassInheritance
Running org.apache.openjpa.persistence.jdbc.annotations.TestExtensionAnnotations
Tests run: 11, Failures: 0, Errors: 0, Skipped: 0, Time elapsed: 0.989 sec - in org.apache.openjpa.persistence.jdbc.annotations.TestExtensionAnnotations
Running org.apache.openjpa.persistence.jdbc.annotations.TestManyToMany
Tests run: 2, Failures: 0, Errors: 0, Skipped: 0, Time elapsed: 0.234 sec - in org.apache.openjpa.persistence.jdbc.annotations.TestManyToMany
Running org.apache.openjpa.persistence.jdbc.annotations.TestSerializedLobs
Tests run: 5, Failures: 0, Errors: 0, Skipped: 0, Time elapsed: 0.274 sec - in org.apache.openjpa.persistence.jdbc.annotations.TestSerializedLobs
Running org.apache.openjpa.persistence.jdbc.annotations.TestOneToMany
Tests run: 2, Failures: 0, Errors: 0, Skipped: 0, Time elapsed: 0.115 sec - in org.apache.openjpa.persistence.jdbc.annotations.TestOneToMany
Running org.apache.openjpa.persistence.jdbc.annotations.TestJoinedInheritance
Tests run: 1, Failures: 0, Errors: 0, Skipped: 0, Time elapsed: 0.049 sec - in org.apache.openjpa.persistence.jdbc.annotations.TestJoinedInheritance
Running org.apache.openjpa.persistence.jdbc.annotations.TestEmbeddableSuperclass
Tests run: 6, Failures: 0, Errors: 0, Skipped: 0, Time elapsed: 0.166 sec - in org.apache.openjpa.persistence.jdbc.annotations.TestEmbeddableSuperclass
Running org.apache.openjpa.persistence.jdbc.annotations.TestGenerators
Tests run: 3, Failures: 0, Errors: 0, Skipped: 0, Time elapsed: 0.357 sec - in org.apache.openjpa.persistence.jdbc.annotations.TestGenerators
Running org.apache.openjpa.persistence.jdbc.annotations.TestEnumerated
Tests run: 2, Failures: 0, Errors: 0, Skipped: 0, Time elapsed: 0.102 sec - in org.apache.openjpa.persistence.jdbc.annotations.TestEnumerated
Running org.apache.openjpa.persistence.jdbc.annotations.TestMapKey
Tests run: 4, Failures: 0, Errors: 0, Skipped: 0, Time elapsed: 0.137 sec - in org.apache.openjpa.persistence.jdbc.annotations.TestMapKey
Running org.apache.openjpa.persistence.jdbc.annotations.TestSequenceGenerator
Tests run: 2, Failures: 0, Errors: 0, Skipped: 0, Time elapsed: 0 sec - in org.apache.openjpa.persistence.jdbc.annotations.TestSequenceGenerator
Running org.apache.openjpa.persistence.jdbc.annotations.TestNonstandardMappingAnnotations
Tests run: 15, Failures: 0, Errors: 0, Skipped: 0, Time elapsed: 15.475 sec - in org.apache.openjpa.persistence.jdbc.annotations.TestNonstandardMappingAnnotations
Running org.apache.openjpa.persistence.jdbc.annotations.TestOneToOne
Tests run: 5, Failures: 0, Errors: 0, Skipped: 0, Time elapsed: 0.374 sec - in org.apache.openjpa.persistence.jdbc.annotations.TestOneToOne
Running org.apache.openjpa.persistence.jdbc.annotations.TestFlatInheritance
Tests run: 1, Failures: 0, Errors: 0, Skipped: 0, Time elapsed: 0.048 sec - in org.apache.openjpa.persistence.jdbc.annotations.TestFlatInheritance
Running org.apache.openjpa.persistence.jdbc.annotations.TestMixedAccess
Tests run: 2, Failures: 0, Errors: 0, Skipped: 0, Time elapsed: 0.467 sec - in org.apache.openjpa.persistence.jdbc.annotations.TestMixedAccess
Running org.apache.openjpa.persistence.jdbc.annotations.TestEJBEmbedded
Tests run: 5, Failures: 0, Errors: 0, Skipped: 0, Time elapsed: 0.489 sec - in org.apache.openjpa.persistence.jdbc.annotations.TestEJBEmbedded
Running org.apache.openjpa.persistence.jdbc.annotations.TestPropertyAccess
Tests run: 4, Failures: 0, Errors: 0, Skipped: 0, Time elapsed: 0.124 sec - in org.apache.openjpa.persistence.jdbc.annotations.TestPropertyAccess
Running org.apache.openjpa.persistence.jdbc.update.TestParentChild
Tests run: 1, Failures: 0, Errors: 0, Skipped: 0, Time elapsed: 18.755 sec - in org.apache.openjpa.persistence.jdbc.update.TestParentChild
Running org.apache.openjpa.persistence.jdbc.update.TestTimestampVersion
Tests run: 3, Failures: 0, Errors: 0, Skipped: 0, Time elapsed: 2.021 sec - in org.apache.openjpa.persistence.jdbc.update.TestTimestampVersion
Running org.apache.openjpa.persistence.jdbc.order.TestOrderColumnXML
Tests run: 5, Failures: 0, Errors: 0, Skipped: 0, Time elapsed: 1.157 sec - in org.apache.openjpa.persistence.jdbc.order.TestOrderColumnXML
Running org.apache.openjpa.persistence.jdbc.order.TestOrderColumn
Tests run: 15, Failures: 0, Errors: 0, Skipped: 0, Time elapsed: 8.163 sec - in org.apache.openjpa.persistence.jdbc.order.TestOrderColumn
Running org.apache.openjpa.persistence.jdbc.TestJDBCEnumToKernelConstantMappings
Tests run: 5, Failures: 0, Errors: 0, Skipped: 0, Time elapsed: 0 sec - in org.apache.openjpa.persistence.jdbc.TestJDBCEnumToKernelConstantMappings
Running org.apache.openjpa.persistence.jdbc.dbcs.TestDBCS
Tests run: 1, Failures: 0, Errors: 0, Skipped: 0, Time elapsed: 0.002 sec - in org.apache.openjpa.persistence.jdbc.dbcs.TestDBCS
Running org.apache.openjpa.enhance.TestDataCachingAndUnenhancedPropertyAccess
Tests run: 2, Failures: 0, Errors: 0, Skipped: 0, Time elapsed: 0.253 sec - in org.apache.openjpa.enhance.TestDataCachingAndUnenhancedPropertyAccess
Running org.apache.openjpa.enhance.TestPCEnhancerEnhancementContractVersion
Tests run: 3, Failures: 0, Errors: 0, Skipped: 0, Time elapsed: 0 sec - in org.apache.openjpa.enhance.TestPCEnhancerEnhancementContractVersion
Running org.apache.openjpa.enhance.TestClassHierarchyEnhancement
Tests run: 1, Failures: 0, Errors: 0, Skipped: 0, Time elapsed: 0.014 sec - in org.apache.openjpa.enhance.TestClassHierarchyEnhancement
Running org.apache.openjpa.enhance.TestEnhancementWithMultiplePUs
Tests run: 3, Failures: 0, Errors: 0, Skipped: 0, Time elapsed: 38.276 sec - in org.apache.openjpa.enhance.TestEnhancementWithMultiplePUs
Running org.apache.openjpa.enhance.TestSimpleUnenhancedQuery
Tests run: 1, Failures: 0, Errors: 0, Skipped: 0, Time elapsed: 0.242 sec - in org.apache.openjpa.enhance.TestSimpleUnenhancedQuery
Running org.apache.openjpa.enhance.ids.TestOptimizeIdCopy
Tests run: 3, Failures: 0, Errors: 0, Skipped: 0, Time elapsed: 0.949 sec - in org.apache.openjpa.enhance.ids.TestOptimizeIdCopy
Running org.apache.openjpa.enhance.TestPCEnhancerFindField
Tests run: 1, Failures: 0, Errors: 0, Skipped: 0, Time elapsed: 0.016 sec - in org.apache.openjpa.enhance.TestPCEnhancerFindField
Running org.apache.openjpa.jira1794.TestCompatAggregateFunctions
Tests run: 2, Failures: 0, Errors: 0, Skipped: 0, Time elapsed: 0.886 sec - in org.apache.openjpa.jira1794.TestCompatAggregateFunctions
Running org.apache.openjpa.jira1794.TestAggregateFunctions
Tests run: 2, Failures: 0, Errors: 0, Skipped: 0, Time elapsed: 0.173 sec - in org.apache.openjpa.jira1794.TestAggregateFunctions
Running org.apache.openjpa.jira1100.TestBadVersionField
Tests run: 1, Failures: 0, Errors: 0, Skipped: 0, Time elapsed: 0.009 sec - in org.apache.openjpa.jira1100.TestBadVersionField
Running org.apache.openjpa.conf.TestCacheMarshallerEndToEnd
Tests run: 1, Failures: 0, Errors: 0, Skipped: 0, Time elapsed: 0.829 sec - in org.apache.openjpa.conf.TestCacheMarshallerEndToEnd
Running org.apache.openjpa.conf.TestQueryProperties
Tests run: 2, Failures: 0, Errors: 0, Skipped: 0, Time elapsed: 0.059 sec - in org.apache.openjpa.conf.TestQueryProperties
Running org.apache.openjpa.conf.TestGetProperty
Tests run: 1, Failures: 0, Errors: 0, Skipped: 0, Time elapsed: 0.27 sec - in org.apache.openjpa.conf.TestGetProperty
Running org.apache.openjpa.conf.TestBadJdbcUrl
Tests run: 5, Failures: 0, Errors: 0, Skipped: 0, Time elapsed: 0.036 sec - in org.apache.openjpa.conf.TestBadJdbcUrl
Running org.apache.openjpa.conf.TestQueryHints
Tests run: 17, Failures: 0, Errors: 0, Skipped: 0, Time elapsed: 0.114 sec - in org.apache.openjpa.conf.TestQueryHints
Running org.apache.openjpa.conf.TestDynamicConfiguration
Tests run: 7, Failures: 0, Errors: 0, Skipped: 0, Time elapsed: 0.074 sec - in org.apache.openjpa.conf.TestDynamicConfiguration
Running org.apache.openjpa.conf.TestBadAutoDetachProperty
Tests run: 3, Failures: 0, Errors: 0, Skipped: 0, Time elapsed: 0.019 sec - in org.apache.openjpa.conf.TestBadAutoDetachProperty
Running org.apache.openjpa.conf.TestCacheMarshaller
Tests run: 5, Failures: 0, Errors: 0, Skipped: 0, Time elapsed: 0.029 sec - in org.apache.openjpa.conf.TestCacheMarshaller
Running org.apache.openjpa.conf.TestAutoDetachProperty
Tests run: 3, Failures: 0, Errors: 0, Skipped: 0, Time elapsed: 0.017 sec - in org.apache.openjpa.conf.TestAutoDetachProperty
Running org.apache.openjpa.conf.TestSpecificationConfiguration
Tests run: 9, Failures: 0, Errors: 0, Skipped: 0, Time elapsed: 0.087 sec - in org.apache.openjpa.conf.TestSpecificationConfiguration
Running org.apache.openjpa.meta.TestMetaDataInheritanceComparator
Tests run: 3, Failures: 0, Errors: 0, Skipped: 0, Time elapsed: 1.059 sec - in org.apache.openjpa.meta.TestMetaDataInheritanceComparator
Running org.apache.openjpa.meta.TestSecondaryTable
Tests run: 1, Failures: 0, Errors: 0, Skipped: 0, Time elapsed: 0.867 sec - in org.apache.openjpa.meta.TestSecondaryTable
Running org.apache.openjpa.meta.TestGetMetaData
Tests run: 1, Failures: 0, Errors: 0, Skipped: 0, Time elapsed: 0.78 sec - in org.apache.openjpa.meta.TestGetMetaData
Running org.apache.openjpa.audit.TestBeginEventOnTransactionListener
Tests run: 1, Failures: 0, Errors: 0, Skipped: 0, Time elapsed: 0.497 sec - in org.apache.openjpa.audit.TestBeginEventOnTransactionListener
Running org.apache.openjpa.jdbc.oracle.TestOracleXmlColumn
Tests run: 2, Failures: 0, Errors: 0, Skipped: 0, Time elapsed: 0.026 sec - in org.apache.openjpa.jdbc.oracle.TestOracleXmlColumn
Running org.apache.openjpa.jdbc.kernel.TestM2MBiVersion
Tests run: 3, Failures: 0, Errors: 0, Skipped: 0, Time elapsed: 0.997 sec - in org.apache.openjpa.jdbc.kernel.TestM2MBiVersion
Running org.apache.openjpa.jdbc.kernel.TestM21UniVersion
Tests run: 3, Failures: 0, Errors: 0, Skipped: 0, Time elapsed: 0.616 sec - in org.apache.openjpa.jdbc.kernel.TestM21UniVersion
Running org.apache.openjpa.jdbc.kernel.TestCollectionTracking
Tests run: 1, Failures: 0, Errors: 0, Skipped: 0, Time elapsed: 0.099 sec - in org.apache.openjpa.jdbc.kernel.TestCollectionTracking
Running org.apache.openjpa.jdbc.kernel.TestForeignKeyCountViolation
Tests run: 2, Failures: 0, Errors: 0, Skipped: 0, Time elapsed: 0.191 sec - in org.apache.openjpa.jdbc.kernel.TestForeignKeyCountViolation
Running org.apache.openjpa.jdbc.kernel.TestJDBCStoreOptSelect
Tests run: 1, Failures: 0, Errors: 0, Skipped: 0, Time elapsed: 0.323 sec - in org.apache.openjpa.jdbc.kernel.TestJDBCStoreOptSelect
Running org.apache.openjpa.jdbc.kernel.TestNoForeignKeyViolation
Tests run: 5, Failures: 0, Errors: 0, Skipped: 0, Time elapsed: 0.784 sec - in org.apache.openjpa.jdbc.kernel.TestNoForeignKeyViolation
Running org.apache.openjpa.jdbc.kernel.TestInsertOrder
Tests run: 2, Failures: 0, Errors: 0, Skipped: 0, Time elapsed: 0.947 sec - in org.apache.openjpa.jdbc.kernel.TestInsertOrder
Running org.apache.openjpa.jdbc.persistence.classcriteria.TestQuerySubclass
Tests run: 1, Failures: 0, Errors: 0, Skipped: 0, Time elapsed: 1.04 sec - in org.apache.openjpa.jdbc.persistence.classcriteria.TestQuerySubclass
Running org.apache.openjpa.jdbc.procedure.TestStoredProcedure
Tests run: 5, Failures: 0, Errors: 0, Skipped: 0, Time elapsed: 1.126 sec - in org.apache.openjpa.jdbc.procedure.TestStoredProcedure
Running org.apache.openjpa.jdbc.meta.TestMappingToolRefresh
Tests run: 1, Failures: 0, Errors: 0, Skipped: 0, Time elapsed: 8.722 sec - in org.apache.openjpa.jdbc.meta.TestMappingToolRefresh
Running org.apache.openjpa.jdbc.meta.strats.TestInputStreamLob
Tests run: 13, Failures: 0, Errors: 0, Skipped: 0, Time elapsed: 0.064 sec - in org.apache.openjpa.jdbc.meta.strats.TestInputStreamLob
Running org.apache.openjpa.jdbc.meta.strats.TestReaderLob
Tests run: 13, Failures: 0, Errors: 0, Skipped: 0, Time elapsed: 0.061 sec - in org.apache.openjpa.jdbc.meta.strats.TestReaderLob
Running org.apache.openjpa.jdbc.meta.TestBooleanValue
Tests run: 1, Failures: 0, Errors: 0, Skipped: 0, Time elapsed: 0.214 sec - in org.apache.openjpa.jdbc.meta.TestBooleanValue
Running org.apache.openjpa.jdbc.meta.TestMappingToolAutoDelete
Tests run: 1, Failures: 0, Errors: 0, Skipped: 0, Time elapsed: 0.085 sec - in org.apache.openjpa.jdbc.meta.TestMappingToolAutoDelete
Running org.apache.openjpa.jdbc.meta.TestMappingToolTemporal
Tests run: 1, Failures: 0, Errors: 0, Skipped: 0, Time elapsed: 0.154 sec - in org.apache.openjpa.jdbc.meta.TestMappingToolTemporal
Running org.apache.openjpa.jdbc.meta.TestCalendarField
Tests run: 2, Failures: 0, Errors: 0, Skipped: 0, Time elapsed: 0.273 sec - in org.apache.openjpa.jdbc.meta.TestCalendarField

Results :

Failed tests: 
  TestSJVMCache>AbstractPersistenceTestCase.run:206->AbstractPersistenceTestCase.runBare:541->AbstractPersistenceTestCase.runBare:565->AbstractPersistenceTestCase.runTest:578->CacheTest.testQueryTimeouts:1145->CacheTest.queryTimeoutsHelper:1203->CacheTest.assertInCache:1411
query should not be in cache; was.

Tests run: 3107, Failures: 1, Errors: 0, Skipped: 0

[INFO] ------------------------------------------------------------------------
[INFO] Reactor Summary:
[INFO] 
[INFO] OpenJPA Parent POM ................................. SUCCESS [  7.376 s]
[INFO] OpenJPA Utilities Library .......................... SUCCESS [ 10.979 s]
[INFO] OpenJPA Kernel ..................................... SUCCESS [  9.822 s]
[INFO] OpenJPA JDBC ....................................... SUCCESS [  7.295 s]
[INFO] OpenJPA Persistence ................................ SUCCESS [  4.841 s]
[INFO] OpenJPA Persistence JDBC ........................... FAILURE [25:52 min]
[INFO] OpenJPA Persistence Locking Tests .................. SKIPPED
[INFO] OpenJPA tools ...................................... SKIPPED
[INFO] OpenJPA Maven Plugin ............................... SKIPPED
[INFO] OpenJPA XML Store .................................. SKIPPED
[INFO] OpenJPA Slice ...................................... SKIPPED
[INFO] OpenJPA JEST ....................................... SKIPPED
[INFO] OpenJPA Aggregate Jar .............................. SKIPPED
[INFO] OpenJPA Aggregate Jar with Dependencies ............ SKIPPED
[INFO] OpenJPA Project Docs and Assemblies ................ SKIPPED
[INFO] OpenJPA Examples ................................... SKIPPED
[INFO] OpenJPA Examples - Simple .......................... SKIPPED
[INFO] OpenJPA Examples - image-gallery ................... SKIPPED
[INFO] OpenJPA Examples - OpenBooks ....................... SKIPPED
[INFO] OpenJPA Integration Tests .......................... SKIPPED
[INFO] OpenJPA Integration Tests - Daytrader .............. SKIPPED
[INFO] OpenJPA Integration Tests - Examples ............... SKIPPED
[INFO] OpenJPA Integration Tests - SLF4JLogFactory ........ SKIPPED
[INFO] OpenJPA Integration Tests - JPA TCK ................ SKIPPED
[INFO] OpenJPA Integration Tests - Bean Validation ........ SKIPPED
[INFO] OpenJPA Integration Tests - JMX Platform MBeans .... SKIPPED
[INFO] OpenJPA Fetching Statistic Tool .................... SKIPPED
[INFO] OpenJPA Fetching Statistic Tool -- WAS Bundle ...... SKIPPED
[INFO] OpenJPA Features ................................... SKIPPED
[INFO] ------------------------------------------------------------------------
[INFO] BUILD FAILURE
[INFO] ------------------------------------------------------------------------
[INFO] Total time: 26:33 min
[INFO] Finished at: 2018-06-28T10:32:37+00:00
[INFO] Final Memory: 148M/4381M
[INFO] ------------------------------------------------------------------------
[ERROR] Failed to execute goal org.apache.maven.plugins:maven-surefire-plugin:2.19.1:test
(default-test) on project openjpa-persistence-jdbc: There are test failures.
[ERROR] 
[ERROR] Please refer to <https://builds.apache.org/job/OpenJPA-trunk/ws/openjpa-persistence-jdbc/target/surefire-reports>
for the individual test results.
[ERROR] -> [Help 1]
[ERROR] 
[ERROR] To see the full stack trace of the errors, re-run Maven with the -e switch.
[ERROR] Re-run Maven using the -X switch to enable full debug logging.
[ERROR] 
[ERROR] For more information about the errors and possible solutions, please read the following
articles:
[ERROR] [Help 1] http://cwiki.apache.org/confluence/display/MAVEN/MojoFailureException
[ERROR] 
[ERROR] After correcting the problems, you can resume the build with the command
[ERROR]   mvn <goals> -rf :openjpa-persistence-jdbc
Build step 'Execute shell' marked build as failure
Archiving artifacts
Setting ANT_1_9_7_HOME=/home/jenkins/tools/ant/apache-ant-1.9.7
Setting JDK_1_8_LATEST__HOME=/home/jenkins/tools/java/latest1.8
Setting MAVEN_3_3_9_HOME=/home/jenkins/tools/maven/apache-maven-3.3.9
Setting MAVEN_3_3_3_HOME=/home/jenkins/tools/maven/apache-maven-3.3.3
Recording test results
Setting ANT_1_9_7_HOME=/home/jenkins/tools/ant/apache-ant-1.9.7
Setting JDK_1_8_LATEST__HOME=/home/jenkins/tools/java/latest1.8
Setting MAVEN_3_3_9_HOME=/home/jenkins/tools/maven/apache-maven-3.3.9
Setting MAVEN_3_3_3_HOME=/home/jenkins/tools/maven/apache-maven-3.3.3
Setting ANT_1_9_7_HOME=/home/jenkins/tools/ant/apache-ant-1.9.7
Setting JDK_1_8_LATEST__HOME=/home/jenkins/tools/java/latest1.8
Setting MAVEN_3_3_9_HOME=/home/jenkins/tools/maven/apache-maven-3.3.9
Setting MAVEN_3_3_3_HOME=/home/jenkins/tools/maven/apache-maven-3.3.3

Mime
View raw message