openjpa-commits mailing list archives

Site index · List index
Message view « Date » · « Thread »
Top « Date » · « Thread »
From Apache Jenkins Server <jenk...@builds.apache.org>
Subject Build failed in Jenkins: OpenJPA-Trunk-Deploy #18
Date Wed, 15 Aug 2018 07:46:15 GMT
See <https://builds.apache.org/job/OpenJPA-Trunk-Deploy/18/display/redirect?page=changes>

Changes:

[dazeydev] OPENJPA-2646: Performance Regression Fix

------------------------------------------
[...truncated 1.96 MB...]
[INFO] 
[INFO] --- buildnumber-maven-plugin:1.4:create (default) @ openjpa-fetch-statistics ---
[INFO] 
[INFO] --- maven-enforcer-plugin:1.4.1:enforce (default) @ openjpa-fetch-statistics ---
[INFO] 
[INFO] --- maven-checkstyle-plugin:2.9:checkstyle (default) @ openjpa-fetch-statistics ---
[INFO] Starting audit...
Audit done.

[WARNING] Unable to locate Source XRef to link to - DISABLED
[INFO] 
[INFO] --- maven-remote-resources-plugin:1.5:process (process-resource-bundles) @ openjpa-fetch-statistics
---
[INFO] 
[INFO] --- maven-resources-plugin:2.7:resources (default-resources) @ openjpa-fetch-statistics
---
[INFO] Using 'UTF-8' encoding to copy filtered resources.
[INFO] Copying 3 resources
[INFO] Copying 3 resources
[INFO] 
[INFO] --- maven-compiler-plugin:3.5.1:compile (default-compile) @ openjpa-fetch-statistics
---
[INFO] Changes detected - recompiling the module!
[INFO] Compiling 2 source files to <https://builds.apache.org/job/OpenJPA-Trunk-Deploy/ws/openjpa-tools/openjpa-fetch-statistics/target/classes>
[INFO] 
[INFO] --- maven-compiler-plugin:3.5.1:testCompile (test-source-compile) @ openjpa-fetch-statistics
---
[INFO] Changes detected - recompiling the module!
[INFO] Compiling 5 source files to <https://builds.apache.org/job/OpenJPA-Trunk-Deploy/ws/openjpa-tools/openjpa-fetch-statistics/target/test-classes>
[INFO] 
[INFO] --- maven-resources-plugin:2.7:testResources (default-testResources) @ openjpa-fetch-statistics
---
[INFO] Using 'UTF-8' encoding to copy filtered resources.
[INFO] Copying 1 resource
[INFO] Copying 3 resources
[INFO] 
[INFO] --- maven-compiler-plugin:3.5.1:testCompile (default-testCompile) @ openjpa-fetch-statistics
---
[INFO] Changes detected - recompiling the module!
[INFO] Compiling 5 source files to <https://builds.apache.org/job/OpenJPA-Trunk-Deploy/ws/openjpa-tools/openjpa-fetch-statistics/target/test-classes>
[INFO] 
[INFO] --- maven-surefire-plugin:2.19.1:test (default-test) @ openjpa-fetch-statistics ---
[INFO] 
[INFO] --- maven-jar-plugin:3.0.2:jar (default-jar) @ openjpa-fetch-statistics ---
[INFO] Building jar: <https://builds.apache.org/job/OpenJPA-Trunk-Deploy/ws/openjpa-tools/openjpa-fetch-statistics/target/openjpa-fetch-statistics-3.0.1-SNAPSHOT.jar>
[INFO] 
[INFO] --- maven-site-plugin:3.5.1:attach-descriptor (attach-descriptor) @ openjpa-fetch-statistics
---
[INFO] 
[INFO] --- maven-jar-plugin:3.0.2:test-jar (attach-tests) @ openjpa-fetch-statistics ---
[INFO] Building jar: <https://builds.apache.org/job/OpenJPA-Trunk-Deploy/ws/openjpa-tools/openjpa-fetch-statistics/target/openjpa-fetch-statistics-3.0.1-SNAPSHOT-tests.jar>
[INFO] 
[INFO] --- apache-rat-plugin:0.11:check (default) @ openjpa-fetch-statistics ---
[INFO] 51 implicit excludes (use -debug for more details).
[INFO] Exclude: **/.*/**
[INFO] Exclude: **/target/**/*
[INFO] 10 resources included (use -debug for more details)
[INFO] Rat check: Summary of files. Unapproved: 0 unknown: 0 generated: 0 approved: 9 licence.
[INFO] 
[INFO] --- maven-install-plugin:2.5.2:install (default-install) @ openjpa-fetch-statistics
---
[INFO] Installing <https://builds.apache.org/job/OpenJPA-Trunk-Deploy/ws/openjpa-tools/openjpa-fetch-statistics/target/openjpa-fetch-statistics-3.0.1-SNAPSHOT.jar>
to /home/jenkins/.m2/repository/org/apache/openjpa/openjpa-fetch-statistics/3.0.1-SNAPSHOT/openjpa-fetch-statistics-3.0.1-SNAPSHOT.jar
[INFO] Installing <https://builds.apache.org/job/OpenJPA-Trunk-Deploy/ws/openjpa-tools/openjpa-fetch-statistics/pom.xml>
to /home/jenkins/.m2/repository/org/apache/openjpa/openjpa-fetch-statistics/3.0.1-SNAPSHOT/openjpa-fetch-statistics-3.0.1-SNAPSHOT.pom
[INFO] Installing <https://builds.apache.org/job/OpenJPA-Trunk-Deploy/ws/openjpa-tools/openjpa-fetch-statistics/target/openjpa-fetch-statistics-3.0.1-SNAPSHOT-tests.jar>
to /home/jenkins/.m2/repository/org/apache/openjpa/openjpa-fetch-statistics/3.0.1-SNAPSHOT/openjpa-fetch-statistics-3.0.1-SNAPSHOT-tests.jar
[INFO] 
[INFO] --- maven-deploy-plugin:2.8.2:deploy (default-deploy) @ openjpa-fetch-statistics ---
Downloading: https://repository.apache.org/content/repositories/snapshots/org/apache/openjpa/openjpa-fetch-statistics/3.0.1-SNAPSHOT/maven-metadata.xml
1004/1004 B                 Downloaded: https://repository.apache.org/content/repositories/snapshots/org/apache/openjpa/openjpa-fetch-statistics/3.0.1-SNAPSHOT/maven-metadata.xml
(1004 B at 1.6 KB/sec)
Uploading: https://repository.apache.org/content/repositories/snapshots/org/apache/openjpa/openjpa-fetch-statistics/3.0.1-SNAPSHOT/openjpa-fetch-statistics-3.0.1-20180815.074540-7.jar
2/19 KB       4/19 KB   6/19 KB   8/19 KB   10/19 KB   12/19 KB   14/19 KB   16/19 KB   18/19
KB   19/19 KB              Uploaded: https://repository.apache.org/content/repositories/snapshots/org/apache/openjpa/openjpa-fetch-statistics/3.0.1-SNAPSHOT/openjpa-fetch-statistics-3.0.1-20180815.074540-7.jar
(19 KB at 18.2 KB/sec)
Uploading: https://repository.apache.org/content/repositories/snapshots/org/apache/openjpa/openjpa-fetch-statistics/3.0.1-SNAPSHOT/openjpa-fetch-statistics-3.0.1-20180815.074540-7.pom
2/4 KB     4/4 KB            Uploaded: https://repository.apache.org/content/repositories/snapshots/org/apache/openjpa/openjpa-fetch-statistics/3.0.1-SNAPSHOT/openjpa-fetch-statistics-3.0.1-20180815.074540-7.pom
(4 KB at 3.3 KB/sec)
Downloading: https://repository.apache.org/content/repositories/snapshots/org/apache/openjpa/openjpa-fetch-statistics/maven-metadata.xml
362/362 B               Downloaded: https://repository.apache.org/content/repositories/snapshots/org/apache/openjpa/openjpa-fetch-statistics/maven-metadata.xml
(362 B at 0.6 KB/sec)
Uploading: https://repository.apache.org/content/repositories/snapshots/org/apache/openjpa/openjpa-fetch-statistics/3.0.1-SNAPSHOT/maven-metadata.xml
1004/1004 B                 Uploaded: https://repository.apache.org/content/repositories/snapshots/org/apache/openjpa/openjpa-fetch-statistics/3.0.1-SNAPSHOT/maven-metadata.xml
(1004 B at 1.1 KB/sec)
Uploading: https://repository.apache.org/content/repositories/snapshots/org/apache/openjpa/openjpa-fetch-statistics/maven-metadata.xml
362/362 B                 Uploaded: https://repository.apache.org/content/repositories/snapshots/org/apache/openjpa/openjpa-fetch-statistics/maven-metadata.xml
(362 B at 0.4 KB/sec)
Uploading: https://repository.apache.org/content/repositories/snapshots/org/apache/openjpa/openjpa-fetch-statistics/3.0.1-SNAPSHOT/openjpa-fetch-statistics-3.0.1-20180815.074540-7-tests.jar
2/15 KB     4/15 KB   6/15 KB   8/15 KB   10/15 KB   12/15 KB   14/15 KB   15/15 KB      
       Uploaded: https://repository.apache.org/content/repositories/snapshots/org/apache/openjpa/openjpa-fetch-statistics/3.0.1-SNAPSHOT/openjpa-fetch-statistics-3.0.1-20180815.074540-7-tests.jar
(15 KB at 14.7 KB/sec)
Uploading: https://repository.apache.org/content/repositories/snapshots/org/apache/openjpa/openjpa-fetch-statistics/3.0.1-SNAPSHOT/maven-metadata.xml
1004/1004 B                 Uploaded: https://repository.apache.org/content/repositories/snapshots/org/apache/openjpa/openjpa-fetch-statistics/3.0.1-SNAPSHOT/maven-metadata.xml
(1004 B at 1.1 KB/sec)
[INFO]                                                                         
[INFO] ------------------------------------------------------------------------
[INFO] Building OpenJPA Fetching Statistic Tool -- WAS Bundle 3.0.1-SNAPSHOT
[INFO] ------------------------------------------------------------------------
[INFO] 
[INFO] --- maven-clean-plugin:3.0.0:clean (default-clean) @ openjpa-fetch-statistics-was ---
[INFO] Deleting <https://builds.apache.org/job/OpenJPA-Trunk-Deploy/ws/openjpa-tools/openjpa-fetch-statistics-was/target>
[INFO] 
[INFO] --- buildnumber-maven-plugin:1.4:create (default) @ openjpa-fetch-statistics-was ---
[INFO] 
[INFO] --- maven-enforcer-plugin:1.4.1:enforce (default) @ openjpa-fetch-statistics-was ---
[INFO] 
[INFO] --- maven-checkstyle-plugin:2.9:checkstyle (default) @ openjpa-fetch-statistics-was
---
[INFO] 
[INFO] --- maven-remote-resources-plugin:1.5:process (process-resource-bundles) @ openjpa-fetch-statistics-was
---
[INFO] 
[INFO] --- maven-resources-plugin:2.7:resources (default-resources) @ openjpa-fetch-statistics-was
---
[INFO] Using 'UTF-8' encoding to copy filtered resources.
[INFO] Copying 1 resource
[INFO] Copying 3 resources
[INFO] 
[INFO] --- maven-compiler-plugin:3.5.1:compile (default-compile) @ openjpa-fetch-statistics-was
---
[INFO] No sources to compile
[INFO] 
[INFO] --- maven-compiler-plugin:3.5.1:testCompile (test-source-compile) @ openjpa-fetch-statistics-was
---
[INFO] No sources to compile
[INFO] 
[INFO] --- maven-resources-plugin:2.7:testResources (default-testResources) @ openjpa-fetch-statistics-was
---
[INFO] Using 'UTF-8' encoding to copy filtered resources.
[INFO] skip non existing resourceDirectory <https://builds.apache.org/job/OpenJPA-Trunk-Deploy/ws/openjpa-tools/openjpa-fetch-statistics-was/src/test/resources>
[INFO] Copying 3 resources
[INFO] 
[INFO] --- maven-compiler-plugin:3.5.1:testCompile (default-testCompile) @ openjpa-fetch-statistics-was
---
[INFO] No sources to compile
[INFO] 
[INFO] --- maven-surefire-plugin:2.19.1:test (default-test) @ openjpa-fetch-statistics-was
---
[INFO] 
[INFO] --- maven-jar-plugin:3.0.2:jar (default-jar) @ openjpa-fetch-statistics-was ---
[INFO] Building jar: <https://builds.apache.org/job/OpenJPA-Trunk-Deploy/ws/openjpa-tools/openjpa-fetch-statistics-was/target/openjpa-fetch-statistics-was-3.0.1-SNAPSHOT.jar>
[INFO] 
[INFO] --- maven-site-plugin:3.5.1:attach-descriptor (attach-descriptor) @ openjpa-fetch-statistics-was
---
[INFO] 
[INFO] --- maven-jar-plugin:3.0.2:test-jar (attach-tests) @ openjpa-fetch-statistics-was ---
[INFO] Building jar: <https://builds.apache.org/job/OpenJPA-Trunk-Deploy/ws/openjpa-tools/openjpa-fetch-statistics-was/target/openjpa-fetch-statistics-was-3.0.1-SNAPSHOT-tests.jar>
[INFO] 
[INFO] --- maven-shade-plugin:1.7.1:shade (default) @ openjpa-fetch-statistics-was ---
[INFO] Including org.apache.openjpa:openjpa-fetch-statistics:jar:3.0.1-SNAPSHOT in the shaded
jar.
[INFO] Excluding org.apache.geronimo.specs:geronimo-jpa_2.1_spec:jar:1.0-alpha-1 from the
shaded jar.
[INFO] Excluding org.apache.geronimo.specs:geronimo-jta_1.1_spec:jar:1.1.1 from the shaded
jar.
[INFO] Excluding org.apache.openjpa:openjpa-kernel:jar:3.0.1-SNAPSHOT from the shaded jar.
[INFO] Excluding org.apache.geronimo.specs:geronimo-jms_1.1_spec:jar:1.1.1 from the shaded
jar.
[INFO] Excluding org.apache.xbean:xbean-asm6-shaded:jar:4.8 from the shaded jar.
[INFO] Excluding org.apache.openjpa:openjpa-lib:jar:3.0.1-SNAPSHOT from the shaded jar.
[INFO] Excluding commons-collections:commons-collections:jar:3.2.2 from the shaded jar.
[INFO] Excluding net.sourceforge.serp:serp:jar:1.15.1 from the shaded jar.
[INFO] Excluding org.apache.openjpa:openjpa-persistence-jdbc:jar:3.0.1-SNAPSHOT from the shaded
jar.
[INFO] Excluding org.apache.openjpa:openjpa-jdbc:jar:3.0.1-SNAPSHOT from the shaded jar.
[INFO] Excluding org.apache.openjpa:openjpa-persistence:jar:3.0.1-SNAPSHOT from the shaded
jar.
[INFO] Excluding commons-pool:commons-pool:jar:1.6 from the shaded jar.
[INFO] Replacing original artifact with shaded artifact.
[INFO] Replacing <https://builds.apache.org/job/OpenJPA-Trunk-Deploy/ws/openjpa-tools/openjpa-fetch-statistics-was/target/openjpa-fetch-statistics-was-3.0.1-SNAPSHOT.jar>
with <https://builds.apache.org/job/OpenJPA-Trunk-Deploy/ws/openjpa-tools/openjpa-fetch-statistics-was/target/openjpa-fetch-statistics-was-3.0.1-SNAPSHOT-shaded.jar>
[INFO] 
[INFO] --- apache-rat-plugin:0.11:check (default) @ openjpa-fetch-statistics-was ---
[INFO] 51 implicit excludes (use -debug for more details).
[INFO] Exclude: **/.*/**
[INFO] Exclude: **/target/**/*
[INFO] 1 resources included (use -debug for more details)
[INFO] Rat check: Summary of files. Unapproved: 0 unknown: 0 generated: 0 approved: 0 licence.
[INFO] 
[INFO] --- maven-install-plugin:2.5.2:install (default-install) @ openjpa-fetch-statistics-was
---
[INFO] Installing <https://builds.apache.org/job/OpenJPA-Trunk-Deploy/ws/openjpa-tools/openjpa-fetch-statistics-was/target/openjpa-fetch-statistics-was-3.0.1-SNAPSHOT.jar>
to /home/jenkins/.m2/repository/org/apache/openjpa/openjpa-fetch-statistics-was/3.0.1-SNAPSHOT/openjpa-fetch-statistics-was-3.0.1-SNAPSHOT.jar
[INFO] Installing <https://builds.apache.org/job/OpenJPA-Trunk-Deploy/ws/openjpa-tools/openjpa-fetch-statistics-was/dependency-reduced-pom.xml>
to /home/jenkins/.m2/repository/org/apache/openjpa/openjpa-fetch-statistics-was/3.0.1-SNAPSHOT/openjpa-fetch-statistics-was-3.0.1-SNAPSHOT.pom
[INFO] Installing <https://builds.apache.org/job/OpenJPA-Trunk-Deploy/ws/openjpa-tools/openjpa-fetch-statistics-was/target/openjpa-fetch-statistics-was-3.0.1-SNAPSHOT-tests.jar>
to /home/jenkins/.m2/repository/org/apache/openjpa/openjpa-fetch-statistics-was/3.0.1-SNAPSHOT/openjpa-fetch-statistics-was-3.0.1-SNAPSHOT-tests.jar
[INFO] 
[INFO] --- maven-deploy-plugin:2.8.2:deploy (default-deploy) @ openjpa-fetch-statistics-was
---
Downloading: https://repository.apache.org/content/repositories/snapshots/org/apache/openjpa/openjpa-fetch-statistics-was/3.0.1-SNAPSHOT/maven-metadata.xml
1008/1008 B                 Downloaded: https://repository.apache.org/content/repositories/snapshots/org/apache/openjpa/openjpa-fetch-statistics-was/3.0.1-SNAPSHOT/maven-metadata.xml
(1008 B at 1.6 KB/sec)
Uploading: https://repository.apache.org/content/repositories/snapshots/org/apache/openjpa/openjpa-fetch-statistics-was/3.0.1-SNAPSHOT/openjpa-fetch-statistics-was-3.0.1-20180815.074547-7.jar
2/21 KB       4/21 KB   6/21 KB   8/21 KB   10/21 KB   12/21 KB   14/21 KB   16/21 KB   18/21
KB   20/21 KB   21/21 KB              Uploaded: https://repository.apache.org/content/repositories/snapshots/org/apache/openjpa/openjpa-fetch-statistics-was/3.0.1-SNAPSHOT/openjpa-fetch-statistics-was-3.0.1-20180815.074547-7.jar
(21 KB at 21.3 KB/sec)
Uploading: https://repository.apache.org/content/repositories/snapshots/org/apache/openjpa/openjpa-fetch-statistics-was/3.0.1-SNAPSHOT/openjpa-fetch-statistics-was-3.0.1-20180815.074547-7.pom
2/4 KB     4/4 KB            Uploaded: https://repository.apache.org/content/repositories/snapshots/org/apache/openjpa/openjpa-fetch-statistics-was/3.0.1-SNAPSHOT/openjpa-fetch-statistics-was-3.0.1-20180815.074547-7.pom
(4 KB at 3.8 KB/sec)
Downloading: https://repository.apache.org/content/repositories/snapshots/org/apache/openjpa/openjpa-fetch-statistics-was/maven-metadata.xml
366/366 B               Downloaded: https://repository.apache.org/content/repositories/snapshots/org/apache/openjpa/openjpa-fetch-statistics-was/maven-metadata.xml
(366 B at 0.6 KB/sec)
Uploading: https://repository.apache.org/content/repositories/snapshots/org/apache/openjpa/openjpa-fetch-statistics-was/3.0.1-SNAPSHOT/maven-metadata.xml
1008/1008 B                 Uploaded: https://repository.apache.org/content/repositories/snapshots/org/apache/openjpa/openjpa-fetch-statistics-was/3.0.1-SNAPSHOT/maven-metadata.xml
(1008 B at 1.0 KB/sec)
Uploading: https://repository.apache.org/content/repositories/snapshots/org/apache/openjpa/openjpa-fetch-statistics-was/maven-metadata.xml
366/366 B                 Uploaded: https://repository.apache.org/content/repositories/snapshots/org/apache/openjpa/openjpa-fetch-statistics-was/maven-metadata.xml
(366 B at 0.4 KB/sec)
Uploading: https://repository.apache.org/content/repositories/snapshots/org/apache/openjpa/openjpa-fetch-statistics-was/3.0.1-SNAPSHOT/openjpa-fetch-statistics-was-3.0.1-20180815.074547-7-tests.jar
2/9 KB      4/9 KB   6/9 KB   8/9 KB   9/9 KB            Uploaded: https://repository.apache.org/content/repositories/snapshots/org/apache/openjpa/openjpa-fetch-statistics-was/3.0.1-SNAPSHOT/openjpa-fetch-statistics-was-3.0.1-20180815.074547-7-tests.jar
(9 KB at 8.8 KB/sec)
Uploading: https://repository.apache.org/content/repositories/snapshots/org/apache/openjpa/openjpa-fetch-statistics-was/3.0.1-SNAPSHOT/maven-metadata.xml
1008/1008 B                 Uploaded: https://repository.apache.org/content/repositories/snapshots/org/apache/openjpa/openjpa-fetch-statistics-was/3.0.1-SNAPSHOT/maven-metadata.xml
(1008 B at 1.1 KB/sec)
[INFO]                                                                         
[INFO] ------------------------------------------------------------------------
[INFO] Building OpenJPA Features 3.0.1-SNAPSHOT
[INFO] ------------------------------------------------------------------------
[INFO] 
[INFO] --- maven-clean-plugin:3.0.0:clean (default-clean) @ openjpa-features ---
[INFO] Deleting <https://builds.apache.org/job/OpenJPA-Trunk-Deploy/ws/openjpa-features/target>
[INFO] 
[INFO] --- buildnumber-maven-plugin:1.4:create (default) @ openjpa-features ---
[INFO] 
[INFO] --- maven-enforcer-plugin:1.4.1:enforce (default) @ openjpa-features ---
[INFO] 
[INFO] --- maven-checkstyle-plugin:2.9:checkstyle (default) @ openjpa-features ---
[INFO] 
[INFO] --- maven-remote-resources-plugin:1.5:process (process-resource-bundles) @ openjpa-features
---
[INFO] 
[INFO] --- karaf-maven-plugin:4.2.0:features-generate-descriptor (compile) @ openjpa-features
---
[ERROR] java.util.NoSuchElementException
      role: org.eclipse.aether.RepositorySystem
  roleHint: 
[INFO] ------------------------------------------------------------------------
[INFO] Reactor Summary:
[INFO] 
[INFO] OpenJPA Parent POM ................................ SUCCESS [22.085s]
[INFO] OpenJPA Utilities Library ......................... SUCCESS [20.162s]
[INFO] OpenJPA Kernel .................................... SUCCESS [18.243s]
[INFO] OpenJPA JDBC ...................................... SUCCESS [14.708s]
[INFO] OpenJPA Persistence ............................... SUCCESS [11.973s]
[INFO] OpenJPA Persistence JDBC .......................... SUCCESS [29:17.454s]
[INFO] OpenJPA Persistence Locking Tests ................. SUCCESS [25:16.542s]
[INFO] OpenJPA tools ..................................... SUCCESS [4.585s]
[INFO] OpenJPA Maven Plugin .............................. SUCCESS [1:16.098s]
[INFO] OpenJPA XML Store ................................. SUCCESS [13.815s]
[INFO] OpenJPA Slice ..................................... SUCCESS [8.918s]
[INFO] OpenJPA JEST ...................................... SUCCESS [22.300s]
[INFO] OpenJPA Aggregate Jar ............................. SUCCESS [11.830s]
[INFO] OpenJPA Aggregate Jar with Dependencies ........... SUCCESS [9.417s]
[INFO] OpenJPA Project Docs and Assemblies ............... SUCCESS [23.006s]
[INFO] OpenJPA Examples .................................. SUCCESS [4.263s]
[INFO] OpenJPA Examples - Simple ......................... SUCCESS [7.280s]
[INFO] OpenJPA Examples - image-gallery .................. SUCCESS [25.079s]
[INFO] OpenJPA Examples - OpenBooks ...................... SUCCESS [6.441s]
[INFO] OpenJPA Integration Tests ......................... SUCCESS [0.171s]
[INFO] OpenJPA Integration Tests - Daytrader ............. SUCCESS [4.767s]
[INFO] OpenJPA Integration Tests - Examples .............. SUCCESS [0.058s]
[INFO] OpenJPA Integration Tests - SLF4JLogFactory ....... SUCCESS [0.418s]
[INFO] OpenJPA Integration Tests - JPA TCK ............... SUCCESS [0.081s]
[INFO] OpenJPA Integration Tests - Bean Validation ....... SUCCESS [2.538s]
[INFO] OpenJPA Integration Tests - JMX Platform MBeans ... SUCCESS [26.058s]
[INFO] OpenJPA Fetching Statistic Tool ................... SUCCESS [7.326s]
[INFO] OpenJPA Fetching Statistic Tool -- WAS Bundle ..... SUCCESS [7.603s]
[INFO] OpenJPA Features .................................. FAILURE [4.891s]
[INFO] ------------------------------------------------------------------------
[INFO] BUILD FAILURE
[INFO] ------------------------------------------------------------------------
[INFO] Total time: 1:00:29.374s
[INFO] Finished at: Wed Aug 15 07:45:58 UTC 2018
[INFO] Final Memory: 212M/5055M
[INFO] ------------------------------------------------------------------------
[ERROR] Failed to execute goal org.apache.karaf.tooling:karaf-maven-plugin:4.2.0:features-generate-descriptor
(compile) on project openjpa-features: Unable to create features.xml file: org.apache.maven.plugin.MojoExecutionException:
java.util.NoSuchElementException
[ERROR] role: org.eclipse.aether.RepositorySystem
[ERROR] roleHint:
[ERROR] -> [Help 1]
[ERROR] 
[ERROR] To see the full stack trace of the errors, re-run Maven with the -e switch.
[ERROR] Re-run Maven using the -X switch to enable full debug logging.
[ERROR] 
[ERROR] For more information about the errors and possible solutions, please read the following
articles:
[ERROR] [Help 1] http://cwiki.apache.org/confluence/display/MAVEN/MojoExecutionException
[ERROR] 
[ERROR] After correcting the problems, you can resume the build with the command
[ERROR]   mvn <goals> -rf :openjpa-features
Build step 'Execute shell' marked build as failure
Archiving artifacts
Setting ANT_1_9_7_HOME=/home/jenkins/tools/ant/apache-ant-1.9.7
Setting MAVEN_3_0_4_HOME=/home/jenkins/tools/maven/apache-maven-3.0.4
Setting JDK_1_8_LATEST__HOME=/home/jenkins/tools/java/latest1.8
Recording test results
Setting ANT_1_9_7_HOME=/home/jenkins/tools/ant/apache-ant-1.9.7
Setting MAVEN_3_0_4_HOME=/home/jenkins/tools/maven/apache-maven-3.0.4
Setting JDK_1_8_LATEST__HOME=/home/jenkins/tools/java/latest1.8
Setting ANT_1_9_7_HOME=/home/jenkins/tools/ant/apache-ant-1.9.7
Setting MAVEN_3_0_4_HOME=/home/jenkins/tools/maven/apache-maven-3.0.4
Setting JDK_1_8_LATEST__HOME=/home/jenkins/tools/java/latest1.8

Mime
View raw message