phoenix-dev mailing list archives

Site index · List index
Message view « Date » · « Thread »
Top « Date » · « Thread »
From Mujtaba Chohan <mujt...@apache.org>
Subject Re: Build failed in Jenkins: Phoenix-4.x-HBase-1.0 #206
Date Tue, 03 Nov 2015 21:04:11 GMT
Cody - Is this NPE in Pherf test related to your change?


On Mon, Nov 2, 2015 at 5:58 PM, Apache Jenkins Server <
jenkins@builds.apache.org> wrote:

> See <https://builds.apache.org/job/Phoenix-4.x-HBase-1.0/206/changes>
>
> Changes:
>
> [cmarcel] PHOENIX-2366 - Pherf NPE on Data loader
>
> ------------------------------------------
> [...truncated 1873 lines...]
> Downloading:
> https://oss.sonatype.org/content/repositories/snapshots/commons-io/commons-io/maven-metadata.xml
> Downloading:
> https://repository.apache.org/content/repositories/snapshots/commons-io/commons-io/maven-metadata.xml
> 725/725 B
> 374/374 B   725/725 B
>
> Downloading:
> http://repository.apache.org/snapshots/commons-io/commons-io/maven-metadata.xml
>
> Downloaded:
> https://repository.apache.org/content/repositories/releases/commons-io/commons-io/maven-metadata.xml
> (725 B at 3.7 KB/sec)
> 374/374 B   350/350 B
> Downloading:
> http://repo.maven.apache.org/maven2/commons-io/commons-io/maven-metadata.xml
>
> Downloaded:
> https://repository.apache.org/content/repositories/snapshots/commons-io/commons-io/maven-metadata.xml
> (374 B at 1.8 KB/sec)
>
>
> Downloaded:
> http://repository.apache.org/snapshots/commons-io/commons-io/maven-metadata.xml
> (350 B at 4.2 KB/sec)
> 725/725 B
>
> Downloaded:
> http://repo.maven.apache.org/maven2/commons-io/commons-io/maven-metadata.xml
> (725 B at 13.4 KB/sec)
> Downloading:
> http://conjars.org/repo/commons-io/commons-io/2.5-SNAPSHOT/maven-metadata.xml
> Downloading:
> https://repository.apache.org/content/repositories/releases/commons-io/commons-io/2.5-SNAPSHOT/maven-metadata.xml
> Downloading:
> https://oss.sonatype.org/content/repositories/snapshots/commons-io/commons-io/2.5-SNAPSHOT/maven-metadata.xml
> Downloading:
> https://repository.apache.org/content/repositories/snapshots/commons-io/commons-io/2.5-SNAPSHOT/maven-metadata.xml
>
> 3/3 KB
> Downloading:
> http://repository.apache.org/snapshots/commons-io/commons-io/2.5-SNAPSHOT/maven-metadata.xml
> 3/3 KB   3/3 KB
>
> Downloaded:
> http://repository.apache.org/snapshots/commons-io/commons-io/2.5-SNAPSHOT/maven-metadata.xml
> (3 KB at 30.6 KB/sec)
>
>
> Downloaded:
> https://repository.apache.org/content/repositories/snapshots/commons-io/commons-io/2.5-SNAPSHOT/maven-metadata.xml
> (3 KB at 16.6 KB/sec)
>
> Downloading:
> https://repository.apache.org/content/repositories/snapshots/commons-io/commons-io/2.6-SNAPSHOT/maven-metadata.xml
> Downloading:
> http://conjars.org/repo/commons-io/commons-io/2.6-SNAPSHOT/maven-metadata.xml
> Downloading:
> https://repository.apache.org/content/repositories/releases/commons-io/commons-io/2.6-SNAPSHOT/maven-metadata.xml
> Downloading:
> https://oss.sonatype.org/content/repositories/snapshots/commons-io/commons-io/2.6-SNAPSHOT/maven-metadata.xml
>
> Downloading:
> http://repository.apache.org/snapshots/commons-io/commons-io/2.6-SNAPSHOT/maven-metadata.xml
> 3/3 KB
> 3/3 KB   3/3 KB
>
> Downloaded:
> http://repository.apache.org/snapshots/commons-io/commons-io/2.6-SNAPSHOT/maven-metadata.xml
> (3 KB at 27.2 KB/sec)
>
>
> Downloaded:
> https://repository.apache.org/content/repositories/snapshots/commons-io/commons-io/2.6-SNAPSHOT/maven-metadata.xml
> (3 KB at 10.6 KB/sec)
>
> [INFO]
> [INFO] --- maven-clean-plugin:2.5:clean (default-clean) @ phoenix-pherf ---
> [INFO]
> [INFO] --- maven-checkstyle-plugin:2.13:check (validate) @ phoenix-pherf
> ---
> [INFO]
> [INFO] --- build-helper-maven-plugin:1.9.1:add-test-source
> (add-test-source) @ phoenix-pherf ---
> [INFO] Test Source directory: <
> https://builds.apache.org/job/Phoenix-4.x-HBase-1.0/ws/phoenix-pherf/src/it/java>
> added.
> [INFO]
> [INFO] --- build-helper-maven-plugin:1.9.1:add-test-resource
> (add-test-resource) @ phoenix-pherf ---
> [INFO]
> [INFO] --- maven-remote-resources-plugin:1.5:process (default) @
> phoenix-pherf ---
> [INFO] artifact junit:junit-dep: checking for updates from apache release
> [INFO] artifact junit:junit-dep: checking for updates from conjars.org
> [INFO] artifact junit:junit-dep: checking for updates from apache snapshot
> [INFO] artifact junit:junit-dep: checking for updates from
> sonatype-nexus-snapshots
> [INFO] artifact junit:junit-dep: checking for updates from central
> [INFO] artifact junit:junit: checking for updates from apache release
> [INFO] artifact junit:junit: checking for updates from conjars.org
> [INFO] artifact junit:junit: checking for updates from apache snapshot
> [INFO] artifact junit:junit: checking for updates from
> sonatype-nexus-snapshots
> [INFO] artifact junit:junit: checking for updates from central
> [INFO] artifact commons-io:commons-io: checking for updates from apache
> release
> [INFO] artifact commons-io:commons-io: checking for updates from
> conjars.org
> [INFO] artifact commons-io:commons-io: checking for updates from apache
> snapshot
> [INFO] artifact commons-io:commons-io: checking for updates from
> sonatype-nexus-snapshots
> [INFO] artifact commons-io:commons-io: checking for updates from central
> [INFO]
> [INFO] --- maven-resources-plugin:2.6:resources (default-resources) @
> phoenix-pherf ---
> [INFO] Using 'UTF-8' encoding to copy filtered resources.
> [INFO] Copying 3 resources
> [INFO] Copying 5 resources
> [INFO] Copying 3 resources
> [INFO]
> [INFO] --- maven-compiler-plugin:3.0:compile (default-compile) @
> phoenix-pherf ---
> [INFO] Changes detected - recompiling the module!
> [INFO] Compiling 65 source files to <
> https://builds.apache.org/job/Phoenix-4.x-HBase-1.0/ws/phoenix-pherf/target/classes
> >
> [WARNING] <
> https://builds.apache.org/job/Phoenix-4.x-HBase-1.0/ws/phoenix-pherf/src/main/java/org/apache/phoenix/pherf/jmx/monitors/TotalMemoryMonitor.java>:
> Some input files use unchecked or unsafe operations.
> [WARNING] <
> https://builds.apache.org/job/Phoenix-4.x-HBase-1.0/ws/phoenix-pherf/src/main/java/org/apache/phoenix/pherf/jmx/monitors/TotalMemoryMonitor.java>:
> Recompile with -Xlint:unchecked for details.
> [INFO]
> [INFO] --- maven-dependency-plugin:2.1:build-classpath
> (create-mrapp-generated-classpath) @ phoenix-pherf ---
> [INFO] Wrote classpath file '<
> https://builds.apache.org/job/Phoenix-4.x-HBase-1.0/ws/phoenix-pherf/target/classes/mrapp-generated-classpath'
> .>
> [INFO]
> [INFO] --- maven-resources-plugin:2.6:testResources
> (default-testResources) @ phoenix-pherf ---
> [INFO] Using 'UTF-8' encoding to copy filtered resources.
> [INFO] Copying 5 resources
> [INFO] Copying 5 resources
> [INFO] skip non existing resourceDirectory <
> https://builds.apache.org/job/Phoenix-4.x-HBase-1.0/ws/phoenix-pherf/src/it/resources
> >
> [INFO] Copying 3 resources
> [INFO]
> [INFO] --- maven-compiler-plugin:3.0:testCompile (default-testCompile) @
> phoenix-pherf ---
> [INFO] Changes detected - recompiling the module!
> [INFO] Compiling 13 source files to <
> https://builds.apache.org/job/Phoenix-4.x-HBase-1.0/ws/phoenix-pherf/target/test-classes
> >
> [WARNING] <
> https://builds.apache.org/job/Phoenix-4.x-HBase-1.0/ws/phoenix-pherf/src/test/java/org/apache/phoenix/pherf/RowCalculatorTest.java>:
> <
> https://builds.apache.org/job/Phoenix-4.x-HBase-1.0/ws/phoenix-pherf/src/test/java/org/apache/phoenix/pherf/RowCalculatorTest.java>
> uses or overrides a deprecated API.
> [WARNING] <
> https://builds.apache.org/job/Phoenix-4.x-HBase-1.0/ws/phoenix-pherf/src/test/java/org/apache/phoenix/pherf/RowCalculatorTest.java>:
> Recompile with -Xlint:deprecation for details.
> [WARNING] <
> https://builds.apache.org/job/Phoenix-4.x-HBase-1.0/ws/phoenix-pherf/src/test/java/org/apache/phoenix/pherf/ResultTest.java>:
> Some input files use unchecked or unsafe operations.
> [WARNING] <
> https://builds.apache.org/job/Phoenix-4.x-HBase-1.0/ws/phoenix-pherf/src/test/java/org/apache/phoenix/pherf/ResultTest.java>:
> Recompile with -Xlint:unchecked for details.
> [INFO]
> [INFO] --- maven-surefire-plugin:2.18:test (default-test) @ phoenix-pherf
> ---
> [INFO] Surefire report directory: <
> https://builds.apache.org/job/Phoenix-4.x-HBase-1.0/ws/phoenix-pherf/target/surefire-reports
> >
>
> -------------------------------------------------------
>  T E S T S
> -------------------------------------------------------
> Running org.apache.phoenix.pherf.ResourceTest
> Tests run: 3, Failures: 0, Errors: 0, Skipped: 0, Time elapsed: 0.683 sec
> - in org.apache.phoenix.pherf.ResourceTest
> Running org.apache.phoenix.pherf.ConfigurationParserTest
> Tests run: 2, Failures: 0, Errors: 0, Skipped: 0, Time elapsed: 0.526 sec
> - in org.apache.phoenix.pherf.ConfigurationParserTest
> Running org.apache.phoenix.pherf.RuleGeneratorTest
> Tests run: 5, Failures: 0, Errors: 0, Skipped: 0, Time elapsed: 1.723 sec
> - in org.apache.phoenix.pherf.RuleGeneratorTest
> Running org.apache.phoenix.pherf.ResultTest
> Tests run: 4, Failures: 0, Errors: 0, Skipped: 0, Time elapsed: 4.369 sec
> - in org.apache.phoenix.pherf.ResultTest
> Running org.apache.phoenix.pherf.RowCalculatorTest
> Tests run: 4, Failures: 0, Errors: 0, Skipped: 0, Time elapsed: 0.003 sec
> - in org.apache.phoenix.pherf.RowCalculatorTest
> Running org.apache.phoenix.pherf.PherfTest
> Tests run: 2, Failures: 0, Errors: 0, Skipped: 0, Time elapsed: 0.426 sec
> - in org.apache.phoenix.pherf.PherfTest
> Running org.apache.phoenix.pherf.TestHBaseProps
> Tests run: 1, Failures: 0, Errors: 0, Skipped: 0, Time elapsed: 0.107 sec
> - in org.apache.phoenix.pherf.TestHBaseProps
> Running org.apache.phoenix.pherf.ColumnTest
> Tests run: 1, Failures: 0, Errors: 0, Skipped: 0, Time elapsed: 0 sec - in
> org.apache.phoenix.pherf.ColumnTest
>
> Results :
>
>
>
>
> Tests run: 22, Failures: 0, Errors: 0, Skipped: 0
>
> [INFO]
> [INFO] --- maven-source-plugin:2.2.1:jar-no-fork (attach-sources) @
> phoenix-pherf ---
> [INFO] Building jar: <
> https://builds.apache.org/job/Phoenix-4.x-HBase-1.0/206/artifact/phoenix-pherf/target/phoenix-pherf-4.7.0-HBase-1.0-SNAPSHOT-sources.jar
> >
> [INFO]
> [INFO] --- maven-jar-plugin:2.4:test-jar (default) @ phoenix-pherf ---
> [INFO] Building jar: <
> https://builds.apache.org/job/Phoenix-4.x-HBase-1.0/206/artifact/phoenix-pherf/target/phoenix-pherf-4.7.0-HBase-1.0-SNAPSHOT-tests.jar
> >
> [INFO]
> [INFO] --- maven-jar-plugin:2.4:jar (default-jar) @ phoenix-pherf ---
> [INFO] Building jar: <
> https://builds.apache.org/job/Phoenix-4.x-HBase-1.0/206/artifact/phoenix-pherf/target/phoenix-pherf-4.7.0-HBase-1.0-SNAPSHOT.jar
> >
> [INFO]
> [INFO] --- maven-site-plugin:3.2:attach-descriptor (attach-descriptor) @
> phoenix-pherf ---
> [INFO]
> [INFO] --- maven-assembly-plugin:2.5.2:single (make-dependency-jar) @
> phoenix-pherf ---
> [INFO] artifact junit:junit-dep: checking for updates from apache release
> [INFO] artifact junit:junit-dep: checking for updates from conjars.org
> [INFO] artifact junit:junit-dep: checking for updates from apache snapshot
> [INFO] artifact junit:junit-dep: checking for updates from
> sonatype-nexus-snapshots
> [INFO] artifact junit:junit-dep: checking for updates from central
> [INFO] artifact junit:junit: checking for updates from apache release
> [INFO] artifact junit:junit: checking for updates from conjars.org
> [INFO] artifact junit:junit: checking for updates from apache snapshot
> [INFO] artifact junit:junit: checking for updates from
> sonatype-nexus-snapshots
> [INFO] artifact junit:junit: checking for updates from central
> [INFO] artifact commons-io:commons-io: checking for updates from apache
> release
> [INFO] artifact commons-io:commons-io: checking for updates from
> conjars.org
> [INFO] artifact commons-io:commons-io: checking for updates from apache
> snapshot
> [INFO] artifact commons-io:commons-io: checking for updates from
> sonatype-nexus-snapshots
> [INFO] artifact commons-io:commons-io: checking for updates from central
> [INFO] Building jar: <
> https://builds.apache.org/job/Phoenix-4.x-HBase-1.0/206/artifact/phoenix-pherf/target/phoenix-pherf-4.7.0-HBase-1.0-SNAPSHOT-jar-with-dependencies.jar
> >
> [INFO]
> [INFO] --- maven-assembly-plugin:2.5.2:single (make-assembly) @
> phoenix-pherf ---
> [INFO] Reading assembly descriptor: src/main/assembly/minimal.xml
> [INFO] Reading assembly descriptor: src/main/assembly/standalone.xml
> [INFO] Reading assembly descriptor: src/main/assembly/cluster.xml
> [INFO] artifact junit:junit-dep: checking for updates from apache release
> [INFO] artifact junit:junit-dep: checking for updates from conjars.org
> [INFO] artifact junit:junit-dep: checking for updates from apache snapshot
> [INFO] artifact junit:junit-dep: checking for updates from
> sonatype-nexus-snapshots
> [INFO] artifact junit:junit-dep: checking for updates from central
> [INFO] artifact junit:junit: checking for updates from apache release
> [INFO] artifact junit:junit: checking for updates from conjars.org
> [INFO] artifact junit:junit: checking for updates from apache snapshot
> [INFO] artifact junit:junit: checking for updates from
> sonatype-nexus-snapshots
> [INFO] artifact junit:junit: checking for updates from central
> [INFO] artifact commons-io:commons-io: checking for updates from apache
> release
> [INFO] artifact commons-io:commons-io: checking for updates from
> conjars.org
> [INFO] artifact commons-io:commons-io: checking for updates from apache
> snapshot
> [INFO] artifact commons-io:commons-io: checking for updates from
> sonatype-nexus-snapshots
> [INFO] artifact commons-io:commons-io: checking for updates from central
> [INFO] Building jar: <
> https://builds.apache.org/job/Phoenix-4.x-HBase-1.0/206/artifact/phoenix-pherf/target/phoenix-pherf-4.7.0-HBase-1.0-SNAPSHOT-minimal.jar
> >
> [INFO] Building zip: <
> https://builds.apache.org/job/Phoenix-4.x-HBase-1.0/ws/phoenix-pherf/target/phoenix-pherf-4.7.0-HBase-1.0-SNAPSHOT-standalone.zip
> >
> [INFO] Building zip: <
> https://builds.apache.org/job/Phoenix-4.x-HBase-1.0/ws/phoenix-pherf/target/phoenix-pherf-4.7.0-HBase-1.0-SNAPSHOT-cluster.zip
> >
> [INFO]
> [INFO] --- maven-failsafe-plugin:2.18:integration-test
> (ClientManagedTimeTests) @ phoenix-pherf ---
> [INFO] Failsafe report directory: <
> https://builds.apache.org/job/Phoenix-4.x-HBase-1.0/ws/phoenix-pherf/target/failsafe-reports
> >
> [INFO] parallel='none', perCoreThreadCount=true, threadCount=0,
> useUnlimitedThreads=false, threadCountSuites=0, threadCountClasses=0,
> threadCountMethods=0, parallelOptimized=true
>
> -------------------------------------------------------
>  T E S T S
> -------------------------------------------------------
>
> Results :
>
>
>
>
> Tests run: 0, Failures: 0, Errors: 0, Skipped: 0
>
> [INFO]
> [INFO] --- maven-failsafe-plugin:2.18:integration-test
> (HBaseManagedTimeTests) @ phoenix-pherf ---
> [INFO] Failsafe report directory: <
> https://builds.apache.org/job/Phoenix-4.x-HBase-1.0/ws/phoenix-pherf/target/failsafe-reports
> >
> [INFO] parallel='none', perCoreThreadCount=true, threadCount=0,
> useUnlimitedThreads=false, threadCountSuites=0, threadCountClasses=0,
> threadCountMethods=0, parallelOptimized=true
>
> -------------------------------------------------------
>  T E S T S
> -------------------------------------------------------
> Running org.apache.phoenix.pherf.PherfMainIT
> Running org.apache.phoenix.pherf.SchemaReaderIT
> Running org.apache.phoenix.pherf.DataIngestIT
> Tests run: 1, Failures: 0, Errors: 0, Skipped: 0, Time elapsed: 14.988 sec
> - in org.apache.phoenix.pherf.SchemaReaderIT
> Tests run: 1, Failures: 0, Errors: 0, Skipped: 0, Time elapsed: 35.162 sec
> - in org.apache.phoenix.pherf.PherfMainIT
> Tests run: 4, Failures: 0, Errors: 0, Skipped: 0, Time elapsed: 43.942 sec
> - in org.apache.phoenix.pherf.DataIngestIT
> [INFO]
> ------------------------------------------------------------------------
> [INFO] Reactor Summary:
> [INFO]
> [INFO] Apache Phoenix .................................... SUCCESS [4.038s]
> [INFO] Phoenix Core ...................................... SUCCESS
> [43:21.063s]
> [INFO] Phoenix - Flume ................................... SUCCESS
> [1:02.483s]
> [INFO] Phoenix - Pig ..................................... SUCCESS
> [1:54.032s]
> [INFO] Phoenix Query Server Client ....................... SUCCESS [1.096s]
> [INFO] Phoenix Query Server .............................. SUCCESS
> [1:55.052s]
> [INFO] Phoenix - Pherf ................................... FAILURE
> [1:56.713s]
> [INFO] Phoenix - Spark ................................... SKIPPED
> [INFO] Phoenix Assembly .................................. SKIPPED
> [INFO] Phoenix - Tracing Web Application ................. SKIPPED
> [INFO]
> ------------------------------------------------------------------------
> [INFO] BUILD FAILURE
> [INFO]
> ------------------------------------------------------------------------
> [INFO] Total time: 50:15.149s
> [INFO] Finished at: Tue Nov 03 01:55:10 UTC 2015
> [INFO] Final Memory: 93M/884M
> [INFO]
> ------------------------------------------------------------------------
> [ERROR] Failed to execute goal
> org.apache.maven.plugins:maven-failsafe-plugin:2.18:integration-test
> (HBaseManagedTimeTests) on project phoenix-pherf: Execution
> HBaseManagedTimeTests of goal
> org.apache.maven.plugins:maven-failsafe-plugin:2.18:integration-test
> failed. NullPointerException -> [Help 1]
> [ERROR]
> [ERROR] To see the full stack trace of the errors, re-run Maven with the
> -e switch.
> [ERROR] Re-run Maven using the -X switch to enable full debug logging.
> [ERROR]
> [ERROR] For more information about the errors and possible solutions,
> please read the following articles:
> [ERROR] [Help 1]
> http://cwiki.apache.org/confluence/display/MAVEN/PluginExecutionException
> [ERROR]
> [ERROR] After correcting the problems, you can resume the build with the
> command
> [ERROR]   mvn <goals> -rf :phoenix-pherf
> Build step 'Invoke top-level Maven targets' marked build as failure
> Archiving artifacts
> Compressed 1.03 GB of artifacts by 46.8% relative to #204
> Recording test results
>

Mime
  • Unnamed multipart/alternative (inline, None, 0 bytes)
View raw message