pirk-dev mailing list archives

Site index · List index
Message view « Date » · « Thread »
Top « Date » · « Thread »
From Apache Jenkins Server <jenk...@builds.apache.org>
Subject Build failed in Jenkins: pirk #63
Date Wed, 19 Apr 2017 02:53:21 GMT
See <https://builds.apache.org/job/pirk/63/display/redirect?page=changes>

Changes:

[josh.elser] Pirk has retired

------------------------------------------
Started by an SCM change
[EnvInject] - Loading node environment variables.
Building remotely on H15 (ubuntu xenial) in workspace <https://builds.apache.org/job/pirk/ws/>
Cloning the remote Git repository
Cloning repository git://git.apache.org/incubator-pirk.git/
 > git init <https://builds.apache.org/job/pirk/ws/> # timeout=10
Fetching upstream changes from git://git.apache.org/incubator-pirk.git/
 > git --version # timeout=10
 > git fetch --tags --progress git://git.apache.org/incubator-pirk.git/ +refs/heads/*:refs/remotes/origin/*
 > git config remote.origin.url git://git.apache.org/incubator-pirk.git/ # timeout=10
 > git config --add remote.origin.fetch +refs/heads/*:refs/remotes/origin/* # timeout=10
 > git config remote.origin.url git://git.apache.org/incubator-pirk.git/ # timeout=10
Fetching upstream changes from git://git.apache.org/incubator-pirk.git/
 > git fetch --tags --progress git://git.apache.org/incubator-pirk.git/ +refs/heads/*:refs/remotes/origin/*
 > git rev-parse refs/remotes/origin/master^{commit} # timeout=10
 > git rev-parse refs/remotes/origin/origin/master^{commit} # timeout=10
Checking out Revision d17a9f6de3bf77a053b495a225897791d251d295 (refs/remotes/origin/master)
 > git config core.sparsecheckout # timeout=10
 > git checkout -f d17a9f6de3bf77a053b495a225897791d251d295
 > git rev-list 5169e683680df194e841a65eaa0a373c102aa608 # timeout=10
Parsing POMs
Modules changed, recalculating dependency graph
Established TCP socket on 42920
maven3-agent.jar already up to date
maven3-interceptor.jar already up to date
maven3-interceptor-commons.jar already up to date
[pirk] $ /home/jenkins/tools/java/latest1.8/bin/java -Xmx2g -Xms256m -cp /home/jenkins/jenkins-slave/maven3-agent.jar:/home/jenkins/tools/maven/apache-maven-3.0.4/boot/plexus-classworlds-2.4.jar
org.jvnet.hudson.maven3.agent.Maven3Main /home/jenkins/tools/maven/apache-maven-3.0.4 /home/jenkins/jenkins-slave/slave.jar
/home/jenkins/jenkins-slave/maven3-interceptor.jar /home/jenkins/jenkins-slave/maven3-interceptor-commons.jar
42920
<===[JENKINS REMOTING CAPACITY]===>   channel started
Executing Maven:  -B -f <https://builds.apache.org/job/pirk/ws/pom.xml> -Dmaven.repo.local=/home/jenkins/jenkins-slave/maven-repositories/1
install
[INFO] Scanning for projects...
[INFO]                                                                         
[INFO] ------------------------------------------------------------------------
[INFO] Building Apache Pirk (incubating) Project 0.2.0-incubating-SNAPSHOT
[INFO] ------------------------------------------------------------------------
[INFO] 
[INFO] --- apache-rat-plugin:0.12:check (default) @ apache-pirk ---
[INFO] Enabled default license matchers.
[INFO] Will parse SCM ignores for exclusions...
[INFO] Parsing exclusions from <https://builds.apache.org/job/pirk/ws/.gitignore>
[INFO] Finished adding exclusions from SCM ignore files.
[INFO] 74 implicit excludes (use -debug for more details).
[INFO] Exclude: .travis.yml
[INFO] Exclude: findbugs-exclude.xml
[INFO] Exclude: KEYS
[INFO] Exclude: eclipse*.xml
[INFO] Exclude: docs/*
[INFO] Exclude: logs/*
[INFO] Exclude: **/m2.conf
[INFO] Exclude: src/main/resources/META-INF/**
[INFO] 586 resources included (use -debug for more details)
[INFO] Rat check: Summary over all files. Unapproved: 1, unknown: 1, generated: 0, approved:
136 licenses.
[INFO] ------------------------------------------------------------------------
[INFO] BUILD FAILURE
[INFO] ------------------------------------------------------------------------
[INFO] Total time: 4.569s
[INFO] Finished at: Wed Apr 19 02:53:17 UTC 2017
[INFO] Final Memory: 27M/444M
[INFO] ------------------------------------------------------------------------
Waiting for Jenkins to finish collecting data[ERROR] Failed to execute goal org.apache.rat:apache-rat-plugin:0.12:check
(default) on project apache-pirk: Too many files with unapproved license: 1 See RAT report
in: <https://builds.apache.org/job/pirk/ws/target/rat.txt> -> [Help 1]
[ERROR] 
[ERROR] To see the full stack trace of the errors, re-run Maven with the -e switch.
[ERROR] Re-run Maven using the -X switch to enable full debug logging.
[ERROR] 
[ERROR] For more information about the errors and possible solutions, please read the following
articles:
[ERROR] [Help 1] http://cwiki.apache.org/confluence/display/MAVEN/MojoFailureException

[JENKINS] Archiving <https://builds.apache.org/job/pirk/ws/pom.xml> to org.apache.pirk/apache-pirk/0.2.0-incubating-SNAPSHOT/apache-pirk-0.2.0-incubating-SNAPSHOT.pom
Sending e-mails to: eawilliams@apache.org dev@pirk.incubator.apache.org
channel stopped

Mime
View raw message