pivot-dev mailing list archives

Site index · List index
Message view « Date » · « Thread »
Top « Date » · « Thread »
From Apache Jenkins Server <jenk...@builds.apache.org>
Subject Build failed in Jenkins: Pivot-trunk on Java 7 #1226
Date Mon, 15 May 2017 06:37:52 GMT
See <https://builds.apache.org/job/Pivot-trunk%20on%20Java%207/1226/display/redirect?page=changes>

Changes:

[rwhitcomb] Tweak some line wrapping and do a static import to reduce line length.

------------------------------------------
[...truncated 53.09 KB...]
    [junit] 	at java.lang.ClassLoader.defineClass1(Native Method)
    [junit] 	at java.lang.ClassLoader.defineClass(ClassLoader.java:800)
    [junit] 	at java.security.SecureClassLoader.defineClass(SecureClassLoader.java:142)
    [junit] 	at java.net.URLClassLoader.defineClass(URLClassLoader.java:449)
    [junit] 	at java.net.URLClassLoader.access$100(URLClassLoader.java:71)
    [junit] 	at java.net.URLClassLoader$1.run(URLClassLoader.java:361)
    [junit] 	at java.net.URLClassLoader$1.run(URLClassLoader.java:355)
    [junit] 	at java.security.AccessController.doPrivileged(Native Method)
    [junit] 	at java.net.URLClassLoader.findClass(URLClassLoader.java:354)
    [junit] 	at java.lang.ClassLoader.loadClass(ClassLoader.java:425)
    [junit] 	at sun.misc.Launcher$AppClassLoader.loadClass(Launcher.java:308)
    [junit] 	at java.lang.ClassLoader.loadClass(ClassLoader.java:358)
    [junit] 	at java.lang.reflect.Constructor.newInstance(Constructor.java:526)
    [junit] Caused by: java.lang.ClassNotFoundException: org.hamcrest.SelfDescribing
    [junit] 	at java.net.URLClassLoader$1.run(URLClassLoader.java:366)
    [junit] 	at java.net.URLClassLoader$1.run(URLClassLoader.java:355)
    [junit] 	at java.security.AccessController.doPrivileged(Native Method)
    [junit] 	at java.net.URLClassLoader.findClass(URLClassLoader.java:354)
    [junit] 	at java.lang.ClassLoader.loadClass(ClassLoader.java:425)
    [junit] 	at sun.misc.Launcher$AppClassLoader.loadClass(Launcher.java:308)
    [junit] 	at java.lang.ClassLoader.loadClass(ClassLoader.java:358)
    [junit] 
    [junit] 
    [junit] Test org.apache.pivot.serialization.test.StringSerializerTest FAILED
    [junit] Testsuite: org.apache.pivot.util.concurrent.test.TaskTest
    [junit] Tests run: 1, Failures: 0, Errors: 1, Skipped: 0, Time elapsed: 0.016 sec
    [junit] 
    [junit] Testcase: initializationError(org.apache.pivot.util.concurrent.test.TaskTest):
Caused an ERROR
    [junit] org/hamcrest/SelfDescribing
    [junit] java.lang.NoClassDefFoundError: org/hamcrest/SelfDescribing
    [junit] 	at java.lang.ClassLoader.defineClass1(Native Method)
    [junit] 	at java.lang.ClassLoader.defineClass(ClassLoader.java:800)
    [junit] 	at java.security.SecureClassLoader.defineClass(SecureClassLoader.java:142)
    [junit] 	at java.net.URLClassLoader.defineClass(URLClassLoader.java:449)
    [junit] 	at java.net.URLClassLoader.access$100(URLClassLoader.java:71)
    [junit] 	at java.net.URLClassLoader$1.run(URLClassLoader.java:361)
    [junit] 	at java.net.URLClassLoader$1.run(URLClassLoader.java:355)
    [junit] 	at java.security.AccessController.doPrivileged(Native Method)
    [junit] 	at java.net.URLClassLoader.findClass(URLClassLoader.java:354)
    [junit] 	at java.lang.ClassLoader.loadClass(ClassLoader.java:425)
    [junit] 	at sun.misc.Launcher$AppClassLoader.loadClass(Launcher.java:308)
    [junit] 	at java.lang.ClassLoader.loadClass(ClassLoader.java:358)
    [junit] 	at java.lang.reflect.Constructor.newInstance(Constructor.java:526)
    [junit] Caused by: java.lang.ClassNotFoundException: org.hamcrest.SelfDescribing
    [junit] 	at java.net.URLClassLoader$1.run(URLClassLoader.java:366)
    [junit] 	at java.net.URLClassLoader$1.run(URLClassLoader.java:355)
    [junit] 	at java.security.AccessController.doPrivileged(Native Method)
    [junit] 	at java.net.URLClassLoader.findClass(URLClassLoader.java:354)
    [junit] 	at java.lang.ClassLoader.loadClass(ClassLoader.java:425)
    [junit] 	at sun.misc.Launcher$AppClassLoader.loadClass(Launcher.java:308)
    [junit] 	at java.lang.ClassLoader.loadClass(ClassLoader.java:358)
    [junit] 
    [junit] 
    [junit] Test org.apache.pivot.util.concurrent.test.TaskTest FAILED
    [junit] Testsuite: org.apache.pivot.util.test.MIMETypeTest
    [junit] Tests run: 1, Failures: 0, Errors: 1, Skipped: 0, Time elapsed: 0.017 sec
    [junit] 
    [junit] Testcase: initializationError(org.apache.pivot.util.test.MIMETypeTest):	Caused
an ERROR
    [junit] org/hamcrest/SelfDescribing
    [junit] java.lang.NoClassDefFoundError: org/hamcrest/SelfDescribing
    [junit] 	at java.lang.ClassLoader.defineClass1(Native Method)
    [junit] 	at java.lang.ClassLoader.defineClass(ClassLoader.java:800)
    [junit] 	at java.security.SecureClassLoader.defineClass(SecureClassLoader.java:142)
    [junit] 	at java.net.URLClassLoader.defineClass(URLClassLoader.java:449)
    [junit] 	at java.net.URLClassLoader.access$100(URLClassLoader.java:71)
    [junit] 	at java.net.URLClassLoader$1.run(URLClassLoader.java:361)
    [junit] 	at java.net.URLClassLoader$1.run(URLClassLoader.java:355)
    [junit] 	at java.security.AccessController.doPrivileged(Native Method)
    [junit] 	at java.net.URLClassLoader.findClass(URLClassLoader.java:354)
    [junit] 	at java.lang.ClassLoader.loadClass(ClassLoader.java:425)
    [junit] 	at sun.misc.Launcher$AppClassLoader.loadClass(Launcher.java:308)
    [junit] 	at java.lang.ClassLoader.loadClass(ClassLoader.java:358)
    [junit] 	at java.lang.reflect.Constructor.newInstance(Constructor.java:526)
    [junit] Caused by: java.lang.ClassNotFoundException: org.hamcrest.SelfDescribing
    [junit] 	at java.net.URLClassLoader$1.run(URLClassLoader.java:366)
    [junit] 	at java.net.URLClassLoader$1.run(URLClassLoader.java:355)
    [junit] 	at java.security.AccessController.doPrivileged(Native Method)
    [junit] 	at java.net.URLClassLoader.findClass(URLClassLoader.java:354)
    [junit] 	at java.lang.ClassLoader.loadClass(ClassLoader.java:425)
    [junit] 	at sun.misc.Launcher$AppClassLoader.loadClass(Launcher.java:308)
    [junit] 	at java.lang.ClassLoader.loadClass(ClassLoader.java:358)
    [junit] 
    [junit] 
    [junit] Test org.apache.pivot.util.test.MIMETypeTest FAILED
    [junit] Testsuite: org.apache.pivot.util.test.ParentResourcesTest
    [junit] Tests run: 1, Failures: 0, Errors: 1, Skipped: 0, Time elapsed: 0.017 sec
    [junit] 
    [junit] Testcase: initializationError(org.apache.pivot.util.test.ParentResourcesTest):
Caused an ERROR
    [junit] org/hamcrest/SelfDescribing
    [junit] java.lang.NoClassDefFoundError: org/hamcrest/SelfDescribing
    [junit] 	at java.lang.ClassLoader.defineClass1(Native Method)
    [junit] 	at java.lang.ClassLoader.defineClass(ClassLoader.java:800)
    [junit] 	at java.security.SecureClassLoader.defineClass(SecureClassLoader.java:142)
    [junit] 	at java.net.URLClassLoader.defineClass(URLClassLoader.java:449)
    [junit] 	at java.net.URLClassLoader.access$100(URLClassLoader.java:71)
    [junit] 	at java.net.URLClassLoader$1.run(URLClassLoader.java:361)
    [junit] 	at java.net.URLClassLoader$1.run(URLClassLoader.java:355)
    [junit] 	at java.security.AccessController.doPrivileged(Native Method)
    [junit] 	at java.net.URLClassLoader.findClass(URLClassLoader.java:354)
    [junit] 	at java.lang.ClassLoader.loadClass(ClassLoader.java:425)
    [junit] 	at sun.misc.Launcher$AppClassLoader.loadClass(Launcher.java:308)
    [junit] 	at java.lang.ClassLoader.loadClass(ClassLoader.java:358)
    [junit] 	at java.lang.reflect.Constructor.newInstance(Constructor.java:526)
    [junit] Caused by: java.lang.ClassNotFoundException: org.hamcrest.SelfDescribing
    [junit] 	at java.net.URLClassLoader$1.run(URLClassLoader.java:366)
    [junit] 	at java.net.URLClassLoader$1.run(URLClassLoader.java:355)
    [junit] 	at java.security.AccessController.doPrivileged(Native Method)
    [junit] 	at java.net.URLClassLoader.findClass(URLClassLoader.java:354)
    [junit] 	at java.lang.ClassLoader.loadClass(ClassLoader.java:425)
    [junit] 	at sun.misc.Launcher$AppClassLoader.loadClass(Launcher.java:308)
    [junit] 	at java.lang.ClassLoader.loadClass(ClassLoader.java:358)
    [junit] 
    [junit] 
    [junit] Test org.apache.pivot.util.test.ParentResourcesTest FAILED
    [junit] Testsuite: org.apache.pivot.util.test.TimeTest
    [junit] Tests run: 1, Failures: 0, Errors: 1, Skipped: 0, Time elapsed: 0.017 sec
    [junit] 
    [junit] Testcase: initializationError(org.apache.pivot.util.test.TimeTest):	Caused an
ERROR
    [junit] org/hamcrest/SelfDescribing
    [junit] java.lang.NoClassDefFoundError: org/hamcrest/SelfDescribing
    [junit] 	at java.lang.ClassLoader.defineClass1(Native Method)
    [junit] 	at java.lang.ClassLoader.defineClass(ClassLoader.java:800)
    [junit] 	at java.security.SecureClassLoader.defineClass(SecureClassLoader.java:142)
    [junit] 	at java.net.URLClassLoader.defineClass(URLClassLoader.java:449)
    [junit] 	at java.net.URLClassLoader.access$100(URLClassLoader.java:71)
    [junit] 	at java.net.URLClassLoader$1.run(URLClassLoader.java:361)
    [junit] 	at java.net.URLClassLoader$1.run(URLClassLoader.java:355)
    [junit] 	at java.security.AccessController.doPrivileged(Native Method)
    [junit] 	at java.net.URLClassLoader.findClass(URLClassLoader.java:354)
    [junit] 	at java.lang.ClassLoader.loadClass(ClassLoader.java:425)
    [junit] 	at sun.misc.Launcher$AppClassLoader.loadClass(Launcher.java:308)
    [junit] 	at java.lang.ClassLoader.loadClass(ClassLoader.java:358)
    [junit] 	at java.lang.reflect.Constructor.newInstance(Constructor.java:526)
    [junit] Caused by: java.lang.ClassNotFoundException: org.hamcrest.SelfDescribing
    [junit] 	at java.net.URLClassLoader$1.run(URLClassLoader.java:366)
    [junit] 	at java.net.URLClassLoader$1.run(URLClassLoader.java:355)
    [junit] 	at java.security.AccessController.doPrivileged(Native Method)
    [junit] 	at java.net.URLClassLoader.findClass(URLClassLoader.java:354)
    [junit] 	at java.lang.ClassLoader.loadClass(ClassLoader.java:425)
    [junit] 	at sun.misc.Launcher$AppClassLoader.loadClass(Launcher.java:308)
    [junit] 	at java.lang.ClassLoader.loadClass(ClassLoader.java:358)
    [junit] 
    [junit] 
    [junit] Test org.apache.pivot.util.test.TimeTest FAILED
    [junit] Testsuite: org.apache.pivot.util.test.VersionTest
    [junit] Tests run: 1, Failures: 0, Errors: 1, Skipped: 0, Time elapsed: 0.016 sec
    [junit] 
    [junit] Testcase: initializationError(org.apache.pivot.util.test.VersionTest):	Caused
an ERROR
    [junit] org/hamcrest/SelfDescribing
    [junit] java.lang.NoClassDefFoundError: org/hamcrest/SelfDescribing
    [junit] 	at java.lang.ClassLoader.defineClass1(Native Method)
    [junit] 	at java.lang.ClassLoader.defineClass(ClassLoader.java:800)
    [junit] 	at java.security.SecureClassLoader.defineClass(SecureClassLoader.java:142)
    [junit] 	at java.net.URLClassLoader.defineClass(URLClassLoader.java:449)
    [junit] 	at java.net.URLClassLoader.access$100(URLClassLoader.java:71)
    [junit] 	at java.net.URLClassLoader$1.run(URLClassLoader.java:361)
    [junit] 	at java.net.URLClassLoader$1.run(URLClassLoader.java:355)
    [junit] 	at java.security.AccessController.doPrivileged(Native Method)
    [junit] 	at java.net.URLClassLoader.findClass(URLClassLoader.java:354)
    [junit] 	at java.lang.ClassLoader.loadClass(ClassLoader.java:425)
    [junit] 	at sun.misc.Launcher$AppClassLoader.loadClass(Launcher.java:308)
    [junit] 	at java.lang.ClassLoader.loadClass(ClassLoader.java:358)
    [junit] 	at java.lang.reflect.Constructor.newInstance(Constructor.java:526)
    [junit] Caused by: java.lang.ClassNotFoundException: org.hamcrest.SelfDescribing
    [junit] 	at java.net.URLClassLoader$1.run(URLClassLoader.java:366)
    [junit] 	at java.net.URLClassLoader$1.run(URLClassLoader.java:355)
    [junit] 	at java.security.AccessController.doPrivileged(Native Method)
    [junit] 	at java.net.URLClassLoader.findClass(URLClassLoader.java:354)
    [junit] 	at java.lang.ClassLoader.loadClass(ClassLoader.java:425)
    [junit] 	at sun.misc.Launcher$AppClassLoader.loadClass(Launcher.java:308)
    [junit] 	at java.lang.ClassLoader.loadClass(ClassLoader.java:358)
    [junit] 
    [junit] 
    [junit] Test org.apache.pivot.util.test.VersionTest FAILED
    [junit] Testsuite: org.apache.pivot.xml.test.XMLSerializerTest
    [junit] Tests run: 1, Failures: 0, Errors: 1, Skipped: 0, Time elapsed: 0.016 sec
    [junit] 
    [junit] Testcase: initializationError(org.apache.pivot.xml.test.XMLSerializerTest):	Caused
an ERROR
    [junit] org/hamcrest/SelfDescribing
    [junit] java.lang.NoClassDefFoundError: org/hamcrest/SelfDescribing
    [junit] 	at java.lang.ClassLoader.defineClass1(Native Method)
    [junit] 	at java.lang.ClassLoader.defineClass(ClassLoader.java:800)
    [junit] 	at java.security.SecureClassLoader.defineClass(SecureClassLoader.java:142)
    [junit] 	at java.net.URLClassLoader.defineClass(URLClassLoader.java:449)
    [junit] 	at java.net.URLClassLoader.access$100(URLClassLoader.java:71)
    [junit] 	at java.net.URLClassLoader$1.run(URLClassLoader.java:361)
    [junit] 	at java.net.URLClassLoader$1.run(URLClassLoader.java:355)
    [junit] 	at java.security.AccessController.doPrivileged(Native Method)
    [junit] 	at java.net.URLClassLoader.findClass(URLClassLoader.java:354)
    [junit] 	at java.lang.ClassLoader.loadClass(ClassLoader.java:425)
    [junit] 	at sun.misc.Launcher$AppClassLoader.loadClass(Launcher.java:308)
    [junit] 	at java.lang.ClassLoader.loadClass(ClassLoader.java:358)
    [junit] 	at java.lang.reflect.Constructor.newInstance(Constructor.java:526)
    [junit] Caused by: java.lang.ClassNotFoundException: org.hamcrest.SelfDescribing
    [junit] 	at java.net.URLClassLoader$1.run(URLClassLoader.java:366)
    [junit] 	at java.net.URLClassLoader$1.run(URLClassLoader.java:355)
    [junit] 	at java.security.AccessController.doPrivileged(Native Method)
    [junit] 	at java.net.URLClassLoader.findClass(URLClassLoader.java:354)
    [junit] 	at java.lang.ClassLoader.loadClass(ClassLoader.java:425)
    [junit] 	at sun.misc.Launcher$AppClassLoader.loadClass(Launcher.java:308)
    [junit] 	at java.lang.ClassLoader.loadClass(ClassLoader.java:358)
    [junit] 
    [junit] 
    [junit] Test org.apache.pivot.xml.test.XMLSerializerTest FAILED
     [echo] demos: Executing test cases...
     [echo] demos-server: Executing test cases...
     [echo] tests: Executing test cases...
     [echo] tutorials: Executing test cases...
     [echo] tutorials-server: Executing test cases...
     [echo] web: Executing test cases...
    [junit] Testsuite: org.apache.pivot.web.test.QueryDictionaryTest
    [junit] Tests run: 1, Failures: 0, Errors: 1, Skipped: 0, Time elapsed: 0.204 sec
    [junit] 
    [junit] Testcase: initializationError(org.apache.pivot.web.test.QueryDictionaryTest):
Caused an ERROR
    [junit] org/hamcrest/SelfDescribing
    [junit] java.lang.NoClassDefFoundError: org/hamcrest/SelfDescribing
    [junit] 	at java.lang.ClassLoader.defineClass1(Native Method)
    [junit] 	at java.lang.ClassLoader.defineClass(ClassLoader.java:800)
    [junit] 	at java.security.SecureClassLoader.defineClass(SecureClassLoader.java:142)
    [junit] 	at java.net.URLClassLoader.defineClass(URLClassLoader.java:449)
    [junit] 	at java.net.URLClassLoader.access$100(URLClassLoader.java:71)
    [junit] 	at java.net.URLClassLoader$1.run(URLClassLoader.java:361)
    [junit] 	at java.net.URLClassLoader$1.run(URLClassLoader.java:355)
    [junit] 	at java.security.AccessController.doPrivileged(Native Method)
    [junit] 	at java.net.URLClassLoader.findClass(URLClassLoader.java:354)
    [junit] 	at java.lang.ClassLoader.loadClass(ClassLoader.java:425)
    [junit] 	at sun.misc.Launcher$AppClassLoader.loadClass(Launcher.java:308)
    [junit] 	at java.lang.ClassLoader.loadClass(ClassLoader.java:358)
    [junit] 	at java.lang.reflect.Constructor.newInstance(Constructor.java:526)
    [junit] Caused by: java.lang.ClassNotFoundException: org.hamcrest.SelfDescribing
    [junit] 	at java.net.URLClassLoader$1.run(URLClassLoader.java:366)
    [junit] 	at java.net.URLClassLoader$1.run(URLClassLoader.java:355)
    [junit] 	at java.security.AccessController.doPrivileged(Native Method)
    [junit] 	at java.net.URLClassLoader.findClass(URLClassLoader.java:354)
    [junit] 	at java.lang.ClassLoader.loadClass(ClassLoader.java:425)
    [junit] 	at sun.misc.Launcher$AppClassLoader.loadClass(Launcher.java:308)
    [junit] 	at java.lang.ClassLoader.loadClass(ClassLoader.java:358)
    [junit] 
    [junit] 
    [junit] Test org.apache.pivot.web.test.QueryDictionaryTest FAILED
     [echo] web-server: Executing test cases...
     [echo] wtk: Executing test cases...
     [echo] wtk-terra: Executing test cases...

BUILD FAILED
<https://builds.apache.org/job/Pivot-trunk%20on%20Java%207/ws/pivot_trunk/build.xml>:460:
Error: One or more tests failed!

Total time: 28 seconds
Build step 'Invoke Ant' marked build as failure

Mime
View raw message