poi-dev mailing list archives

Site index · List index
Message view « Date » · « Thread »
Top « Date » · « Thread »
From Apache Jenkins Server <jenk...@builds.apache.org>
Subject Build failed in Jenkins: POI #1294
Date Tue, 24 May 2016 13:17:13 GMT
See <https://builds.apache.org/job/POI/1294/changes>

Changes:

[nick] Update to fix warnings and deprecations

[nick] Copy out code from the site and fix

------------------------------------------
[...truncated 2472 lines...]
     [echo] 
     [echo] Unapproved licenses:
     [echo] 
     [echo] 
     [echo] *******************************
     [echo] 
     [echo] Archives:
     [echo] 
     [echo] *****************************************************
     [echo]   Files with Apache License headers will be marked AL
     [echo]   Binary files (which do not require AL headers) will be marked B
     [echo]   Compressed archives will be marked A
     [echo]   Notices, licenses etc will be marked N
     [echo]  
     [echo] *****************************************************

forbidden-apis-check:
[forbiddenapis] Reading bundled API signatures: jdk-unsafe-1.6
[forbiddenapis] Reading bundled API signatures: jdk-deprecated-1.6
[forbiddenapis] Reading API signatures: <https://builds.apache.org/job/POI/ws/src/resources/devtools/forbidden-signatures.txt>
[forbiddenapis] WARNING: Class 'java.nio.file.Files' not found on classpath while parsing
signature: java.nio.file.Files#createTempDirectory(java.lang.String,java.nio.file.attribute.FileAttribute[])
[signature ignored]
[forbiddenapis] WARNING: Class 'java.nio.file.Files' not found on classpath while parsing
signature: java.nio.file.Files#createTempFile(java.lang.String,java.lang.String,java.nio.file.attribute.FileAttribute[])
[signature ignored]
[forbiddenapis] WARNING: Class 'java.nio.file.Files' not found on classpath while parsing
signature: java.nio.file.Files#createTempDirectory(java.lang.String,java.nio.file.attribute.FileAttribute[])
[signature ignored]
[forbiddenapis] WARNING: Class 'java.nio.file.Files' not found on classpath while parsing
signature: java.nio.file.Files#createTempFile(java.lang.String,java.lang.String,java.nio.file.attribute.FileAttribute[])
[signature ignored]
[forbiddenapis] Loading classes to check...
[forbiddenapis] Scanning classes for violations...
[forbiddenapis] Scanned 3789 (and 1638 related) class file(s) for forbidden API invocations
(in 3.96s), 0 error(s).
[forbiddenapis] Reading API signatures: <https://builds.apache.org/job/POI/ws/src/resources/devtools/forbidden-signatures-prod.txt>
[forbiddenapis] Loading classes to check...
[forbiddenapis] Scanning classes for violations...
[forbiddenapis] Scanned 2937 (and 1360 related) class file(s) for forbidden API invocations
(in 1.44s), 0 error(s).

jenkins:

BUILD SUCCESSFUL
Total time: 28 minutes 16 seconds
[integrationtest] $ /home/jenkins/tools/ant/latest/bin/ant -file build.xml
Buildfile: <https://builds.apache.org/job/POI/ws/src/integrationtest/build.xml>

init:

runSourceBuild:
    [mkdir] Created dir: <https://builds.apache.org/job/POI/ws/build/distsourcebuild>
     [echo] Found source package at <https://builds.apache.org/job/POI/ws/build/dist/poi-src-3.15-beta2-20160524.zip>
    [unzip] Expanding: <https://builds.apache.org/job/POI/ws/build/dist/poi-src-3.15-beta2-20160524.zip>
into <https://builds.apache.org/job/POI/ws/build/distsourcebuild>
    [mkdir] Created dir: <https://builds.apache.org/job/POI/ws/build/distsourcebuild/poi-3.15-beta2/lib>
    [mkdir] Created dir: <https://builds.apache.org/job/POI/ws/build/distsourcebuild/poi-3.15-beta2/ooxml-lib>
    [mkdir] Created dir: <https://builds.apache.org/job/POI/ws/build/distsourcebuild/poi-3.15-beta2/compile-lib>
     [copy] Copying 18 files to <https://builds.apache.org/job/POI/ws/build/distsourcebuild/poi-3.15-beta2/lib>
     [copy] Copying 19 files to <https://builds.apache.org/job/POI/ws/build/distsourcebuild/poi-3.15-beta2/ooxml-lib>
     [copy] Copying 4 files to <https://builds.apache.org/job/POI/ws/build/distsourcebuild/poi-3.15-beta2/compile-lib>
     [echo] Building in temporary dir <https://builds.apache.org/job/POI/ws/build/distsourcebuild/poi-3.15-beta2/>

check-jars:
   [delete] Deleting <https://builds.apache.org/job/POI/ws/build/distsourcebuild/poi-3.15-beta2/lib/findbugs-noUpdateChecks-2.0.3.zip>

fetch-jars:

check-ooxml-jars:

fetch-ooxml-jars:

init:
    [mkdir] Created dir: <https://builds.apache.org/job/POI/ws/build/distsourcebuild/poi-3.15-beta2/build>
    [mkdir] Created dir: <https://builds.apache.org/job/POI/ws/build/distsourcebuild/poi-3.15-beta2/build/classes>
    [mkdir] Created dir: <https://builds.apache.org/job/POI/ws/build/distsourcebuild/poi-3.15-beta2/build/test-classes>
    [mkdir] Created dir: <https://builds.apache.org/job/POI/ws/build/distsourcebuild/poi-3.15-beta2/build/test-results>
    [mkdir] Created dir: <https://builds.apache.org/job/POI/ws/build/distsourcebuild/poi-3.15-beta2/build/scratchpad-classes>
    [mkdir] Created dir: <https://builds.apache.org/job/POI/ws/build/distsourcebuild/poi-3.15-beta2/build/scratchpad-test-classes>
    [mkdir] Created dir: <https://builds.apache.org/job/POI/ws/build/distsourcebuild/poi-3.15-beta2/build/scratchpad-test-results>
    [mkdir] Created dir: <https://builds.apache.org/job/POI/ws/build/distsourcebuild/poi-3.15-beta2/build/geometry-java>
    [mkdir] Created dir: <https://builds.apache.org/job/POI/ws/build/distsourcebuild/poi-3.15-beta2/build/ooxml-classes>
    [mkdir] Created dir: <https://builds.apache.org/job/POI/ws/build/distsourcebuild/poi-3.15-beta2/build/ooxml-test-classes>
    [mkdir] Created dir: <https://builds.apache.org/job/POI/ws/build/distsourcebuild/poi-3.15-beta2/build/ooxml-test-results>
    [mkdir] Created dir: <https://builds.apache.org/job/POI/ws/build/distsourcebuild/poi-3.15-beta2/build/excelant-classes>
    [mkdir] Created dir: <https://builds.apache.org/job/POI/ws/build/distsourcebuild/poi-3.15-beta2/build/excelant-test-classes>
    [mkdir] Created dir: <https://builds.apache.org/job/POI/ws/build/distsourcebuild/poi-3.15-beta2/build/excelant-test-results>
    [mkdir] Created dir: <https://builds.apache.org/job/POI/ws/build/distsourcebuild/poi-3.15-beta2/build/examples-classes>
    [mkdir] Created dir: <https://builds.apache.org/job/POI/ws/build/distsourcebuild/poi-3.15-beta2/build/integration-test-classes>
    [mkdir] Created dir: <https://builds.apache.org/job/POI/ws/build/distsourcebuild/poi-3.15-beta2/build/integration-test-results>
    [mkdir] Created dir: <https://builds.apache.org/job/POI/ws/build/distsourcebuild/poi-3.15-beta2/build/dist>
    [mkdir] Created dir: <https://builds.apache.org/job/POI/ws/build/distsourcebuild/poi-3.15-beta2/build/tmp/site/build/site>
     [echo] Using Java: 1.6.0_45/1.6.0_45-b06/20.45-b01/Java HotSpot(TM) Server VM from Sun
Microsystems Inc. on Linux: 3.13.0-36-lowlatency

compile-main:
    [javac] Compiling 1192 source files to <https://builds.apache.org/job/POI/ws/build/distsourcebuild/poi-3.15-beta2/build/classes>
    [javac] Note: Some input files use or override a deprecated API.
    [javac] Note: Recompile with -Xlint:deprecation for details.
    [javac] Note: <https://builds.apache.org/job/POI/ws/build/distsourcebuild/poi-3.15-beta2/src/java/org/apache/poi/hpsf/CustomProperties.java>
uses unchecked or unsafe operations.
    [javac] Note: Recompile with -Xlint:unchecked for details.
    [javac] Compiling 523 source files to <https://builds.apache.org/job/POI/ws/build/distsourcebuild/poi-3.15-beta2/build/test-classes>
    [javac] Note: Some input files use or override a deprecated API.
    [javac] Note: Recompile with -Xlint:deprecation for details.
    [javac] Note: Some input files use unchecked or unsafe operations.
    [javac] Note: Recompile with -Xlint:unchecked for details.
     [copy] Copying 4 files to <https://builds.apache.org/job/POI/ws/build/distsourcebuild/poi-3.15-beta2/build/classes>

check-ooxml-xsds:

fetch-ooxml-xsds:

generate-geometry:

compile-scratchpad:
    [javac] Compiling 466 source files to <https://builds.apache.org/job/POI/ws/build/distsourcebuild/poi-3.15-beta2/build/scratchpad-classes>
    [javac] Note: Some input files use or override a deprecated API.
    [javac] Note: Recompile with -Xlint:deprecation for details.
    [javac] Compiling 183 source files to <https://builds.apache.org/job/POI/ws/build/distsourcebuild/poi-3.15-beta2/build/scratchpad-test-classes>
    [javac] Note: Some input files use or override a deprecated API.
    [javac] Note: Recompile with -Xlint:deprecation for details.
     [copy] Copying 2 files to <https://builds.apache.org/job/POI/ws/build/distsourcebuild/poi-3.15-beta2/build/scratchpad-classes>

check-compiled-ooxml-xsds:

compile-ooxml-xsds:

compile-ooxml:
    [javac] Compiling 410 source files to <https://builds.apache.org/job/POI/ws/build/distsourcebuild/poi-3.15-beta2/build/ooxml-classes>
    [javac] Note: Some input files use or override a deprecated API.
    [javac] Note: Recompile with -Xlint:deprecation for details.
    [javac] Compiling 202 source files to <https://builds.apache.org/job/POI/ws/build/distsourcebuild/poi-3.15-beta2/build/ooxml-test-classes>
    [javac] Note: Some input files use or override a deprecated API.
    [javac] Note: Recompile with -Xlint:deprecation for details.
     [copy] Copying 2 files to <https://builds.apache.org/job/POI/ws/build/distsourcebuild/poi-3.15-beta2/build/ooxml-classes>

compile-examples:
    [javac] Compiling 138 source files to <https://builds.apache.org/job/POI/ws/build/distsourcebuild/poi-3.15-beta2/build/examples-classes>
    [javac] Note: Some input files use or override a deprecated API.
    [javac] Note: Recompile with -Xlint:deprecation for details.
    [javac] Note: <https://builds.apache.org/job/POI/ws/build/distsourcebuild/poi-3.15-beta2/src/examples/src/org/apache/poi/hpsf/examples/WriteAuthorAndTitle.java>
uses unchecked or unsafe operations.
    [javac] Note: Recompile with -Xlint:unchecked for details.
     [copy] Copying 1 file to <https://builds.apache.org/job/POI/ws/build/distsourcebuild/poi-3.15-beta2/build/examples-classes>

compile-excelant:
    [javac] Compiling 14 source files to <https://builds.apache.org/job/POI/ws/build/distsourcebuild/poi-3.15-beta2/build/excelant-classes>
    [javac] Compiling 13 source files to <https://builds.apache.org/job/POI/ws/build/distsourcebuild/poi-3.15-beta2/build/excelant-test-classes>
     [copy] Copying 1 file to <https://builds.apache.org/job/POI/ws/build/distsourcebuild/poi-3.15-beta2/build/excelant-classes>

compile:

compile-ooxml-lite:
    [mkdir] Created dir: <https://builds.apache.org/job/POI/ws/build/distsourcebuild/poi-3.15-beta2/build/ooxml-lite-merged>
      [jar] Building jar: <https://builds.apache.org/job/POI/ws/build/distsourcebuild/poi-3.15-beta2/build/ooxml-lite-merged/ooxml-lite-merged.jar>
     [java] Collecting unit tests from <https://builds.apache.org/job/POI/ws/build/distsourcebuild/poi-3.15-beta2/build/ooxml-test-classes>
     [java] Found 181 classes
     [java] .....................................................................Name: /word/document.xml
- Content Type: application/vnd.openxmlformats-officedocument.wordprocessingml.document.main+xml
     [java] SLF4J: Failed to load class "org.slf4j.impl.StaticLoggerBinder".
     [java] SLF4J: Defaulting to no-operation (NOP) logger implementation
     [java] SLF4J: See http://www.slf4j.org/codes.html#StaticLoggerBinder for further details.
     [java] ....................................................................................................................................................................I..............................................................................................................................................................................I........I..............................................................................I.I.I.................................................................................11
     [java] Calibri
     [java] ...........................................................................................................................Setting
col: 0 and row 0
     [java] Setting col: 1 and row 1
     [java] ................................................................................................................................................................................................................................................................................................................................................................................................................................................................................................................................................................I....................................................................................................................................................................................I.............III.II.......I.......I.....I........................................................................................................................................................I....................................................Cell:
3E-104
     [java] Cell: 5E-104
     [java] Cell: 5E-106
     [java] Cell: 
     [java] II........I.I......................I........I......I.............I.........................................Cell
formula evaluation currently unsupported
     [java] Array formulas currently unsupported
     [java] .......................................................................................................................................I.....................................................
     [java] Time: 162.878
     [java] 
     [java] OK (1947 tests)
     [java] 
     [java] Copying classes to <https://builds.apache.org/job/POI/ws/build/distsourcebuild/poi-3.15-beta2/build/ooxml-lite-classes>
     [java] Copying .xsb resources

compile-all:

compile-version:
     [copy] Copying 1 file to <https://builds.apache.org/job/POI/ws/build/distsourcebuild/poi-3.15-beta2/build/classes/org/apache/poi>
    [javac] Compiling 1 source file to <https://builds.apache.org/job/POI/ws/build/distsourcebuild/poi-3.15-beta2/build/classes>
   [delete] Deleting: <https://builds.apache.org/job/POI/ws/build/distsourcebuild/poi-3.15-beta2/build/classes/org/apache/poi/Version.java>

-manifest:

jar:
      [jar] Building jar: <https://builds.apache.org/job/POI/ws/build/distsourcebuild/poi-3.15-beta2/build/dist/maven/poi/poi-3.15-beta2.jar>
      [jar] Building jar: <https://builds.apache.org/job/POI/ws/build/distsourcebuild/poi-3.15-beta2/build/dist/maven/poi-scratchpad/poi-scratchpad-3.15-beta2.jar>
      [jar] Building jar: <https://builds.apache.org/job/POI/ws/build/distsourcebuild/poi-3.15-beta2/build/dist/maven/poi-ooxml/poi-ooxml-3.15-beta2.jar>
      [jar] Building jar: <https://builds.apache.org/job/POI/ws/build/distsourcebuild/poi-3.15-beta2/build/dist/maven/poi-examples/poi-examples-3.15-beta2.jar>
      [jar] Building jar: <https://builds.apache.org/job/POI/ws/build/distsourcebuild/poi-3.15-beta2/build/dist/maven/poi-excelant/poi-excelant-3.15-beta2.jar>
      [jar] Building jar: <https://builds.apache.org/job/POI/ws/build/distsourcebuild/poi-3.15-beta2/build/dist/maven/poi-ooxml-schemas/poi-ooxml-schemas-3.15-beta2.jar>

runCompileTest:
   [delete] Deleting directory <https://builds.apache.org/job/POI/ws/build/distsourcebuild>
    [mkdir] Created dir: <https://builds.apache.org/job/POI/ws/build/distsourcebuild>
     [echo] Found jar packages at <https://builds.apache.org/job/POI/ws/build/dist/maven/poi-ooxml-schemas/poi-ooxml-schemas-3.15-beta2.jar>:<https://builds.apache.org/job/POI/ws/build/dist/maven/poi-ooxml/poi-ooxml-3.15-beta2.jar>:<https://builds.apache.org/job/POI/ws/build/dist/maven/poi/poi-3.15-beta2.jar,>
dist: ../../build/dist
     [echo] Compiling examples without linking to scratchpad.jar to ensure that only some
specific ones require this jar
    [javac] Compiling 124 source files to <https://builds.apache.org/job/POI/ws/build/distsourcebuild>
    [javac] <https://builds.apache.org/job/POI/ws/src/examples/src/org/apache/poi/ss/examples/LoadEmbedded.java>:23:
package org.apache.poi.hslf.usermodel does not exist
    [javac] import org.apache.poi.hslf.usermodel.HSLFSlideShow;
    [javac]                                     ^
    [javac] <https://builds.apache.org/job/POI/ws/src/examples/src/org/apache/poi/ss/examples/LoadEmbedded.java>:26:
cannot find symbol
    [javac] symbol  : class HWPFDocument
    [javac] location: package org.apache.poi.hwpf
    [javac] import org.apache.poi.hwpf.HWPFDocument;
    [javac]                           ^
    [javac] <https://builds.apache.org/job/POI/ws/src/examples/src/org/apache/poi/ss/examples/LoadEmbedded.java>:70:
cannot find symbol
    [javac] symbol  : class HWPFDocument
    [javac] location: class org.apache.poi.ss.examples.LoadEmbedded
    [javac]                HWPFDocument embeddedWordDocument = new HWPFDocument(dn);
    [javac]                ^
    [javac] <https://builds.apache.org/job/POI/ws/src/examples/src/org/apache/poi/ss/examples/LoadEmbedded.java>:70:
cannot find symbol
    [javac] symbol  : class HWPFDocument
    [javac] location: class org.apache.poi.ss.examples.LoadEmbedded
    [javac]                HWPFDocument embeddedWordDocument = new HWPFDocument(dn);
    [javac]                                                        ^
    [javac] <https://builds.apache.org/job/POI/ws/src/examples/src/org/apache/poi/ss/examples/LoadEmbedded.java>:74:
cannot find symbol
    [javac] symbol  : class HSLFSlideShow
    [javac] location: class org.apache.poi.ss.examples.LoadEmbedded
    [javac]                SlideShow<?,?> embeddedPowerPointDocument = new HSLFSlideShow(dn);
    [javac]                                                                ^
    [javac] <https://builds.apache.org/job/POI/ws/src/examples/src/org/apache/poi/ss/examples/LoadEmbedded.java>:106:
cannot find symbol
    [javac] symbol  : class HWPFDocument
    [javac] location: class org.apache.poi.ss.examples.LoadEmbedded
    [javac]                HWPFDocument document = new HWPFDocument(pPart.getInputStream());
    [javac]                ^
    [javac] <https://builds.apache.org/job/POI/ws/src/examples/src/org/apache/poi/ss/examples/LoadEmbedded.java>:106:
cannot find symbol
    [javac] symbol  : class HWPFDocument
    [javac] location: class org.apache.poi.ss.examples.LoadEmbedded
    [javac]                HWPFDocument document = new HWPFDocument(pPart.getInputStream());
    [javac]                                            ^
    [javac] <https://builds.apache.org/job/POI/ws/src/examples/src/org/apache/poi/ss/examples/LoadEmbedded.java>:115:
cannot find symbol
    [javac] symbol  : class HSLFSlideShow
    [javac] location: class org.apache.poi.ss.examples.LoadEmbedded
    [javac]                HSLFSlideShow slideShow = new HSLFSlideShow(pPart.getInputStream());
    [javac]                ^
    [javac] <https://builds.apache.org/job/POI/ws/src/examples/src/org/apache/poi/ss/examples/LoadEmbedded.java>:115:
cannot find symbol
    [javac] symbol  : class HSLFSlideShow
    [javac] location: class org.apache.poi.ss.examples.LoadEmbedded
    [javac]                HSLFSlideShow slideShow = new HSLFSlideShow(pPart.getInputStream());
    [javac]                                              ^
    [javac] Note: Some input files use or override a deprecated API.
    [javac] Note: Recompile with -Xlint:deprecation for details.
    [javac] Note: <https://builds.apache.org/job/POI/ws/src/examples/src/org/apache/poi/hpsf/examples/WriteAuthorAndTitle.java>
uses unchecked or unsafe operations.
    [javac] Note: Recompile with -Xlint:unchecked for details.
    [javac] 9 errors

BUILD FAILED
<https://builds.apache.org/job/POI/ws/src/integrationtest/build.xml>:138: Compile failed;
see the compiler error output for details.

Total time: 3 minutes 30 seconds
Build step 'Invoke Ant' marked build as failure
[FINDBUGS] Skipping publisher since build result is FAILURE
[WARNINGS] Skipping publisher since build result is FAILURE
Archiving artifacts
Compressed 209.50 MB of artifacts by 46.6% relative to #1293
Recording test results

---------------------------------------------------------------------
To unsubscribe, e-mail: dev-unsubscribe@poi.apache.org
For additional commands, e-mail: dev-help@poi.apache.org


Mime
View raw message