poi-dev mailing list archives

Site index · List index
Message view « Date » · « Thread »
Top « Date » · « Thread »
From Apache Jenkins Server <jenk...@builds.apache.org>
Subject Build failed in Jenkins: POI-JDK8 #980
Date Mon, 16 May 2016 10:33:22 GMT
See <https://builds.apache.org/job/POI-JDK8/980/changes>

Changes:

[kiwiwings] deprecation fix

[kiwiwings] Close resources in Common SL rendering classes and minimize memory consumption
by using the image anchor dimensions instead of the WMF-included dimensions

[kiwiwings] sonar fix - reduce complexity by using constants

[kiwiwings] Reduce calls to utf-related methods - the integration test took ages because of
poc-shared-strings.xlsx

[kiwiwings] Reduce calls to utf-related methods - the integration test took ages because of
poc-shared-strings.xlsx

[kiwiwings] Sonar fixes - array is stored directly

[kiwiwings] Dispose XmlCursor
Replacing a method argument (XmlCursor) with a local instance and then updating it, doesn't
make sense

[kiwiwings] added commons-logging to integration test to make profiling easier - just match
the timestamps of the log with the timestamps of the profiling monitor

[kiwiwings] #59170 - Remove deprecated classes (POI 3.15) - use FormulaError instead of ErrorConstants

------------------------------------------
[...truncated 6958 lines...]
 [findbugs]       At edu.umd.cs.findbugs.FindBugs2.main(FindBugs2.java:1317)
 [findbugs]   Couldn't get class info for java/util/function/BiConsumer
 [findbugs]     java.lang.ArrayIndexOutOfBoundsException: 26947
 [findbugs]       At org.objectweb.asm.ClassReader.readClass(Unknown Source)
 [findbugs]       At org.objectweb.asm.ClassReader.accept(Unknown Source)
 [findbugs]       At edu.umd.cs.findbugs.asm.FBClassReader.accept(FBClassReader.java:44)
 [findbugs]       At org.objectweb.asm.ClassReader.accept(Unknown Source)
 [findbugs]       At edu.umd.cs.findbugs.classfile.engine.ClassParserUsingASM.parse(ClassParserUsingASM.java:110)
 [findbugs]       At edu.umd.cs.findbugs.classfile.engine.ClassParserUsingASM.parse(ClassParserUsingASM.java:587)
 [findbugs]       At edu.umd.cs.findbugs.classfile.engine.ClassInfoAnalysisEngine.analyze(ClassInfoAnalysisEngine.java:76)
 [findbugs]       At edu.umd.cs.findbugs.classfile.engine.ClassInfoAnalysisEngine.analyze(ClassInfoAnalysisEngine.java:38)
 [findbugs]       At edu.umd.cs.findbugs.classfile.impl.AnalysisCache.getClassAnalysis(AnalysisCache.java:268)
 [findbugs]       At edu.umd.cs.findbugs.ba.XFactory.getXClass(XFactory.java:652)
 [findbugs]       At edu.umd.cs.findbugs.ba.AnalysisContext.setAppClassList(AnalysisContext.java:932)
 [findbugs]       At edu.umd.cs.findbugs.FindBugs2.setAppClassList(FindBugs2.java:997)
 [findbugs]       At edu.umd.cs.findbugs.FindBugs2.execute(FindBugs2.java:225)
 [findbugs]       At edu.umd.cs.findbugs.FindBugs.runMain(FindBugs.java:393)
 [findbugs]       At edu.umd.cs.findbugs.FindBugs2.main(FindBugs2.java:1317)
 [findbugs]   Couldn't get class info for java/util/function/BiFunction
 [findbugs]     java.lang.ArrayIndexOutOfBoundsException: 26950
 [findbugs]       At org.objectweb.asm.ClassReader.readClass(Unknown Source)
 [findbugs]       At org.objectweb.asm.ClassReader.accept(Unknown Source)
 [findbugs]       At edu.umd.cs.findbugs.asm.FBClassReader.accept(FBClassReader.java:44)
 [findbugs]       At org.objectweb.asm.ClassReader.accept(Unknown Source)
 [findbugs]       At edu.umd.cs.findbugs.classfile.engine.ClassParserUsingASM.parse(ClassParserUsingASM.java:110)
 [findbugs]       At edu.umd.cs.findbugs.classfile.engine.ClassParserUsingASM.parse(ClassParserUsingASM.java:587)
 [findbugs]       At edu.umd.cs.findbugs.classfile.engine.ClassInfoAnalysisEngine.analyze(ClassInfoAnalysisEngine.java:76)
 [findbugs]       At edu.umd.cs.findbugs.classfile.engine.ClassInfoAnalysisEngine.analyze(ClassInfoAnalysisEngine.java:38)
 [findbugs]       At edu.umd.cs.findbugs.classfile.impl.AnalysisCache.getClassAnalysis(AnalysisCache.java:268)
 [findbugs]       At edu.umd.cs.findbugs.ba.XFactory.getXClass(XFactory.java:652)
 [findbugs]       At edu.umd.cs.findbugs.ba.AnalysisContext.setAppClassList(AnalysisContext.java:932)
 [findbugs]       At edu.umd.cs.findbugs.FindBugs2.setAppClassList(FindBugs2.java:997)
 [findbugs]       At edu.umd.cs.findbugs.FindBugs2.execute(FindBugs2.java:225)
 [findbugs]       At edu.umd.cs.findbugs.FindBugs.runMain(FindBugs.java:393)
 [findbugs]       At edu.umd.cs.findbugs.FindBugs2.main(FindBugs2.java:1317)
 [findbugs]   Couldn't get class info for java/util/Map$Entry
 [findbugs]     java.lang.ArrayIndexOutOfBoundsException: 9216
 [findbugs]       At org.objectweb.asm.ClassReader.readClass(Unknown Source)
 [findbugs]       At org.objectweb.asm.ClassReader.accept(Unknown Source)
 [findbugs]       At edu.umd.cs.findbugs.asm.FBClassReader.accept(FBClassReader.java:44)
 [findbugs]       At org.objectweb.asm.ClassReader.accept(Unknown Source)
 [findbugs]       At edu.umd.cs.findbugs.classfile.engine.ClassParserUsingASM.parse(ClassParserUsingASM.java:110)
 [findbugs]       At edu.umd.cs.findbugs.classfile.engine.ClassParserUsingASM.parse(ClassParserUsingASM.java:587)
 [findbugs]       At edu.umd.cs.findbugs.classfile.engine.ClassInfoAnalysisEngine.analyze(ClassInfoAnalysisEngine.java:76)
 [findbugs]       At edu.umd.cs.findbugs.classfile.engine.ClassInfoAnalysisEngine.analyze(ClassInfoAnalysisEngine.java:38)
 [findbugs]       At edu.umd.cs.findbugs.classfile.impl.AnalysisCache.getClassAnalysis(AnalysisCache.java:268)
 [findbugs]       At edu.umd.cs.findbugs.ba.XFactory.getXClass(XFactory.java:652)
 [findbugs]       At edu.umd.cs.findbugs.ba.ch.Subtypes2.addInheritanceEdge(Subtypes2.java:1260)
 [findbugs]       At edu.umd.cs.findbugs.ba.ch.Subtypes2.addSupertypeEdges(Subtypes2.java:1233)
 [findbugs]       At edu.umd.cs.findbugs.ba.ch.Subtypes2.addClassAndGetClassVertex(Subtypes2.java:275)
 [findbugs]       At edu.umd.cs.findbugs.ba.ch.Subtypes2.addClass(Subtypes2.java:244)
 [findbugs]       At edu.umd.cs.findbugs.ba.AnalysisContext.setAppClassList(AnalysisContext.java:941)
 [findbugs]       At edu.umd.cs.findbugs.FindBugs2.setAppClassList(FindBugs2.java:997)
 [findbugs]       At edu.umd.cs.findbugs.FindBugs2.execute(FindBugs2.java:225)
 [findbugs]       At edu.umd.cs.findbugs.FindBugs.runMain(FindBugs.java:393)
 [findbugs]       At edu.umd.cs.findbugs.FindBugs2.main(FindBugs2.java:1317)
 [findbugs]   Couldn't get class info for java/util/BitSet
 [findbugs]     java.lang.ArrayIndexOutOfBoundsException: 35959
 [findbugs]       At org.objectweb.asm.ClassReader.<init>(Unknown Source)
 [findbugs]       At org.objectweb.asm.ClassReader.<init>(Unknown Source)
 [findbugs]       At edu.umd.cs.findbugs.asm.FBClassReader.<init>(FBClassReader.java:35)
 [findbugs]       At edu.umd.cs.findbugs.classfile.engine.asm.ClassReaderAnalysisEngine.analyze(ClassReaderAnalysisEngine.java:47)
 [findbugs]       At edu.umd.cs.findbugs.classfile.engine.asm.ClassReaderAnalysisEngine.analyze(ClassReaderAnalysisEngine.java:34)
 [findbugs]       At edu.umd.cs.findbugs.classfile.impl.AnalysisCache.getClassAnalysis(AnalysisCache.java:268)
 [findbugs]       At edu.umd.cs.findbugs.classfile.engine.ClassInfoAnalysisEngine.analyze(ClassInfoAnalysisEngine.java:72)
 [findbugs]       At edu.umd.cs.findbugs.classfile.engine.ClassInfoAnalysisEngine.analyze(ClassInfoAnalysisEngine.java:38)
 [findbugs]       At edu.umd.cs.findbugs.classfile.impl.AnalysisCache.getClassAnalysis(AnalysisCache.java:268)
 [findbugs]       At edu.umd.cs.findbugs.ba.XFactory.getXClass(XFactory.java:652)
 [findbugs]       At edu.umd.cs.findbugs.ba.AnalysisContext.setAppClassList(AnalysisContext.java:932)
 [findbugs]       At edu.umd.cs.findbugs.FindBugs2.setAppClassList(FindBugs2.java:997)
 [findbugs]       At edu.umd.cs.findbugs.FindBugs2.execute(FindBugs2.java:225)
 [findbugs]       At edu.umd.cs.findbugs.FindBugs.runMain(FindBugs.java:393)
 [findbugs]       At edu.umd.cs.findbugs.FindBugs2.main(FindBugs2.java:1317)
 [findbugs]   Couldn't get class info for java/util/concurrent/ConcurrentMap
 [findbugs]     java.lang.ArrayIndexOutOfBoundsException: 28526
 [findbugs]       At org.objectweb.asm.ClassReader.readClass(Unknown Source)
 [findbugs]       At org.objectweb.asm.ClassReader.accept(Unknown Source)
 [findbugs]       At edu.umd.cs.findbugs.asm.FBClassReader.accept(FBClassReader.java:44)
 [findbugs]       At org.objectweb.asm.ClassReader.accept(Unknown Source)
 [findbugs]       At edu.umd.cs.findbugs.classfile.engine.ClassParserUsingASM.parse(ClassParserUsingASM.java:110)
 [findbugs]       At edu.umd.cs.findbugs.classfile.engine.ClassParserUsingASM.parse(ClassParserUsingASM.java:587)
 [findbugs]       At edu.umd.cs.findbugs.classfile.engine.ClassInfoAnalysisEngine.analyze(ClassInfoAnalysisEngine.java:76)
 [findbugs]       At edu.umd.cs.findbugs.classfile.engine.ClassInfoAnalysisEngine.analyze(ClassInfoAnalysisEngine.java:38)
 [findbugs]       At edu.umd.cs.findbugs.classfile.impl.AnalysisCache.getClassAnalysis(AnalysisCache.java:268)
 [findbugs]       At edu.umd.cs.findbugs.ba.XFactory.getXClass(XFactory.java:652)
 [findbugs]       At edu.umd.cs.findbugs.ba.AnalysisContext.setAppClassList(AnalysisContext.java:932)
 [findbugs]       At edu.umd.cs.findbugs.FindBugs2.setAppClassList(FindBugs2.java:997)
 [findbugs]       At edu.umd.cs.findbugs.FindBugs2.execute(FindBugs2.java:225)
 [findbugs]       At edu.umd.cs.findbugs.FindBugs.runMain(FindBugs.java:393)
 [findbugs]       At edu.umd.cs.findbugs.FindBugs2.main(FindBugs2.java:1317)
 [findbugs]   Couldn't get class info for java/util/Comparator
 [findbugs]     java.lang.ArrayIndexOutOfBoundsException: 51966
 [findbugs]       At org.objectweb.asm.ClassReader.readUTF8(Unknown Source)
 [findbugs]       At org.objectweb.asm.ClassReader.readClass(Unknown Source)
 [findbugs]       At org.objectweb.asm.ClassReader.accept(Unknown Source)
 [findbugs]       At edu.umd.cs.findbugs.asm.FBClassReader.accept(FBClassReader.java:44)
 [findbugs]       At org.objectweb.asm.ClassReader.accept(Unknown Source)
 [findbugs]       At edu.umd.cs.findbugs.classfile.engine.ClassParserUsingASM.parse(ClassParserUsingASM.java:110)
 [findbugs]       At edu.umd.cs.findbugs.classfile.engine.ClassParserUsingASM.parse(ClassParserUsingASM.java:587)
 [findbugs]       At edu.umd.cs.findbugs.classfile.engine.ClassInfoAnalysisEngine.analyze(ClassInfoAnalysisEngine.java:76)
 [findbugs]       At edu.umd.cs.findbugs.classfile.engine.ClassInfoAnalysisEngine.analyze(ClassInfoAnalysisEngine.java:38)
 [findbugs]       At edu.umd.cs.findbugs.classfile.impl.AnalysisCache.getClassAnalysis(AnalysisCache.java:268)
 [findbugs]       At edu.umd.cs.findbugs.FindBugs2.buildReferencedClassSet(FindBugs2.java:891)
 [findbugs]       At edu.umd.cs.findbugs.FindBugs2.execute(FindBugs2.java:222)
 [findbugs]       At edu.umd.cs.findbugs.FindBugs.runMain(FindBugs.java:393)
 [findbugs]       At edu.umd.cs.findbugs.FindBugs2.main(FindBugs2.java:1317)
 [findbugs]   Couldn't get class info for java/util/Arrays
 [findbugs]     java.lang.ArrayIndexOutOfBoundsException: 35328
 [findbugs]       At org.objectweb.asm.ClassReader.accept(Unknown Source)
 [findbugs]       At edu.umd.cs.findbugs.asm.FBClassReader.accept(FBClassReader.java:44)
 [findbugs]       At org.objectweb.asm.ClassReader.accept(Unknown Source)
 [findbugs]       At edu.umd.cs.findbugs.classfile.engine.ClassParserUsingASM.parse(ClassParserUsingASM.java:110)
 [findbugs]       At edu.umd.cs.findbugs.classfile.engine.ClassParserUsingASM.parse(ClassParserUsingASM.java:587)
 [findbugs]       At edu.umd.cs.findbugs.classfile.engine.ClassInfoAnalysisEngine.analyze(ClassInfoAnalysisEngine.java:76)
 [findbugs]       At edu.umd.cs.findbugs.classfile.engine.ClassInfoAnalysisEngine.analyze(ClassInfoAnalysisEngine.java:38)
 [findbugs]       At edu.umd.cs.findbugs.classfile.impl.AnalysisCache.getClassAnalysis(AnalysisCache.java:268)
 [findbugs]       At edu.umd.cs.findbugs.ba.XFactory.getXClass(XFactory.java:652)
 [findbugs]       At edu.umd.cs.findbugs.ba.AnalysisContext.setAppClassList(AnalysisContext.java:932)
 [findbugs]       At edu.umd.cs.findbugs.FindBugs2.setAppClassList(FindBugs2.java:997)
 [findbugs]       At edu.umd.cs.findbugs.FindBugs2.execute(FindBugs2.java:225)
 [findbugs]       At edu.umd.cs.findbugs.FindBugs.runMain(FindBugs.java:393)
 [findbugs]       At edu.umd.cs.findbugs.FindBugs2.main(FindBugs2.java:1317)
 [findbugs]   Couldn't get class info for java/lang/CharSequence
 [findbugs]     java.lang.ArrayIndexOutOfBoundsException: 26721
 [findbugs]       At org.objectweb.asm.ClassReader.readClass(Unknown Source)
 [findbugs]       At org.objectweb.asm.ClassReader.accept(Unknown Source)
 [findbugs]       At edu.umd.cs.findbugs.asm.FBClassReader.accept(FBClassReader.java:44)
 [findbugs]       At org.objectweb.asm.ClassReader.accept(Unknown Source)
 [findbugs]       At edu.umd.cs.findbugs.classfile.engine.ClassParserUsingASM.parse(ClassParserUsingASM.java:110)
 [findbugs]       At edu.umd.cs.findbugs.classfile.engine.ClassParserUsingASM.parse(ClassParserUsingASM.java:587)
 [findbugs]       At edu.umd.cs.findbugs.classfile.engine.ClassInfoAnalysisEngine.analyze(ClassInfoAnalysisEngine.java:76)
 [findbugs]       At edu.umd.cs.findbugs.classfile.engine.ClassInfoAnalysisEngine.analyze(ClassInfoAnalysisEngine.java:38)
 [findbugs]       At edu.umd.cs.findbugs.classfile.impl.AnalysisCache.getClassAnalysis(AnalysisCache.java:268)
 [findbugs]       At edu.umd.cs.findbugs.ba.XFactory.getXClass(XFactory.java:652)
 [findbugs]       At edu.umd.cs.findbugs.ba.ch.Subtypes2.addInheritanceEdge(Subtypes2.java:1260)
 [findbugs]       At edu.umd.cs.findbugs.ba.ch.Subtypes2.addSupertypeEdges(Subtypes2.java:1233)
 [findbugs]       At edu.umd.cs.findbugs.ba.ch.Subtypes2.addClassAndGetClassVertex(Subtypes2.java:275)
 [findbugs]       At edu.umd.cs.findbugs.ba.ch.Subtypes2.addClass(Subtypes2.java:244)
 [findbugs]       At edu.umd.cs.findbugs.ba.AnalysisContext.setAppClassList(AnalysisContext.java:941)
 [findbugs]       At edu.umd.cs.findbugs.FindBugs2.setAppClassList(FindBugs2.java:997)
 [findbugs]       At edu.umd.cs.findbugs.FindBugs2.execute(FindBugs2.java:225)
 [findbugs]       At edu.umd.cs.findbugs.FindBugs.runMain(FindBugs.java:393)
 [findbugs]       At edu.umd.cs.findbugs.FindBugs2.main(FindBugs2.java:1317)
 [findbugs]   Couldn't get class info for java/util/TreeMap$EntrySpliterator
 [findbugs]     java.lang.ArrayIndexOutOfBoundsException: 27753
 [findbugs]       At org.objectweb.asm.ClassReader.readClass(Unknown Source)
 [findbugs]       At org.objectweb.asm.ClassReader.accept(Unknown Source)
 [findbugs]       At edu.umd.cs.findbugs.asm.FBClassReader.accept(FBClassReader.java:44)
 [findbugs]       At org.objectweb.asm.ClassReader.accept(Unknown Source)
 [findbugs]       At edu.umd.cs.findbugs.classfile.engine.ClassParserUsingASM.parse(ClassParserUsingASM.java:110)
 [findbugs]       At edu.umd.cs.findbugs.classfile.engine.ClassParserUsingASM.parse(ClassParserUsingASM.java:587)
 [findbugs]       At edu.umd.cs.findbugs.classfile.engine.ClassInfoAnalysisEngine.analyze(ClassInfoAnalysisEngine.java:76)
 [findbugs]       At edu.umd.cs.findbugs.classfile.engine.ClassInfoAnalysisEngine.analyze(ClassInfoAnalysisEngine.java:38)
 [findbugs]       At edu.umd.cs.findbugs.classfile.impl.AnalysisCache.getClassAnalysis(AnalysisCache.java:268)
 [findbugs]       At edu.umd.cs.findbugs.ba.XFactory.getXClass(XFactory.java:652)
 [findbugs]       At edu.umd.cs.findbugs.ba.AnalysisContext.setAppClassList(AnalysisContext.java:932)
 [findbugs]       At edu.umd.cs.findbugs.FindBugs2.setAppClassList(FindBugs2.java:997)
 [findbugs]       At edu.umd.cs.findbugs.FindBugs2.execute(FindBugs2.java:225)
 [findbugs]       At edu.umd.cs.findbugs.FindBugs.runMain(FindBugs.java:393)
 [findbugs]       At edu.umd.cs.findbugs.FindBugs2.main(FindBugs2.java:1317)
 [findbugs]   Couldn't get class info for java/util/regex/Pattern
 [findbugs]     java.lang.ArrayIndexOutOfBoundsException: 1875
 [findbugs]       At org.objectweb.asm.ClassReader.readClass(Unknown Source)
 [findbugs]       At org.objectweb.asm.ClassReader.accept(Unknown Source)
 [findbugs]       At edu.umd.cs.findbugs.asm.FBClassReader.accept(FBClassReader.java:44)
 [findbugs]       At org.objectweb.asm.ClassReader.accept(Unknown Source)
 [findbugs]       At edu.umd.cs.findbugs.classfile.engine.ClassParserUsingASM.parse(ClassParserUsingASM.java:110)
 [findbugs]       At edu.umd.cs.findbugs.classfile.engine.ClassParserUsingASM.parse(ClassParserUsingASM.java:587)
 [findbugs]       At edu.umd.cs.findbugs.classfile.engine.ClassInfoAnalysisEngine.analyze(ClassInfoAnalysisEngine.java:76)
 [findbugs]       At edu.umd.cs.findbugs.classfile.engine.ClassInfoAnalysisEngine.analyze(ClassInfoAnalysisEngine.java:38)
 [findbugs]       At edu.umd.cs.findbugs.classfile.impl.AnalysisCache.getClassAnalysis(AnalysisCache.java:268)
 [findbugs]       At edu.umd.cs.findbugs.ba.XFactory.getXClass(XFactory.java:652)
 [findbugs]       At edu.umd.cs.findbugs.ba.AnalysisContext.setAppClassList(AnalysisContext.java:932)
 [findbugs]       At edu.umd.cs.findbugs.FindBugs2.setAppClassList(FindBugs2.java:997)
 [findbugs]       At edu.umd.cs.findbugs.FindBugs2.execute(FindBugs2.java:225)
 [findbugs]       At edu.umd.cs.findbugs.FindBugs.runMain(FindBugs.java:393)
 [findbugs]       At edu.umd.cs.findbugs.FindBugs2.main(FindBugs2.java:1317)
 [findbugs] 
 [findbugs] java.lang.ArrayIndexOutOfBoundsException: 35328
 [findbugs] 	at org.objectweb.asm.ClassReader.accept(Unknown Source)
 [findbugs] 	at edu.umd.cs.findbugs.asm.FBClassReader.accept(FBClassReader.java:44)
 [findbugs] 	at org.objectweb.asm.ClassReader.accept(Unknown Source)
 [findbugs] 	at edu.umd.cs.findbugs.classfile.engine.ClassParserUsingASM.parse(ClassParserUsingASM.java:110)
 [findbugs] 	at edu.umd.cs.findbugs.classfile.engine.ClassParserUsingASM.parse(ClassParserUsingASM.java:587)
 [findbugs] 	at edu.umd.cs.findbugs.classfile.engine.ClassInfoAnalysisEngine.analyze(ClassInfoAnalysisEngine.java:76)
 [findbugs] 	at edu.umd.cs.findbugs.classfile.engine.ClassInfoAnalysisEngine.analyze(ClassInfoAnalysisEngine.java:38)
 [findbugs] 	at edu.umd.cs.findbugs.classfile.impl.AnalysisCache.getClassAnalysis(AnalysisCache.java:268)
 [findbugs] 	at edu.umd.cs.findbugs.ba.XFactory.getXClass(XFactory.java:652)
 [findbugs] 	at edu.umd.cs.findbugs.ba.AnalysisContext.setAppClassList(AnalysisContext.java:932)
 [findbugs] 	at edu.umd.cs.findbugs.FindBugs2.setAppClassList(FindBugs2.java:997)
 [findbugs] 	at edu.umd.cs.findbugs.FindBugs2.execute(FindBugs2.java:225)
 [findbugs] 	at edu.umd.cs.findbugs.FindBugs.runMain(FindBugs.java:393)
 [findbugs] 	at edu.umd.cs.findbugs.FindBugs2.main(FindBugs2.java:1317)
 [findbugs] Java Result: 4

release-notes:
     [copy] Copying 1 file to <https://builds.apache.org/job/POI-JDK8/ws/build/dist>

rat-check:
    [mkdir] Created dir: <https://builds.apache.org/job/POI-JDK8/ws/build/rat>
     [echo] 
     [echo] *****************************************************
     [echo] Summary
     [echo] -------
     [echo] Generated at: 2016-05-16T10:31:23+00:00
     [echo] Notes: 1
     [echo] Binaries: 122
     [echo] Archives: 0
     [echo] Standards: 3475
     [echo] 
     [echo] Apache Licensed: 3473
     [echo] Generated Documents: 0
     [echo] 
     [echo] JavaDocs are generated and so license header is optional
     [echo] Generated files do not required license headers
     [echo] 
     [echo] 2 Unknown Licenses
     [echo] 
     [echo] *******************************
     [echo] 
     [echo] Unapproved licenses:
     [echo] 
     [echo]   <https://builds.apache.org/job/POI-JDK8/ws/src/integrationtest/commons-logging.properties>
     [echo]   <https://builds.apache.org/job/POI-JDK8/ws/src/integrationtest/log4j.properties>
     [echo] 
     [echo] *******************************
     [echo] 
     [echo] Archives:
     [echo] 
     [echo] *****************************************************
     [echo]   Files with Apache License headers will be marked AL
     [echo]   Binary files (which do not require AL headers) will be marked B
     [echo]   Compressed archives will be marked A
     [echo]   Notices, licenses etc will be marked N
     [echo]  !????? <https://builds.apache.org/job/POI-JDK8/ws/src/integrationtest/commons-logging.properties>
     [echo]  !????? <https://builds.apache.org/job/POI-JDK8/ws/src/integrationtest/log4j.properties>
     [echo]  
     [echo] *****************************************************

BUILD FAILED
<https://builds.apache.org/job/POI-JDK8/ws/build.xml>:2006: condition satisfied

Total time: 18 minutes 18 seconds
Build step 'Invoke Ant' marked build as failure
[FINDBUGS] Skipping publisher since build result is FAILURE
[WARNINGS] Skipping publisher since build result is FAILURE
Archiving artifacts
Compressed 140.85 MB of artifacts by 35.4% relative to #979
Recording test results

---------------------------------------------------------------------
To unsubscribe, e-mail: dev-unsubscribe@poi.apache.org
For additional commands, e-mail: dev-help@poi.apache.org


Mime
View raw message