poi-dev mailing list archives

Site index · List index
Message view « Date » · « Thread »
Top « Date » · « Thread »
From Apache Jenkins Server <jenk...@builds.apache.org>
Subject Build failed in Jenkins: POI-DSL-1.6 #346
Date Tue, 20 Jun 2017 10:01:57 GMT
See <https://builds.apache.org/job/POI-DSL-1.6/346/display/redirect?page=changes>

Changes:

[onealj] javadoc

------------------------------------------
[...truncated 93.88 KB...]
    [junit] Running org.apache.poi.ss.formula.functions.TestIndexFunctionFromSpreadsheet
    [junit] Tests run: 98, Failures: 0, Errors: 0, Skipped: 0, Time elapsed: 0.813 sec
    [junit] Running org.apache.poi.ss.formula.functions.TestIndirect
    [junit] Tests run: 3, Failures: 0, Errors: 0, Skipped: 0, Time elapsed: 0.018 sec
    [junit] Running org.apache.poi.ss.formula.functions.TestIndirectFunctionFromSpreadsheet
    [junit] Tests run: 11, Failures: 0, Errors: 0, Skipped: 0, Time elapsed: 0.084 sec
    [junit] Running org.apache.poi.ss.formula.functions.TestIntercept
    [junit] Tests run: 4, Failures: 0, Errors: 0, Skipped: 0, Time elapsed: 0.03 sec
    [junit] Running org.apache.poi.ss.formula.functions.TestIrr
    [junit] Tests run: 3, Failures: 0, Errors: 0, Skipped: 0, Time elapsed: 0.022 sec
    [junit] Running org.apache.poi.ss.formula.functions.TestIsBlank
    [junit] Tests run: 1, Failures: 0, Errors: 0, Skipped: 0, Time elapsed: 0.003 sec
    [junit] Running org.apache.poi.ss.formula.functions.TestLeftRight
    [junit] Tests run: 2, Failures: 0, Errors: 0, Skipped: 0, Time elapsed: 0.013 sec
    [junit] Running org.apache.poi.ss.formula.functions.TestLen
    [junit] Tests run: 3, Failures: 0, Errors: 0, Skipped: 0, Time elapsed: 0.022 sec
    [junit] Running org.apache.poi.ss.formula.functions.TestLogicalFunction
    [junit] Tests run: 2, Failures: 0, Errors: 0, Skipped: 0, Time elapsed: 0.014 sec
    [junit] Running org.apache.poi.ss.formula.functions.TestLookupFunctionsFromSpreadsheet
    [junit] Tests run: 199, Failures: 0, Errors: 0, Skipped: 0, Time elapsed: 1.698 sec
    [junit] Running org.apache.poi.ss.formula.functions.TestMatch
    [junit] Tests run: 9, Failures: 0, Errors: 0, Skipped: 0, Time elapsed: 0.068 sec
    [junit] Running org.apache.poi.ss.formula.functions.TestMatchFunctionsFromSpreadsheet
    [junit] Tests run: 13, Failures: 0, Errors: 0, Skipped: 0, Time elapsed: 0.1 sec
    [junit] Running org.apache.poi.ss.formula.functions.TestMathX
    [junit] Tests run: 23, Failures: 0, Errors: 0, Skipped: 0, Time elapsed: 0.188 sec
    [junit] Running org.apache.poi.ss.formula.functions.TestMid
    [junit] Tests run: 4, Failures: 0, Errors: 0, Skipped: 0, Time elapsed: 0.03 sec
    [junit] Running org.apache.poi.ss.formula.functions.TestMirr
    [junit] Tests run: 4, Failures: 0, Errors: 0, Skipped: 0, Time elapsed: 0.027 sec
    [junit] Running org.apache.poi.ss.formula.functions.TestNper
    [junit] Tests run: 2, Failures: 0, Errors: 0, Skipped: 0, Time elapsed: 0.014 sec
    [junit] Running org.apache.poi.ss.formula.functions.TestNpv
    [junit] Tests run: 2, Failures: 0, Errors: 0, Skipped: 0, Time elapsed: 0.014 sec
    [junit] Running org.apache.poi.ss.formula.functions.TestOct2Dec
    [junit] Tests run: 2, Failures: 0, Errors: 0, Skipped: 0, Time elapsed: 0.011 sec
    [junit] Running org.apache.poi.ss.formula.functions.TestOffset
    [junit] Tests run: 2, Failures: 0, Errors: 0, Skipped: 0, Time elapsed: 0.013 sec
    [junit] Running org.apache.poi.ss.formula.functions.TestPPMT
    [junit] Tests run: 1, Failures: 0, Errors: 0, Skipped: 0, Time elapsed: 0.007 sec
    [junit] Running org.apache.poi.ss.formula.functions.TestPmt
    [junit] Tests run: 2, Failures: 0, Errors: 0, Skipped: 0, Time elapsed: 0.012 sec
    [junit] Running org.apache.poi.ss.formula.functions.TestPoisson
    [junit] Tests run: 6, Failures: 0, Errors: 0, Skipped: 0, Time elapsed: 0.047 sec
    [junit] Running org.apache.poi.ss.formula.functions.TestQuotient
    [junit] Tests run: 2, Failures: 0, Errors: 0, Skipped: 0, Time elapsed: 0.013 sec
    [junit] Running org.apache.poi.ss.formula.functions.TestQuotientFunctionsFromSpreadsheet
    [junit] Tests run: 8, Failures: 0, Errors: 0, Skipped: 0, Time elapsed: 0.068 sec
    [junit] Running org.apache.poi.ss.formula.functions.TestRank
    [junit] Tests run: 1, Failures: 0, Errors: 0, Skipped: 0, Time elapsed: 0.027 sec
    [junit] Running org.apache.poi.ss.formula.functions.TestReptFunctionsFromSpreadsheet
    [junit] Tests run: 5, Failures: 0, Errors: 0, Skipped: 0, Time elapsed: 0.033 sec
    [junit] Running org.apache.poi.ss.formula.functions.TestRomanFunctionsFromSpreadsheet
    [junit] Tests run: 35, Failures: 0, Errors: 0, Skipped: 0, Time elapsed: 0.292 sec
    [junit] Running org.apache.poi.ss.formula.functions.TestRoundFuncs
    [junit] Tests run: 5, Failures: 0, Errors: 0, Skipped: 1, Time elapsed: 0.029 sec
    [junit] Running org.apache.poi.ss.formula.functions.TestRowCol
    [junit] Tests run: 4, Failures: 0, Errors: 0, Skipped: 0, Time elapsed: 0.057 sec
    [junit] Running org.apache.poi.ss.formula.functions.TestSlope
    [junit] Tests run: 3, Failures: 0, Errors: 0, Skipped: 0, Time elapsed: 0.022 sec
    [junit] Running org.apache.poi.ss.formula.functions.TestStatsLib
    [junit] Tests run: 9, Failures: 0, Errors: 0, Skipped: 0, Time elapsed: 0.095 sec
    [junit] Running org.apache.poi.ss.formula.functions.TestSubtotal
    [junit] Tests run: 11, Failures: 0, Errors: 0, Skipped: 0, Time elapsed: 0.088 sec
    [junit] Running org.apache.poi.ss.formula.functions.TestSumif
    [junit] Tests run: 3, Failures: 0, Errors: 0, Skipped: 0, Time elapsed: 0.036 sec
    [junit] Running org.apache.poi.ss.formula.functions.TestSumifs
    [junit] Tests run: 7, Failures: 0, Errors: 0, Skipped: 0, Time elapsed: 0.054 sec
    [junit] Running org.apache.poi.ss.formula.functions.TestSumproduct
    [junit] Tests run: 5, Failures: 0, Errors: 0, Skipped: 0, Time elapsed: 0.038 sec
    [junit] Running org.apache.poi.ss.formula.functions.TestTFunc
    [junit] Tests run: 5, Failures: 0, Errors: 0, Skipped: 0, Time elapsed: 0.037 sec
    [junit] Running org.apache.poi.ss.formula.functions.TestText
    [junit] Tests run: 4, Failures: 0, Errors: 0, Skipped: 0, Time elapsed: 0.031 sec
    [junit] Running org.apache.poi.ss.formula.functions.TestTime
    [junit] Tests run: 2, Failures: 0, Errors: 0, Skipped: 0, Time elapsed: 0.013 sec
    [junit] Running org.apache.poi.ss.formula.functions.TestTrim
    [junit] Tests run: 3, Failures: 0, Errors: 0, Skipped: 0, Time elapsed: 0.021 sec
    [junit] Running org.apache.poi.ss.formula.functions.TestTrunc
    [junit] Tests run: 5, Failures: 0, Errors: 0, Skipped: 0, Time elapsed: 0.039 sec
    [junit] Running org.apache.poi.ss.formula.functions.TestValue
    [junit] Tests run: 2, Failures: 0, Errors: 0, Skipped: 0, Time elapsed: 0.014 sec
    [junit] Running org.apache.poi.ss.formula.functions.TestWeekNumFunctionsFromSpreadsheet
    [junit] Tests run: 7, Failures: 0, Errors: 0, Skipped: 0, Time elapsed: 0.052 sec
    [junit] Running org.apache.poi.ss.formula.functions.TestWeekNumFunctionsFromSpreadsheet2013
    [junit] Tests run: 7, Failures: 0, Errors: 0, Skipped: 0, Time elapsed: 0.052 sec
    [junit] Running org.apache.poi.ss.formula.functions.TestWeekdayFunc
    [junit] Tests run: 2, Failures: 0, Errors: 0, Skipped: 0, Time elapsed: 0.013 sec
    [junit] Running org.apache.poi.ss.formula.functions.TestXYNumericFunction
    [junit] Tests run: 3, Failures: 0, Errors: 0, Skipped: 0, Time elapsed: 0.022 sec
    [junit] Running org.apache.poi.ss.formula.ptg.TestArea3DPtg
    [junit] Tests run: 1, Failures: 0, Errors: 0, Skipped: 0, Time elapsed: 0.003 sec
    [junit] Running org.apache.poi.ss.formula.ptg.TestAreaErrPtg
    [junit] Tests run: 1, Failures: 0, Errors: 0, Skipped: 0, Time elapsed: 0.006 sec
    [junit] Running org.apache.poi.ss.formula.ptg.TestAreaPtg
    [junit] Tests run: 5, Failures: 0, Errors: 0, Skipped: 0, Time elapsed: 0.037 sec
    [junit] Running org.apache.poi.ss.formula.ptg.TestArrayPtg
    [junit] Tests run: 5, Failures: 0, Errors: 0, Skipped: 0, Time elapsed: 0.037 sec
    [junit] Running org.apache.poi.ss.formula.ptg.TestAttrPtg
    [junit] Tests run: 1, Failures: 0, Errors: 0, Skipped: 0, Time elapsed: 0.005 sec
    [junit] Running org.apache.poi.ss.formula.ptg.TestErrPtg
    [junit] Tests run: 1, Failures: 0, Errors: 0, Skipped: 0, Time elapsed: 0.006 sec
    [junit] Running org.apache.poi.ss.formula.ptg.TestExternalFunctionFormulas
    [junit] Tests run: 3, Failures: 0, Errors: 0, Skipped: 0, Time elapsed: 0.028 sec
    [junit] Running org.apache.poi.ss.formula.ptg.TestExternalNameReference
    [junit] Tests run: 3, Failures: 0, Errors: 0, Skipped: 0, Time elapsed: 0.021 sec
    [junit] Running org.apache.poi.ss.formula.ptg.TestFuncPtg
    [junit] Tests run: 2, Failures: 0, Errors: 0, Skipped: 0, Time elapsed: 0.012 sec
    [junit] Running org.apache.poi.ss.formula.ptg.TestFuncVarPtg
    [junit] Tests run: 1, Failures: 0, Errors: 0, Skipped: 0, Time elapsed: 0.005 sec
    [junit] Running org.apache.poi.ss.formula.ptg.TestIntersectionPtg
    [junit] Tests run: 1, Failures: 0, Errors: 0, Skipped: 0, Time elapsed: 0.006 sec
    [junit] Running org.apache.poi.ss.formula.ptg.TestPercentPtg
    [junit] Tests run: 1, Failures: 0, Errors: 0, Skipped: 0, Time elapsed: 0.005 sec
    [junit] Running org.apache.poi.ss.formula.ptg.TestRangePtg
    [junit] Tests run: 1, Failures: 0, Errors: 0, Skipped: 0, Time elapsed: 0.006 sec
    [junit] Running org.apache.poi.ss.formula.ptg.TestRef3DPtg
    [junit] Tests run: 1, Failures: 0, Errors: 0, Skipped: 0, Time elapsed: 0.004 sec
    [junit] Running org.apache.poi.ss.formula.ptg.TestReferencePtg
    [junit] Tests run: 4, Failures: 0, Errors: 0, Skipped: 0, Time elapsed: 0.03 sec
    [junit] Running org.apache.poi.ss.formula.ptg.TestUnionPtg
    [junit] Tests run: 1, Failures: 0, Errors: 0, Skipped: 0, Time elapsed: 0.006 sec
    [junit] Running org.apache.poi.ss.formula.udf.TestAggregatingUDFFinder
    [junit] Tests run: 2, Failures: 0, Errors: 0, Skipped: 0, Time elapsed: 0.012 sec
    [junit] Running org.apache.poi.ss.formula.udf.TestDefaultUDFFinder
    [junit] Tests run: 1, Failures: 0, Errors: 0, Skipped: 0, Time elapsed: 0.005 sec
    [junit] Running org.apache.poi.ss.usermodel.TestDataFormatter
    [junit] Tests run: 28, Failures: 0, Errors: 0, Skipped: 1, Time elapsed: 0.219 sec
    [junit] Running org.apache.poi.ss.usermodel.TestDateUtil
    [junit] Tests run: 5, Failures: 0, Errors: 0, Skipped: 0, Time elapsed: 0.038 sec
    [junit] Running org.apache.poi.ss.usermodel.TestExcelStyleDateFormatter
    [junit] Tests run: 4, Failures: 0, Errors: 0, Skipped: 0, Time elapsed: 0.074 sec
    [junit] Running org.apache.poi.ss.usermodel.TestFractionFormat
    [junit] Tests run: 2, Failures: 0, Errors: 0, Skipped: 0, Time elapsed: 0.255 sec
    [junit] Running org.apache.poi.ss.usermodel.TestHSSFBorderStyle
    [junit] Tests run: 1, Failures: 0, Errors: 0, Skipped: 0, Time elapsed: 0.002 sec
    [junit] Running org.apache.poi.ss.usermodel.TestIndexedColors
    [junit] Tests run: 3, Failures: 0, Errors: 0, Skipped: 0, Time elapsed: 0.026 sec
    [junit] Running org.apache.poi.ss.usermodel.charts.TestDataSources
    [junit] Tests run: 6, Failures: 0, Errors: 0, Skipped: 0, Time elapsed: 0.046 sec
    [junit] Running org.apache.poi.ss.util.TestAreaReference
    [junit] Tests run: 3, Failures: 0, Errors: 0, Skipped: 0, Time elapsed: 0.021 sec
    [junit] Running org.apache.poi.ss.util.TestCellAddress
    [junit] Tests run: 6, Failures: 0, Errors: 0, Skipped: 0, Time elapsed: 0.046 sec
    [junit] Running org.apache.poi.ss.util.TestCellRangeAddress
    [junit] Tests run: 13, Failures: 0, Errors: 0, Skipped: 0, Time elapsed: 0.105 sec
    [junit] Running org.apache.poi.ss.util.TestCellReference
    [junit] Tests run: 25, Failures: 0, Errors: 0, Skipped: 0, Time elapsed: 0.204 sec
    [junit] Running org.apache.poi.ss.util.TestDateFormatConverter
    [junit] Open /tmp/poifiles/LocaleDatesDefault42629912729839563.xlsx in Excel
    [junit] Open /tmp/poifiles/LocaleDatesShort7789867352975479583.xlsx in Excel
    [junit] Open /tmp/poifiles/LocaleDatesMedium5349560166004298102.xlsx in Excel
    [junit] Open /tmp/poifiles/LocaleDatesLong1746951643632065821.xlsx in Excel
    [junit] Open /tmp/poifiles/LocaleDatesFull5232569843630654300.xlsx in Excel
    [junit] Open /tmp/poifiles/LocaleDateTimesDefault5505516442642363420.xlsx in Excel
    [junit] Open /tmp/poifiles/LocaleDateTimesShort3559647647350966564.xlsx in Excel
    [junit] Open /tmp/poifiles/LocaleDateTimesMedium7372523374965840688.xlsx in Excel
    [junit] Open /tmp/poifiles/LocaleDateTimesLong7991908882866334335.xlsx in Excel
    [junit] Open /tmp/poifiles/LocaleDateTimesFull8571394882718659369.xlsx in Excel
    [junit] Open /tmp/poifiles/LocaleTimesDefault5899494462251895689.xlsx in Excel
    [junit] Open /tmp/poifiles/LocaleTimesShort4167246302101986006.xlsx in Excel
    [junit] Open /tmp/poifiles/LocaleTimesMedium2330579789258404161.xlsx in Excel
    [junit] Open /tmp/poifiles/LocaleTimesLong48725507267612135.xlsx in Excel
    [junit] Open /tmp/poifiles/LocaleTimesFull3284191674427890276.xlsx in Excel
    [junit] Tests run: 2, Failures: 0, Errors: 0, Skipped: 0, Time elapsed: 0.97 sec
    [junit] Running org.apache.poi.ss.util.TestExpandedDouble
    [junit] Tests run: 3, Failures: 0, Errors: 0, Skipped: 0, Time elapsed: 0.023 sec
    [junit] Running org.apache.poi.ss.util.TestHSSFCellUtil
    [junit] setCellStyleProps start
    [junit] setCellStyleProps nearing end
    [junit] Tests run: 14, Failures: 0, Errors: 0, Skipped: 0, Time elapsed: 0.112 sec
    [junit] Running org.apache.poi.ss.util.TestNumberComparer
    [junit] Tests run: 4, Failures: 0, Errors: 0, Skipped: 0, Time elapsed: 0.139 sec
    [junit] Running org.apache.poi.ss.util.TestNumberToTextConverter
    [junit] Tests run: 2, Failures: 0, Errors: 0, Skipped: 0, Time elapsed: 0.013 sec
    [junit] Running org.apache.poi.ss.util.TestPropertyTemplate
    [junit] Tests run: 8, Failures: 0, Errors: 0, Skipped: 0, Time elapsed: 0.062 sec
    [junit] Running org.apache.poi.ss.util.TestRegionUtil
    [junit] Tests run: 10, Failures: 0, Errors: 0, Skipped: 0, Time elapsed: 0.077 sec
    [junit] Running org.apache.poi.ss.util.TestSheetBuilder
    [junit] Tests run: 3, Failures: 0, Errors: 0, Skipped: 0, Time elapsed: 0.02 sec
    [junit] Running org.apache.poi.ss.util.TestSheetUtil
    [junit] Tests run: 7, Failures: 0, Errors: 0, Skipped: 0, Time elapsed: 0.055 sec
    [junit] Running org.apache.poi.ss.util.TestWorkbookUtil
    [junit] Tests run: 1, Failures: 0, Errors: 0, Skipped: 0, Time elapsed: 0.005 sec
    [junit] Running org.apache.poi.ss.util.cellwalk.TestCellWalk
    [junit] Tests run: 1, Failures: 0, Errors: 0, Skipped: 0, Time elapsed: 0.006 sec
    [junit] Running org.apache.poi.util.TestArrayUtil
    [junit] Tests run: 2, Failures: 0, Errors: 0, Skipped: 0, Time elapsed: 0.011 sec
    [junit] Running org.apache.poi.util.TestBitField
    [junit] Tests run: 16, Failures: 0, Errors: 0, Skipped: 0, Time elapsed: 0.133 sec
    [junit] Running org.apache.poi.util.TestByteField
    [junit] Tests run: 5, Failures: 0, Errors: 0, Skipped: 0, Time elapsed: 0.036 sec
    [junit] Running org.apache.poi.util.TestHexDump
    [junit] 00000000 74 65 73 74 73 74 72 69 6E 67                   teststring
    [junit] 
    [junit] Tests run: 10, Failures: 0, Errors: 0, Skipped: 0, Time elapsed: 0.08 sec
    [junit] Running org.apache.poi.util.TestIntList
    [junit] Tests run: 18, Failures: 0, Errors: 0, Skipped: 0, Time elapsed: 0.155 sec
    [junit] Running org.apache.poi.util.TestIntegerField
    [junit] Tests run: 5, Failures: 0, Errors: 0, Skipped: 0, Time elapsed: 0.037 sec
    [junit] Running org.apache.poi.util.TestLittleEndian
    [junit] Tests run: 14, Failures: 0, Errors: 0, Skipped: 0, Time elapsed: 0.113 sec
    [junit] Running org.apache.poi.util.TestLittleEndianCP950Reader
    [junit] 65235
    [junit] Tests run: 2, Failures: 0, Errors: 0, Skipped: 0, Time elapsed: 0.02 sec
    [junit] Running org.apache.poi.util.TestLittleEndianStreams
    [junit] Tests run: 2, Failures: 0, Errors: 0, Skipped: 0, Time elapsed: 0.014 sec
    [junit] Running org.apache.poi.util.TestLocaleUtil
    [junit] Tests run: 3, Failures: 0, Errors: 0, Skipped: 0, Time elapsed: 0.017 sec
    [junit] Running org.apache.poi.util.TestLongField
    [junit] Tests run: 5, Failures: 0, Errors: 0, Skipped: 0, Time elapsed: 0.038 sec
    [junit] Running org.apache.poi.util.TestPOILogFactory
    [junit] Tests run: 1, Failures: 0, Errors: 0, Skipped: 0, Time elapsed: 0.005 sec
    [junit] Running org.apache.poi.util.TestPOILogger
    [junit] Tests run: 1, Failures: 0, Errors: 0, Skipped: 0, Time elapsed: 0.003 sec
    [junit] Running org.apache.poi.util.TestRLEDecompressingInputStream
    [junit] Tests run: 4, Failures: 0, Errors: 0, Skipped: 0, Time elapsed: 0.03 sec
    [junit] Running org.apache.poi.util.TestShortField
    [junit] Tests run: 5, Failures: 0, Errors: 0, Skipped: 0, Time elapsed: 0.041 sec
    [junit] Running org.apache.poi.util.TestStringUtil
    [junit] Tests run: 8, Failures: 0, Errors: 0, Skipped: 0, Time elapsed: 0.063 sec
    [junit] Running org.apache.poi.util.TestTempFile
    [junit] Tests run: 4, Failures: 0, Errors: 0, Skipped: 0, Time elapsed: 0.03 sec

-test-main-write-testfile:

-test-scratchpad-check:

test-scratchpad-download-resources:

test-scratchpad:
[jacoco:coverage] Enhancing junit with coverage
    [junit] Error occurred during initialization of VM
    [junit] agent library failed to init: instrument
    [junit] Error opening zip file or JAR manifest missing : /tmp/jacocoagent7675058769088023333.jar
    [junit] Running org.apache.poi.hwpf.usermodel.Batch-With-Multiple-Tests
    [junit] Tests run: 1, Failures: 0, Errors: 1, Skipped: 0, Time elapsed: 0 sec

BUILD FAILED
<https://builds.apache.org/job/POI-DSL-1.6/ws/build.xml>:1415: Tests failed (crashed)

Total time: 5 minutes 53 seconds
Build step 'Invoke Ant' marked build as failure
Skipping publisher since build result is FAILURE
Archiving artifacts
Compressed 66.31 MB of artifacts by 65.4% relative to #342
Skipping publisher since build result is FAILURE
Recording test results

---------------------------------------------------------------------
To unsubscribe, e-mail: dev-unsubscribe@poi.apache.org
For additional commands, e-mail: dev-help@poi.apache.org


Mime
View raw message