poi-dev mailing list archives

Site index · List index
Message view « Date » · « Thread »
Top « Date » · « Thread »
From Apache Jenkins Server <jenk...@builds.apache.org>
Subject Build failed in Jenkins: POI-DSL-old-Xerces #96
Date Fri, 07 Sep 2018 20:57:42 GMT
See <https://builds.apache.org/job/POI-DSL-old-Xerces/96/display/redirect?page=changes>

Changes:

[centic] Use different directory for xerces-jar so we do not remove it again as part of check-jars

[kiwiwings] update 3.17 leftovers and provide a new build target to update those in the next
release
remove final / beta tags, as we (try to) use semver now

[fanningpj] [bug-62692] issue when using widlfy xml parser

[kiwiwings] update docs to 4.0.0 - fix 3.17 leftovers

[kiwiwings] update docs to 4.0.0

[abearez] import existing chart on current drawing

------------------------------------------
[...truncated 412.90 KB...]
     [java] .I...................................................................................................
     [java] 144/243: listLiteralsQuotesAreStripped_arrayConstructor(org.apache.poi.xssf.usermodel.TestXSSFDataValidationConstraint)
     [java] ....................................................................................................
     [java] 156/243: testSetLeftToRight(org.apache.poi.xssf.usermodel.TestXSSFPrintSetup)
     [java] ...............................................................................................III.I..I..
     [java] 165/243: bug22568(org.apache.poi.xssf.usermodel.TestSXSSFBugs)
     [java] .....I.......I.....I...................................................................................
     [java] 168/243: testCloneStyleSameWB(org.apache.poi.xssf.usermodel.TestXSSFCellStyle)
     [java] ............................................................................E........................
     [java] 179/243: mergedCells(org.apache.poi.xssf.usermodel.TestXSSFSheetAutosizeColumn)
     [java] [Fatal Error] :-1:-1: The parser has encountered more than "1" entity expansions
in this document; this is the limit imposed by the application.
     [java] Cleaning up unclosed ZipFile for archive <https://builds.apache.org/job/POI-DSL-old-Xerces/ws/test-data/spreadsheet/54764.xlsx>
     [java] ..........................................I..........................................................
     [java] 184/243: bug56468(org.apache.poi.xssf.usermodel.TestXSSFBugs)
     [java] Cleaning up unclosed ZipFile for archive <https://builds.apache.org/job/POI-DSL-old-Xerces/ws/test-data/spreadsheet/54764.xlsx>
     [java] ....................I......II............I...I........................I.........I.....I.....................
     [java] 185/243: testSetTextSingleParagraph(org.apache.poi.xssf.usermodel.TestXSSFDrawing)
     [java] ...............................................................................................I.I....I
     [java] 191/243: testReferencesToOtherWorkbooks(org.apache.poi.xssf.usermodel.TestXSSFFormulaEvaluation)
     [java] ........................................................I............................................
     [java] 206/243: testCreatePivotTableInOtherSheetThanDataSheet(org.apache.poi.xssf.usermodel.TestXSSFSheet)
     [java] ....................................................................................................
     [java] 208/243: processFunctionRow[LessEqualEval](org.apache.poi.xssf.usermodel.TestFormulaEvaluatorOnXSSF)
     [java] ....................................................................................................
     [java] 208/243: processFunctionRow[Enabletool](org.apache.poi.xssf.usermodel.TestFormulaEvaluatorOnXSSF)
     [java] ....................................................................................................
     [java] 208/243: processFunctionRow[Log10](org.apache.poi.xssf.usermodel.TestFormulaEvaluatorOnXSSF)
     [java] ....................................................................................................
     [java] 208/243: processFunctionRow[Sinh](org.apache.poi.xssf.usermodel.TestFormulaEvaluatorOnXSSF)
     [java] ....................................................................................................
     [java] 216/243: testGetXmlColumnPrs(org.apache.poi.xssf.usermodel.TestXSSFTableColumn)
     [java] .........................I.............................................................E..............
     [java] 232/243: saveToOutputStream(org.apache.poi.openxml4j.opc.TestPackage)
     [java] Cleaning up unclosed ZipFile for archive <https://builds.apache.org/job/POI-DSL-old-Xerces/ws/test-data/openxml4j/TestPackageCommon.docx>
     [java] Exception in thread "main" java.lang.RuntimeException: Tests did not succeed,
cannot build ooxml-lite jar
     [java] 	at org.apache.poi.ooxml.util.OOXMLLite.build(OOXMLLite.java:191)
     [java] 	at org.apache.poi.ooxml.util.OOXMLLite.main(OOXMLLite.java:107)
     [java] ......I............................................
     [java] Time: 140.013
     [java] There were 4 failures:
     [java] 1) testXMLReader(org.apache.poi.ooxml.util.TestSAXHelper)
     [java] org.xml.sax.SAXNotRecognizedException: http://javax.xml.XMLConstants/feature/secure-processing
     [java] 	at org.apache.xerces.parsers.AbstractSAXParser.getFeature(Unknown Source)
     [java] 	at org.apache.poi.ooxml.util.TestSAXHelper.testXMLReader(TestSAXHelper.java:34)
     [java] 	at sun.reflect.NativeMethodAccessorImpl.invoke0(Native Method)
     [java] 	at sun.reflect.NativeMethodAccessorImpl.invoke(NativeMethodAccessorImpl.java:62)
     [java] 	at sun.reflect.DelegatingMethodAccessorImpl.invoke(DelegatingMethodAccessorImpl.java:43)
     [java] 	at java.lang.reflect.Method.invoke(Method.java:498)
     [java] 	at org.junit.runners.model.FrameworkMethod$1.runReflectiveCall(FrameworkMethod.java:50)
     [java] 	at org.junit.internal.runners.model.ReflectiveCallable.run(ReflectiveCallable.java:12)
     [java] 	at org.junit.runners.model.FrameworkMethod.invokeExplosively(FrameworkMethod.java:47)
     [java] 	at org.junit.internal.runners.statements.InvokeMethod.evaluate(InvokeMethod.java:17)
     [java] 	at org.junit.runners.ParentRunner.runLeaf(ParentRunner.java:325)
     [java] 	at org.junit.runners.BlockJUnit4ClassRunner.runChild(BlockJUnit4ClassRunner.java:78)
     [java] 	at org.junit.runners.BlockJUnit4ClassRunner.runChild(BlockJUnit4ClassRunner.java:57)
     [java] 	at org.junit.runners.ParentRunner$3.run(ParentRunner.java:290)
     [java] 	at org.junit.runners.ParentRunner$1.schedule(ParentRunner.java:71)
     [java] 	at org.junit.runners.ParentRunner.runChildren(ParentRunner.java:288)
     [java] 	at org.junit.runners.ParentRunner.access$000(ParentRunner.java:58)
     [java] 	at org.junit.runners.ParentRunner$2.evaluate(ParentRunner.java:268)
     [java] 	at org.junit.runners.ParentRunner.run(ParentRunner.java:363)
     [java] 	at org.junit.runners.Suite.runChild(Suite.java:128)
     [java] 	at org.junit.runners.Suite.runChild(Suite.java:27)
     [java] 	at org.junit.runners.ParentRunner$3.run(ParentRunner.java:290)
     [java] 	at org.junit.runners.ParentRunner$1.schedule(ParentRunner.java:71)
     [java] 	at org.junit.runners.ParentRunner.runChildren(ParentRunner.java:288)
     [java] 	at org.junit.runners.ParentRunner.access$000(ParentRunner.java:58)
     [java] 	at org.junit.runners.ParentRunner$2.evaluate(ParentRunner.java:268)
     [java] 	at org.junit.runners.ParentRunner.run(ParentRunner.java:363)
     [java] 	at org.junit.runner.JUnitCore.run(JUnitCore.java:137)
     [java] 	at org.junit.runner.JUnitCore.run(JUnitCore.java:115)
     [java] 	at org.junit.runner.JUnitCore.run(JUnitCore.java:105)
     [java] 	at org.junit.runner.JUnitCore.run(JUnitCore.java:94)
     [java] 	at org.apache.poi.ooxml.util.OOXMLLite.build(OOXMLLite.java:189)
     [java] 	at org.apache.poi.ooxml.util.OOXMLLite.main(OOXMLLite.java:107)
     [java] 2) testDocumentBuilderFactory(org.apache.poi.ooxml.util.TestDocumentHelper)
     [java] java.lang.AbstractMethodError: javax.xml.parsers.DocumentBuilderFactory.getFeature(Ljava/lang/String;)Z
     [java] 	at org.apache.poi.ooxml.util.TestDocumentHelper.testDocumentBuilderFactory(TestDocumentHelper.java:40)
     [java] 	at sun.reflect.NativeMethodAccessorImpl.invoke0(Native Method)
     [java] 	at sun.reflect.NativeMethodAccessorImpl.invoke(NativeMethodAccessorImpl.java:62)
     [java] 	at sun.reflect.DelegatingMethodAccessorImpl.invoke(DelegatingMethodAccessorImpl.java:43)
     [java] 	at java.lang.reflect.Method.invoke(Method.java:498)
     [java] 	at org.junit.runners.model.FrameworkMethod$1.runReflectiveCall(FrameworkMethod.java:50)
     [java] 	at org.junit.internal.runners.model.ReflectiveCallable.run(ReflectiveCallable.java:12)
     [java] 	at org.junit.runners.model.FrameworkMethod.invokeExplosively(FrameworkMethod.java:47)
     [java] 	at org.junit.internal.runners.statements.InvokeMethod.evaluate(InvokeMethod.java:17)
     [java] 	at org.junit.runners.ParentRunner.runLeaf(ParentRunner.java:325)
     [java] 	at org.junit.runners.BlockJUnit4ClassRunner.runChild(BlockJUnit4ClassRunner.java:78)
     [java] 	at org.junit.runners.BlockJUnit4ClassRunner.runChild(BlockJUnit4ClassRunner.java:57)
     [java] 	at org.junit.runners.ParentRunner$3.run(ParentRunner.java:290)
     [java] 	at org.junit.runners.ParentRunner$1.schedule(ParentRunner.java:71)
     [java] 	at org.junit.runners.ParentRunner.runChildren(ParentRunner.java:288)
     [java] 	at org.junit.runners.ParentRunner.access$000(ParentRunner.java:58)
     [java] 	at org.junit.runners.ParentRunner$2.evaluate(ParentRunner.java:268)
     [java] 	at org.junit.runners.ParentRunner.run(ParentRunner.java:363)
     [java] 	at org.junit.runners.Suite.runChild(Suite.java:128)
     [java] 	at org.junit.runners.Suite.runChild(Suite.java:27)
     [java] 	at org.junit.runners.ParentRunner$3.run(ParentRunner.java:290)
     [java] 	at org.junit.runners.ParentRunner$1.schedule(ParentRunner.java:71)
     [java] 	at org.junit.runners.ParentRunner.runChildren(ParentRunner.java:288)
     [java] 	at org.junit.runners.ParentRunner.access$000(ParentRunner.java:58)
     [java] 	at org.junit.runners.ParentRunner$2.evaluate(ParentRunner.java:268)
     [java] 	at org.junit.runners.ParentRunner.run(ParentRunner.java:363)
     [java] 	at org.junit.runner.JUnitCore.run(JUnitCore.java:137)
     [java] 	at org.junit.runner.JUnitCore.run(JUnitCore.java:115)
     [java] 	at org.junit.runner.JUnitCore.run(JUnitCore.java:105)
     [java] 	at org.junit.runner.JUnitCore.run(JUnitCore.java:94)
     [java] 	at org.apache.poi.ooxml.util.OOXMLLite.build(OOXMLLite.java:189)
     [java] 	at org.apache.poi.ooxml.util.OOXMLLite.main(OOXMLLite.java:107)
     [java] 3) testBuiltinStyleInit(org.apache.poi.xssf.usermodel.TestTableStyles)
     [java] java.lang.AbstractMethodError: org.apache.xml.serialize.DOMSerializerImpl.getDomConfig()Lorg/w3c/dom/DOMConfiguration;
     [java] 	at org.apache.poi.xssf.usermodel.XSSFBuiltinTableStyle.styleXML(XSSFBuiltinTableStyle.java:424)
     [java] 	at org.apache.poi.xssf.usermodel.XSSFBuiltinTableStyle.init(XSSFBuiltinTableStyle.java:406)
     [java] 	at org.apache.poi.xssf.usermodel.XSSFBuiltinTableStyle.getStyle(XSSFBuiltinTableStyle.java:346)
     [java] 	at org.apache.poi.xssf.usermodel.TestTableStyles.testBuiltinStyleInit(TestTableStyles.java:45)
     [java] 	at sun.reflect.NativeMethodAccessorImpl.invoke0(Native Method)
     [java] 	at sun.reflect.NativeMethodAccessorImpl.invoke(NativeMethodAccessorImpl.java:62)
     [java] 	at sun.reflect.DelegatingMethodAccessorImpl.invoke(DelegatingMethodAccessorImpl.java:43)
     [java] 	at java.lang.reflect.Method.invoke(Method.java:498)
     [java] 	at org.junit.runners.model.FrameworkMethod$1.runReflectiveCall(FrameworkMethod.java:50)
     [java] 	at org.junit.internal.runners.model.ReflectiveCallable.run(ReflectiveCallable.java:12)
     [java] 	at org.junit.runners.model.FrameworkMethod.invokeExplosively(FrameworkMethod.java:47)
     [java] 	at org.junit.internal.runners.statements.InvokeMethod.evaluate(InvokeMethod.java:17)
     [java] 	at org.junit.runners.ParentRunner.runLeaf(ParentRunner.java:325)
     [java] 	at org.junit.runners.BlockJUnit4ClassRunner.runChild(BlockJUnit4ClassRunner.java:78)
     [java] 	at org.junit.runners.BlockJUnit4ClassRunner.runChild(BlockJUnit4ClassRunner.java:57)
     [java] 	at org.junit.runners.ParentRunner$3.run(ParentRunner.java:290)
     [java] 	at org.junit.runners.ParentRunner$1.schedule(ParentRunner.java:71)
     [java] 	at org.junit.runners.ParentRunner.runChildren(ParentRunner.java:288)
     [java] 	at org.junit.runners.ParentRunner.access$000(ParentRunner.java:58)
     [java] 	at org.junit.runners.ParentRunner$2.evaluate(ParentRunner.java:268)
     [java] 	at org.junit.runners.ParentRunner.run(ParentRunner.java:363)
     [java] 	at org.junit.runners.Suite.runChild(Suite.java:128)
     [java] 	at org.junit.runners.Suite.runChild(Suite.java:27)
     [java] 	at org.junit.runners.ParentRunner$3.run(ParentRunner.java:290)
     [java] 	at org.junit.runners.ParentRunner$1.schedule(ParentRunner.java:71)
     [java] 	at org.junit.runners.ParentRunner.runChildren(ParentRunner.java:288)
     [java] 	at org.junit.runners.ParentRunner.access$000(ParentRunner.java:58)
     [java] 	at org.junit.runners.ParentRunner$2.evaluate(ParentRunner.java:268)
     [java] 	at org.junit.runners.ParentRunner.run(ParentRunner.java:363)
     [java] 	at org.junit.runner.JUnitCore.run(JUnitCore.java:137)
     [java] 	at org.junit.runner.JUnitCore.run(JUnitCore.java:115)
     [java] 	at org.junit.runner.JUnitCore.run(JUnitCore.java:105)
     [java] 	at org.junit.runner.JUnitCore.run(JUnitCore.java:94)
     [java] 	at org.apache.poi.ooxml.util.OOXMLLite.build(OOXMLLite.java:189)
     [java] 	at org.apache.poi.ooxml.util.OOXMLLite.main(OOXMLLite.java:107)
     [java] 4) zipBombCheckSizesWithinLimits(org.apache.poi.openxml4j.opc.TestPackage)
     [java] org.apache.poi.ooxml.POIXMLException: Zip bomb detected! The file would exceed
the max size of the expanded data in the zip-file.
     [java] This may indicates that the file is used to inflate memory usage and thus could
pose a security risk.
     [java] You can adjust this limit via ZipSecureFile.setMaxEntrySize() if you need to work
with files which are very large.
     [java] Uncompressed size: 1048807, Raw/compressed size: 57587
     [java] Limits: MAX_ENTRY_SIZE: 1048783, Entry: xl/sharedStrings.xml
     [java] 	at org.apache.poi.ooxml.POIXMLFactory.createDocumentPart(POIXMLFactory.java:66)
     [java] 	at org.apache.poi.ooxml.POIXMLDocumentPart.read(POIXMLDocumentPart.java:648)
     [java] 	at org.apache.poi.ooxml.POIXMLDocument.load(POIXMLDocument.java:180)
     [java] 	at org.apache.poi.xssf.usermodel.XSSFWorkbook.<init>(XSSFWorkbook.java:286)
     [java] 	at org.apache.poi.xssf.usermodel.XSSFWorkbookFactory.createWorkbook(XSSFWorkbookFactory.java:83)
     [java] 	at org.apache.poi.xssf.usermodel.XSSFWorkbookFactory.createWorkbook(XSSFWorkbookFactory.java:111)
     [java] 	at sun.reflect.NativeMethodAccessorImpl.invoke0(Native Method)
     [java] 	at sun.reflect.NativeMethodAccessorImpl.invoke(NativeMethodAccessorImpl.java:62)
     [java] 	at sun.reflect.DelegatingMethodAccessorImpl.invoke(DelegatingMethodAccessorImpl.java:43)
     [java] 	at java.lang.reflect.Method.invoke(Method.java:498)
     [java] 	at org.apache.poi.ss.usermodel.WorkbookFactory.createWorkbook(WorkbookFactory.java:314)
     [java] 	at org.apache.poi.ss.usermodel.WorkbookFactory.createXSSFWorkbook(WorkbookFactory.java:296)
     [java] 	at org.apache.poi.ss.usermodel.WorkbookFactory.create(WorkbookFactory.java:284)
     [java] 	at org.apache.poi.openxml4j.opc.TestPackage.getZipStatsAndConsume(TestPackage.java:938)
     [java] 	at org.apache.poi.openxml4j.opc.TestPackage.zipBombCheckSizesWithinLimits(TestPackage.java:884)
     [java] 	at sun.reflect.NativeMethodAccessorImpl.invoke0(Native Method)
     [java] 	at sun.reflect.NativeMethodAccessorImpl.invoke(NativeMethodAccessorImpl.java:62)
     [java] 	at sun.reflect.DelegatingMethodAccessorImpl.invoke(DelegatingMethodAccessorImpl.java:43)
     [java] 	at java.lang.reflect.Method.invoke(Method.java:498)
     [java] 	at org.junit.runners.model.FrameworkMethod$1.runReflectiveCall(FrameworkMethod.java:50)
     [java] 	at org.junit.internal.runners.model.ReflectiveCallable.run(ReflectiveCallable.java:12)
     [java] 	at org.junit.runners.model.FrameworkMethod.invokeExplosively(FrameworkMethod.java:47)
     [java] 	at org.junit.internal.runners.statements.InvokeMethod.evaluate(InvokeMethod.java:17)
     [java] 	at org.junit.rules.ExpectedException$ExpectedExceptionStatement.evaluate(ExpectedException.java:239)
     [java] 	at org.junit.rules.RunRules.evaluate(RunRules.java:20)
     [java] 	at org.junit.runners.ParentRunner.runLeaf(ParentRunner.java:325)
     [java] 	at org.junit.runners.BlockJUnit4ClassRunner.runChild(BlockJUnit4ClassRunner.java:78)
     [java] 	at org.junit.runners.BlockJUnit4ClassRunner.runChild(BlockJUnit4ClassRunner.java:57)
     [java] 	at org.junit.runners.ParentRunner$3.run(ParentRunner.java:290)
     [java] 	at org.junit.runners.ParentRunner$1.schedule(ParentRunner.java:71)
     [java] 	at org.junit.runners.ParentRunner.runChildren(ParentRunner.java:288)
     [java] 	at org.junit.runners.ParentRunner.access$000(ParentRunner.java:58)
     [java] 	at org.junit.runners.ParentRunner$2.evaluate(ParentRunner.java:268)
     [java] 	at org.junit.runners.ParentRunner.run(ParentRunner.java:363)
     [java] 	at org.junit.runners.Suite.runChild(Suite.java:128)
     [java] 	at org.junit.runners.Suite.runChild(Suite.java:27)
     [java] 	at org.junit.runners.ParentRunner$3.run(ParentRunner.java:290)
     [java] 	at org.junit.runners.ParentRunner$1.schedule(ParentRunner.java:71)
     [java] 	at org.junit.runners.ParentRunner.runChildren(ParentRunner.java:288)
     [java] 	at org.junit.runners.ParentRunner.access$000(ParentRunner.java:58)
     [java] 	at org.junit.runners.ParentRunner$2.evaluate(ParentRunner.java:268)
     [java] 	at org.junit.runners.ParentRunner.run(ParentRunner.java:363)
     [java] 	at org.junit.runner.JUnitCore.run(JUnitCore.java:137)
     [java] 	at org.junit.runner.JUnitCore.run(JUnitCore.java:115)
     [java] 	at org.junit.runner.JUnitCore.run(JUnitCore.java:105)
     [java] 	at org.junit.runner.JUnitCore.run(JUnitCore.java:94)
     [java] 	at org.apache.poi.ooxml.util.OOXMLLite.build(OOXMLLite.java:189)
     [java] 	at org.apache.poi.ooxml.util.OOXMLLite.main(OOXMLLite.java:107)
     [java] Caused by: java.lang.reflect.InvocationTargetException
     [java] 	at sun.reflect.GeneratedConstructorAccessor304.newInstance(Unknown Source)
     [java] 	at sun.reflect.DelegatingConstructorAccessorImpl.newInstance(DelegatingConstructorAccessorImpl.java:45)
     [java] 	at java.lang.reflect.Constructor.newInstance(Constructor.java:423)
     [java] 	at org.apache.poi.xssf.usermodel.XSSFFactory.createDocumentPart(XSSFFactory.java:56)
     [java] 	at org.apache.poi.ooxml.POIXMLFactory.createDocumentPart(POIXMLFactory.java:63)
     [java] 	... 47 more
     [java] Caused by: java.io.IOException: Zip bomb detected! The file would exceed the max
size of the expanded data in the zip-file.
     [java] This may indicates that the file is used to inflate memory usage and thus could
pose a security risk.
     [java] You can adjust this limit via ZipSecureFile.setMaxEntrySize() if you need to work
with files which are very large.
     [java] Uncompressed size: 1048807, Raw/compressed size: 57587
     [java] Limits: MAX_ENTRY_SIZE: 1048783, Entry: xl/sharedStrings.xml
     [java] 	at org.apache.poi.openxml4j.util.ZipArchiveThresholdInputStream.checkThreshold(ZipArchiveThresholdInputStream.java:116)
     [java] 	at org.apache.poi.openxml4j.util.ZipArchiveThresholdInputStream.read(ZipArchiveThresholdInputStream.java:80)
     [java] 	at org.apache.xerces.impl.XMLEntityManager$RewindableInputStream.read(Unknown
Source)
     [java] 	at org.apache.xerces.impl.io.UTF8Reader.read(Unknown Source)
     [java] 	at org.apache.xerces.impl.XMLEntityScanner.load(Unknown Source)
     [java] 	at org.apache.xerces.impl.XMLEntityScanner.scanContent(Unknown Source)
     [java] 	at org.apache.xerces.impl.XMLDocumentFragmentScannerImpl.scanContent(Unknown
Source)
     [java] 	at org.apache.xerces.impl.XMLDocumentFragmentScannerImpl$FragmentContentDispatcher.dispatch(Unknown
Source)
     [java] 	at org.apache.xerces.impl.XMLDocumentFragmentScannerImpl.scanDocument(Unknown
Source)
     [java] 	at org.apache.xerces.parsers.XML11Configuration.parse(Unknown Source)
     [java] 	at org.apache.xerces.parsers.XML11Configuration.parse(Unknown Source)
     [java] 	at org.apache.xerces.parsers.XMLParser.parse(Unknown Source)
     [java] 	at org.apache.xerces.parsers.AbstractSAXParser.parse(Unknown Source)
     [java] 	at org.apache.xmlbeans.impl.store.Locale$SaxLoader.load(Locale.java:3414)
     [java] 	at org.apache.xmlbeans.impl.store.Locale.parseToXmlObject(Locale.java:1272)
     [java] 	at org.apache.xmlbeans.impl.store.Locale.parseToXmlObject(Locale.java:1259)
     [java] 	at org.apache.xmlbeans.impl.schema.SchemaTypeLoaderBase.parse(SchemaTypeLoaderBase.java:345)
     [java] 	at org.openxmlformats.schemas.spreadsheetml.x2006.main.SstDocument$Factory.parse(Unknown
Source)
     [java] 	at org.apache.poi.xssf.model.SharedStringsTable.readFrom(SharedStringsTable.java:123)
     [java] 	at org.apache.poi.xssf.model.SharedStringsTable.<init>(SharedStringsTable.java:111)
     [java] 	... 52 more
     [java] 
     [java] FAILURES!!!
     [java] Tests run: 2449,  Failures: 4
     [java] 

BUILD FAILED
<https://builds.apache.org/job/POI-DSL-old-Xerces/ws/build.xml>:1677: Java returned:
1

Total time: 5 minutes 15 seconds
Build step 'Invoke Ant' marked build as failure
Skipping publisher since build result is FAILURE
Archiving artifacts
[Fast Archiver] Compressed 59.98 MB of artifacts by 59.5% relative to #95
Skipping publisher since build result is FAILURE
Recording test results
ERROR: Step ?Publish JUnit test result report? failed: No test report files were found. Configuration
error?

---------------------------------------------------------------------
To unsubscribe, e-mail: dev-unsubscribe@poi.apache.org
For additional commands, e-mail: dev-help@poi.apache.org


Mime
View raw message