poi-dev mailing list archives

Site index · List index
Message view « Date » · « Thread »
Top « Date » · « Thread »
From Apache Jenkins Server <jenk...@builds.apache.org>
Subject Build failed in Jenkins: POI-DSL-old-Xerces #97
Date Sun, 09 Sep 2018 07:00:24 GMT
See <https://builds.apache.org/job/POI-DSL-old-Xerces/97/display/redirect?page=changes>

Changes:

[fanningpj] handle test issues when running with old xerces

[kiwiwings] #62699 - Download page must link to https://www.apache.org/dist/poi/KEYS

------------------------------------------
[...truncated 28.57 KB...]
     [java] thread: 8, iter: 30: build/tmp/poifiles/TestTempFileThreaded/26/TestTempFile-8-30-2850813234404991688.xlsx
     [java] thread: 6, iter: 30: build/tmp/poifiles/TestTempFileThreaded/24/TestTempFile-6-30-4040412128119042475.xlsx
     [java] thread: 4, iter: 30: build/tmp/poifiles/TestTempFileThreaded/22/TestTempFile-4-30-4077467008898258081.xlsx
     [java] thread: 7, iter: 60: build/tmp/poifiles/TestTempFileThreaded/25/TestTempFile-7-60-1127683456122713099.xlsx
     [java] thread: 9, iter: 60: build/tmp/poifiles/TestTempFileThreaded/27/TestTempFile-9-60-1560301501819235714.xlsx
     [java] thread: 2, iter: 60: build/tmp/poifiles/TestTempFileThreaded/20/TestTempFile-2-60-5091924461163332712.xlsx
     [java] thread: 0, iter: 60: build/tmp/poifiles/TestTempFileThreaded/18/TestTempFile-0-60-1266562805172346488.xlsx
     [java] thread: 1, iter: 60: build/tmp/poifiles/TestTempFileThreaded/19/TestTempFile-1-60-8737293401170475450.xlsx
     [java] thread: 3, iter: 60: build/tmp/poifiles/TestTempFileThreaded/21/TestTempFile-3-60-9074508611898956082.xlsx
     [java] thread: 5, iter: 60: build/tmp/poifiles/TestTempFileThreaded/23/TestTempFile-5-60-72850952631821580.xlsx
     [java] thread: 8, iter: 60: build/tmp/poifiles/TestTempFileThreaded/26/TestTempFile-8-60-3039103377993778102.xlsx
     [java] thread: 6, iter: 60: build/tmp/poifiles/TestTempFileThreaded/24/TestTempFile-6-60-8443625112153918858.xlsx
     [java] thread: 4, iter: 60: build/tmp/poifiles/TestTempFileThreaded/22/TestTempFile-4-60-9045004586306367038.xlsx
     [java] thread: 9, iter: 90: build/tmp/poifiles/TestTempFileThreaded/27/TestTempFile-9-90-2960184071347525148.xlsx
     [java] thread: 7, iter: 90: build/tmp/poifiles/TestTempFileThreaded/25/TestTempFile-7-90-3966952475489351710.xlsx
     [java] thread: 1, iter: 90: build/tmp/poifiles/TestTempFileThreaded/19/TestTempFile-1-90-46359397637591180.xlsx
     [java] thread: 0, iter: 90: build/tmp/poifiles/TestTempFileThreaded/18/TestTempFile-0-90-2121313045566044450.xlsx
     [java] thread: 2, iter: 90: build/tmp/poifiles/TestTempFileThreaded/20/TestTempFile-2-90-8847557287646069544.xlsx
     [java] thread: 5, iter: 90: build/tmp/poifiles/TestTempFileThreaded/23/TestTempFile-5-90-8115671755610008372.xlsx
     [java] thread: 3, iter: 90: build/tmp/poifiles/TestTempFileThreaded/21/TestTempFile-3-90-649095990008662205.xlsx
     [java] thread: 6, iter: 90: build/tmp/poifiles/TestTempFileThreaded/24/TestTempFile-6-90-1103429525435735315.xlsx
     [java] thread: 4, iter: 90: build/tmp/poifiles/TestTempFileThreaded/22/TestTempFile-4-90-8368019546426459338.xlsx
     [java] thread: 8, iter: 90: build/tmp/poifiles/TestTempFileThreaded/26/TestTempFile-8-90-675643936861716446.xlsx
     [java] thread: 0, iter: 120: build/tmp/poifiles/TestTempFileThreaded/18/TestTempFile-0-120-8559410537900004733.xlsx
     [java] thread: 9, iter: 120: build/tmp/poifiles/TestTempFileThreaded/27/TestTempFile-9-120-1057790711827360345.xlsx
     [java] thread: 7, iter: 120: build/tmp/poifiles/TestTempFileThreaded/25/TestTempFile-7-120-7695037568646901197.xlsx
     [java] thread: 6, iter: 120: build/tmp/poifiles/TestTempFileThreaded/24/TestTempFile-6-120-295743862183928797.xlsx
     [java] thread: 1, iter: 120: build/tmp/poifiles/TestTempFileThreaded/19/TestTempFile-1-120-8480498003228263589.xlsx
     [java] thread: 2, iter: 120: build/tmp/poifiles/TestTempFileThreaded/20/TestTempFile-2-120-2259030933607741070.xlsx
     [java] thread: 4, iter: 120: build/tmp/poifiles/TestTempFileThreaded/22/TestTempFile-4-120-5732820358123449468.xlsx
     [java] thread: 5, iter: 120: build/tmp/poifiles/TestTempFileThreaded/23/TestTempFile-5-120-3775925119865792781.xlsx
     [java] thread: 3, iter: 120: build/tmp/poifiles/TestTempFileThreaded/21/TestTempFile-3-120-3791816885895357697.xlsx
     [java] thread: 8, iter: 120: build/tmp/poifiles/TestTempFileThreaded/26/TestTempFile-8-120-6823771472456449123.xlsx
     [java] thread: 6, iter: 150: build/tmp/poifiles/TestTempFileThreaded/24/TestTempFile-6-150-2866065056454838481.xlsx
     [java] thread: 0, iter: 150: build/tmp/poifiles/TestTempFileThreaded/18/TestTempFile-0-150-2907064464195037353.xlsx
     [java] thread: 9, iter: 150: build/tmp/poifiles/TestTempFileThreaded/27/TestTempFile-9-150-3185561164425345878.xlsx
     [java] thread: 7, iter: 150: build/tmp/poifiles/TestTempFileThreaded/25/TestTempFile-7-150-1933820927858347239.xlsx
     [java] thread: 2, iter: 150: build/tmp/poifiles/TestTempFileThreaded/20/TestTempFile-2-150-7199766502729647242.xlsx
     [java] thread: 5, iter: 150: build/tmp/poifiles/TestTempFileThreaded/23/TestTempFile-5-150-9099361590248754609.xlsx
     [java] thread: 4, iter: 150: build/tmp/poifiles/TestTempFileThreaded/22/TestTempFile-4-150-8346362531361755810.xlsx
     [java] thread: 3, iter: 150: build/tmp/poifiles/TestTempFileThreaded/21/TestTempFile-3-150-8362207121002825766.xlsx
     [java] thread: 1, iter: 150: build/tmp/poifiles/TestTempFileThreaded/19/TestTempFile-1-150-2264417740700792064.xlsx
     [java] thread: 8, iter: 150: build/tmp/poifiles/TestTempFileThreaded/26/TestTempFile-8-150-6169992689572053655.xlsx
     [java] thread: 6, iter: 180: build/tmp/poifiles/TestTempFileThreaded/24/TestTempFile-6-180-8230412625152643206.xlsx
     [java] thread: 0, iter: 180: build/tmp/poifiles/TestTempFileThreaded/18/TestTempFile-0-180-5010418592507256673.xlsx
     [java] thread: 9, iter: 180: build/tmp/poifiles/TestTempFileThreaded/27/TestTempFile-9-180-5059291639734523795.xlsx
     [java] thread: 1, iter: 180: build/tmp/poifiles/TestTempFileThreaded/19/TestTempFile-1-180-1195559309059384272.xlsx
     [java] thread: 2, iter: 180: build/tmp/poifiles/TestTempFileThreaded/20/TestTempFile-2-180-1336639708253769621.xlsx
     [java] thread: 7, iter: 180: build/tmp/poifiles/TestTempFileThreaded/25/TestTempFile-7-180-8753088222803129561.xlsx
     [java] thread: 5, iter: 180: build/tmp/poifiles/TestTempFileThreaded/23/TestTempFile-5-180-4129400727589635118.xlsx
     [java] thread: 3, iter: 180: build/tmp/poifiles/TestTempFileThreaded/21/TestTempFile-3-180-2445039720406258467.xlsx
     [java] thread: 4, iter: 180: build/tmp/poifiles/TestTempFileThreaded/22/TestTempFile-4-180-7380032263507360893.xlsx
     [java] thread: 8, iter: 180: build/tmp/poifiles/TestTempFileThreaded/26/TestTempFile-8-180-8303758253210968644.xlsx
     [java] ...................................................I...........................
     [java] 29/243: testCreateRow(org.apache.poi.xwpf.usermodel.TestXWPFTable)
     [java] ......................I..............................................................................
     [java] 43/243: testAddPicture(org.apache.poi.xwpf.usermodel.TestXWPFRun)
     [java] ....................................................................................................
     [java] 65/243: testWriteSelectEnableLocking(org.apache.poi.xssf.TestSheetProtection)
     [java] ............I........................................................................................
     [java] 73/243: bug55723(org.apache.poi.xssf.streaming.TestSXSSFSheet)
     [java] ..................................II........................................................I..I..I......
     [java] 79/243: useSharedStringsTable(org.apache.poi.xssf.streaming.TestSXSSFWorkbook)
     [java] ....................................................................................................
     [java] 87/243: testGetErrorCellValueFromFormulaCell(org.apache.poi.xssf.usermodel.TestXSSFCell)
     [java] ....................................................................................................
     [java] 92/243: getNumCellStyles(org.apache.poi.xssf.usermodel.TestXSSFWorkbook)
     [java] ....................................................................................................
     [java] 95/243: bug58996_UsedToWorkIn3_11_ButNotIn3_13(org.apache.poi.xssf.usermodel.TestXSSFCellStyle)
     [java] ....................................................................................................
     [java] 110/243: test53568(org.apache.poi.xssf.usermodel.TestXSSFPictureData)
     [java] .................................................................I.I....I..............................
     [java] 118/243: test55640_VerifyCasesSpec(org.apache.poi.xssf.usermodel.TestXSSFSheetRowGrouping)
     [java] ......I.................................................................I.............................
     [java] 135/243: testCreateDialogSheet(org.apache.poi.xssf.usermodel.TestXSSFDialogSheet)
     [java] [Fatal Error] :-1:-1: The parser has encountered more than "1" entity expansions
in this document; this is the limit imposed by the application.
     [java] Cleaning up unclosed ZipFile for archive <https://builds.apache.org/job/POI-DSL-old-Xerces/ws/test-data/spreadsheet/54764.xlsx>
     [java] ...................................................................................................I.
     [java] 141/243: test56467(org.apache.poi.xssf.usermodel.TestXSSFBugs)
     [java] Cleaning up unclosed ZipFile for archive <https://builds.apache.org/job/POI-DSL-old-Xerces/ws/test-data/spreadsheet/54764.xlsx>
     [java] .....II............I...I........................I.........I.....I.............E.III.I..I.......I.......I.....I......
     [java] 143/243: bug50681_testAutoSize(org.apache.poi.xssf.usermodel.TestSXSSFBugs)
     [java] ....................................................................................................
     [java] 156/243: stringCells(org.apache.poi.xssf.usermodel.TestXSSFSheetAutosizeColumn)
     [java] ....................................................................................................
     [java] 157/243: processFunctionRow[Dialogbox](org.apache.poi.xssf.usermodel.TestFormulaEvaluatorOnXSSF)
     [java] ....................................................................................................
     [java] 157/243: processFunctionRow[Ispmt](org.apache.poi.xssf.usermodel.TestFormulaEvaluatorOnXSSF)
     [java] ....................................................................................................
     [java] 157/243: processFunctionRow[Rsq](org.apache.poi.xssf.usermodel.TestFormulaEvaluatorOnXSSF)
     [java] ....................................................................................................
     [java] 158/243: protectSheet_emptyPassword(org.apache.poi.xssf.usermodel.TestXSSFSheet)
     [java] ....................................................................................................
     [java] 164/243: populateNew(org.apache.poi.xssf.model.TestStylesTable)
     [java] ...............................I.....................................................................
     [java] 176/243: setCellStyleProperty(org.apache.poi.ss.util.TestSXSSFCellUtil)
     [java] ....................................................................I................................
     [java] 199/243: createGetsContentTypes(org.apache.poi.openxml4j.opc.TestPackage)
     [java] ....E....................I..........................I..................................................
     [java] 212/243: testProblemClasses(org.apache.poi.xslf.TestNecessaryOOXMLClasses)
     [java] Cleaning up unclosed ZipFile for archive <https://builds.apache.org/job/POI-DSL-old-Xerces/ws/test-data/openxml4j/TestPackageCommon.docx>
     [java] ....................................................................................................
     [java] 236/243: getXmlObject(org.apache.poi.xslf.usermodel.TestXSLFTableRow)
     [java] Exception in thread "main" java.lang.RuntimeException: Tests did not succeed,
cannot build ooxml-lite jar
     [java] 	at org.apache.poi.ooxml.util.OOXMLLite.build(OOXMLLite.java:191)
     [java] 	at org.apache.poi.ooxml.util.OOXMLLite.main(OOXMLLite.java:107)
     [java] ................I.I.................................
     [java] Time: 165.946
     [java] There were 2 failures:
     [java] 1) testBuiltinStyleInit(org.apache.poi.xssf.usermodel.TestTableStyles)
     [java] java.lang.AbstractMethodError: org.apache.xml.serialize.DOMSerializerImpl.getDomConfig()Lorg/w3c/dom/DOMConfiguration;
     [java] 	at org.apache.poi.xssf.usermodel.XSSFBuiltinTableStyle.styleXML(XSSFBuiltinTableStyle.java:424)
     [java] 	at org.apache.poi.xssf.usermodel.XSSFBuiltinTableStyle.init(XSSFBuiltinTableStyle.java:406)
     [java] 	at org.apache.poi.xssf.usermodel.XSSFBuiltinTableStyle.getStyle(XSSFBuiltinTableStyle.java:346)
     [java] 	at org.apache.poi.xssf.usermodel.TestTableStyles.testBuiltinStyleInit(TestTableStyles.java:45)
     [java] 	at sun.reflect.NativeMethodAccessorImpl.invoke0(Native Method)
     [java] 	at sun.reflect.NativeMethodAccessorImpl.invoke(NativeMethodAccessorImpl.java:62)
     [java] 	at sun.reflect.DelegatingMethodAccessorImpl.invoke(DelegatingMethodAccessorImpl.java:43)
     [java] 	at java.lang.reflect.Method.invoke(Method.java:498)
     [java] 	at org.junit.runners.model.FrameworkMethod$1.runReflectiveCall(FrameworkMethod.java:50)
     [java] 	at org.junit.internal.runners.model.ReflectiveCallable.run(ReflectiveCallable.java:12)
     [java] 	at org.junit.runners.model.FrameworkMethod.invokeExplosively(FrameworkMethod.java:47)
     [java] 	at org.junit.internal.runners.statements.InvokeMethod.evaluate(InvokeMethod.java:17)
     [java] 	at org.junit.runners.ParentRunner.runLeaf(ParentRunner.java:325)
     [java] 	at org.junit.runners.BlockJUnit4ClassRunner.runChild(BlockJUnit4ClassRunner.java:78)
     [java] 	at org.junit.runners.BlockJUnit4ClassRunner.runChild(BlockJUnit4ClassRunner.java:57)
     [java] 	at org.junit.runners.ParentRunner$3.run(ParentRunner.java:290)
     [java] 	at org.junit.runners.ParentRunner$1.schedule(ParentRunner.java:71)
     [java] 	at org.junit.runners.ParentRunner.runChildren(ParentRunner.java:288)
     [java] 	at org.junit.runners.ParentRunner.access$000(ParentRunner.java:58)
     [java] 	at org.junit.runners.ParentRunner$2.evaluate(ParentRunner.java:268)
     [java] 	at org.junit.runners.ParentRunner.run(ParentRunner.java:363)
     [java] 	at org.junit.runners.Suite.runChild(Suite.java:128)
     [java] 	at org.junit.runners.Suite.runChild(Suite.java:27)
     [java] 	at org.junit.runners.ParentRunner$3.run(ParentRunner.java:290)
     [java] 	at org.junit.runners.ParentRunner$1.schedule(ParentRunner.java:71)
     [java] 	at org.junit.runners.ParentRunner.runChildren(ParentRunner.java:288)
     [java] 	at org.junit.runners.ParentRunner.access$000(ParentRunner.java:58)
     [java] 	at org.junit.runners.ParentRunner$2.evaluate(ParentRunner.java:268)
     [java] 	at org.junit.runners.ParentRunner.run(ParentRunner.java:363)
     [java] 	at org.junit.runner.JUnitCore.run(JUnitCore.java:137)
     [java] 	at org.junit.runner.JUnitCore.run(JUnitCore.java:115)
     [java] 	at org.junit.runner.JUnitCore.run(JUnitCore.java:105)
     [java] 	at org.junit.runner.JUnitCore.run(JUnitCore.java:94)
     [java] 	at org.apache.poi.ooxml.util.OOXMLLite.build(OOXMLLite.java:189)
     [java] 	at org.apache.poi.ooxml.util.OOXMLLite.main(OOXMLLite.java:107)
     [java] 2) zipBombCheckSizesWithinLimits(org.apache.poi.openxml4j.opc.TestPackage)
     [java] org.apache.poi.ooxml.POIXMLException: Zip bomb detected! The file would exceed
the max size of the expanded data in the zip-file.
     [java] This may indicates that the file is used to inflate memory usage and thus could
pose a security risk.
     [java] You can adjust this limit via ZipSecureFile.setMaxEntrySize() if you need to work
with files which are very large.
     [java] Uncompressed size: 1048807, Raw/compressed size: 57587
     [java] Limits: MAX_ENTRY_SIZE: 1048783, Entry: xl/sharedStrings.xml
     [java] 	at org.apache.poi.ooxml.POIXMLFactory.createDocumentPart(POIXMLFactory.java:66)
     [java] 	at org.apache.poi.ooxml.POIXMLDocumentPart.read(POIXMLDocumentPart.java:648)
     [java] 	at org.apache.poi.ooxml.POIXMLDocument.load(POIXMLDocument.java:180)
     [java] 	at org.apache.poi.xssf.usermodel.XSSFWorkbook.<init>(XSSFWorkbook.java:286)
     [java] 	at org.apache.poi.xssf.usermodel.XSSFWorkbookFactory.createWorkbook(XSSFWorkbookFactory.java:83)
     [java] 	at org.apache.poi.xssf.usermodel.XSSFWorkbookFactory.createWorkbook(XSSFWorkbookFactory.java:111)
     [java] 	at sun.reflect.NativeMethodAccessorImpl.invoke0(Native Method)
     [java] 	at sun.reflect.NativeMethodAccessorImpl.invoke(NativeMethodAccessorImpl.java:62)
     [java] 	at sun.reflect.DelegatingMethodAccessorImpl.invoke(DelegatingMethodAccessorImpl.java:43)
     [java] 	at java.lang.reflect.Method.invoke(Method.java:498)
     [java] 	at org.apache.poi.ss.usermodel.WorkbookFactory.createWorkbook(WorkbookFactory.java:314)
     [java] 	at org.apache.poi.ss.usermodel.WorkbookFactory.createXSSFWorkbook(WorkbookFactory.java:296)
     [java] 	at org.apache.poi.ss.usermodel.WorkbookFactory.create(WorkbookFactory.java:284)
     [java] 	at org.apache.poi.openxml4j.opc.TestPackage.getZipStatsAndConsume(TestPackage.java:938)
     [java] 	at org.apache.poi.openxml4j.opc.TestPackage.zipBombCheckSizesWithinLimits(TestPackage.java:884)
     [java] 	at sun.reflect.NativeMethodAccessorImpl.invoke0(Native Method)
     [java] 	at sun.reflect.NativeMethodAccessorImpl.invoke(NativeMethodAccessorImpl.java:62)
     [java] 	at sun.reflect.DelegatingMethodAccessorImpl.invoke(DelegatingMethodAccessorImpl.java:43)
     [java] 	at java.lang.reflect.Method.invoke(Method.java:498)
     [java] 	at org.junit.runners.model.FrameworkMethod$1.runReflectiveCall(FrameworkMethod.java:50)
     [java] 	at org.junit.internal.runners.model.ReflectiveCallable.run(ReflectiveCallable.java:12)
     [java] 	at org.junit.runners.model.FrameworkMethod.invokeExplosively(FrameworkMethod.java:47)
     [java] 	at org.junit.internal.runners.statements.InvokeMethod.evaluate(InvokeMethod.java:17)
     [java] 	at org.junit.rules.ExpectedException$ExpectedExceptionStatement.evaluate(ExpectedException.java:239)
     [java] 	at org.junit.rules.RunRules.evaluate(RunRules.java:20)
     [java] 	at org.junit.runners.ParentRunner.runLeaf(ParentRunner.java:325)
     [java] 	at org.junit.runners.BlockJUnit4ClassRunner.runChild(BlockJUnit4ClassRunner.java:78)
     [java] 	at org.junit.runners.BlockJUnit4ClassRunner.runChild(BlockJUnit4ClassRunner.java:57)
     [java] 	at org.junit.runners.ParentRunner$3.run(ParentRunner.java:290)
     [java] 	at org.junit.runners.ParentRunner$1.schedule(ParentRunner.java:71)
     [java] 	at org.junit.runners.ParentRunner.runChildren(ParentRunner.java:288)
     [java] 	at org.junit.runners.ParentRunner.access$000(ParentRunner.java:58)
     [java] 	at org.junit.runners.ParentRunner$2.evaluate(ParentRunner.java:268)
     [java] 	at org.junit.runners.ParentRunner.run(ParentRunner.java:363)
     [java] 	at org.junit.runners.Suite.runChild(Suite.java:128)
     [java] 	at org.junit.runners.Suite.runChild(Suite.java:27)
     [java] 	at org.junit.runners.ParentRunner$3.run(ParentRunner.java:290)
     [java] 	at org.junit.runners.ParentRunner$1.schedule(ParentRunner.java:71)
     [java] 	at org.junit.runners.ParentRunner.runChildren(ParentRunner.java:288)
     [java] 	at org.junit.runners.ParentRunner.access$000(ParentRunner.java:58)
     [java] 	at org.junit.runners.ParentRunner$2.evaluate(ParentRunner.java:268)
     [java] 	at org.junit.runners.ParentRunner.run(ParentRunner.java:363)
     [java] 	at org.junit.runner.JUnitCore.run(JUnitCore.java:137)
     [java] 	at org.junit.runner.JUnitCore.run(JUnitCore.java:115)
     [java] 	at org.junit.runner.JUnitCore.run(JUnitCore.java:105)
     [java] 	at org.junit.runner.JUnitCore.run(JUnitCore.java:94)
     [java] 	at org.apache.poi.ooxml.util.OOXMLLite.build(OOXMLLite.java:189)
     [java] 	at org.apache.poi.ooxml.util.OOXMLLite.main(OOXMLLite.java:107)
     [java] Caused by: java.lang.reflect.InvocationTargetException
     [java] 	at sun.reflect.GeneratedConstructorAccessor444.newInstance(Unknown Source)
     [java] 	at sun.reflect.DelegatingConstructorAccessorImpl.newInstance(DelegatingConstructorAccessorImpl.java:45)
     [java] 	at java.lang.reflect.Constructor.newInstance(Constructor.java:423)
     [java] 	at org.apache.poi.xssf.usermodel.XSSFFactory.createDocumentPart(XSSFFactory.java:56)
     [java] 	at org.apache.poi.ooxml.POIXMLFactory.createDocumentPart(POIXMLFactory.java:63)
     [java] 	... 47 more
     [java] Caused by: java.io.IOException: Zip bomb detected! The file would exceed the max
size of the expanded data in the zip-file.
     [java] This may indicates that the file is used to inflate memory usage and thus could
pose a security risk.
     [java] You can adjust this limit via ZipSecureFile.setMaxEntrySize() if you need to work
with files which are very large.
     [java] Uncompressed size: 1048807, Raw/compressed size: 57587
     [java] Limits: MAX_ENTRY_SIZE: 1048783, Entry: xl/sharedStrings.xml
     [java] 	at org.apache.poi.openxml4j.util.ZipArchiveThresholdInputStream.checkThreshold(ZipArchiveThresholdInputStream.java:116)
     [java] 	at org.apache.poi.openxml4j.util.ZipArchiveThresholdInputStream.read(ZipArchiveThresholdInputStream.java:80)
     [java] 	at org.apache.xerces.impl.XMLEntityManager$RewindableInputStream.read(Unknown
Source)
     [java] 	at org.apache.xerces.impl.io.UTF8Reader.read(Unknown Source)
     [java] 	at org.apache.xerces.impl.XMLEntityScanner.load(Unknown Source)
     [java] 	at org.apache.xerces.impl.XMLEntityScanner.scanContent(Unknown Source)
     [java] 	at org.apache.xerces.impl.XMLDocumentFragmentScannerImpl.scanContent(Unknown
Source)
     [java] 	at org.apache.xerces.impl.XMLDocumentFragmentScannerImpl$FragmentContentDispatcher.dispatch(Unknown
Source)
     [java] 	at org.apache.xerces.impl.XMLDocumentFragmentScannerImpl.scanDocument(Unknown
Source)
     [java] 	at org.apache.xerces.parsers.XML11Configuration.parse(Unknown Source)
     [java] 	at org.apache.xerces.parsers.XML11Configuration.parse(Unknown Source)
     [java] 	at org.apache.xerces.parsers.XMLParser.parse(Unknown Source)
     [java] 	at org.apache.xerces.parsers.AbstractSAXParser.parse(Unknown Source)
     [java] 	at org.apache.xmlbeans.impl.store.Locale$SaxLoader.load(Locale.java:3414)
     [java] 	at org.apache.xmlbeans.impl.store.Locale.parseToXmlObject(Locale.java:1272)
     [java] 	at org.apache.xmlbeans.impl.store.Locale.parseToXmlObject(Locale.java:1259)
     [java] 	at org.apache.xmlbeans.impl.schema.SchemaTypeLoaderBase.parse(SchemaTypeLoaderBase.java:345)
     [java] 	at org.openxmlformats.schemas.spreadsheetml.x2006.main.SstDocument$Factory.parse(Unknown
Source)
     [java] 	at org.apache.poi.xssf.model.SharedStringsTable.readFrom(SharedStringsTable.java:123)
     [java] 	at org.apache.poi.xssf.model.SharedStringsTable.<init>(SharedStringsTable.java:111)
     [java] 	... 52 more
     [java] 
     [java] FAILURES!!!
     [java] Tests run: 2449,  Failures: 2
     [java] 

BUILD FAILED
<https://builds.apache.org/job/POI-DSL-old-Xerces/ws/build.xml>:1677: Java returned:
1

Total time: 5 minutes 55 seconds
Build step 'Invoke Ant' marked build as failure
Skipping publisher since build result is FAILURE
Archiving artifacts
[Fast Archiver] Compressed 59.98 MB of artifacts by 59.5% relative to #95
Skipping publisher since build result is FAILURE
Recording test results
ERROR: Step ?Publish JUnit test result report? failed: No test report files were found. Configuration
error?

---------------------------------------------------------------------
To unsubscribe, e-mail: dev-unsubscribe@poi.apache.org
For additional commands, e-mail: dev-help@poi.apache.org


Mime
View raw message