poi-dev mailing list archives

Site index · List index
Message view « Date » · « Thread »
Top « Date » · « Thread »
From Apache Jenkins Server <jenk...@builds.apache.org>
Subject Build failed in Jenkins: POI-DSL-Windows-1.8 #388
Date Sat, 02 Mar 2019 09:27:53 GMT
See <https://builds.apache.org/job/POI-DSL-Windows-1.8/388/display/redirect>

------------------------------------------
Started by user centic
[EnvInject] - Loading node environment variables.
[EnvInject] - Preparing an environment for the build.
[EnvInject] - Keeping Jenkins system variables.
[EnvInject] - Keeping Jenkins build variables.
[EnvInject] - Injecting as environment variables the properties content 
LANG=en_US.UTF-8
FORREST_HOME=f:jenkins	oolsorrestlatest

[EnvInject] - Variables injected successfully.
[EnvInject] - Injecting contributions.
Building remotely on windows-2016-3 (Windows) in workspace <https://builds.apache.org/job/POI-DSL-Windows-1.8/ws/>
[WS-CLEANUP] Deleting project workspace...
[WS-CLEANUP] Done
Updating https://svn.apache.org/repos/asf/poi/trunk at revision '2019-03-02T01:26:03.320 -0800'
U         src\java\org\apache\poi\poifs\nio\FileBackedDataSource.java
AU        src\java\org\apache\poi\poifs\nio\CleanerUtil.java
U         build.xml

<-- Got one external: documentation, svn url: https://svn.apache.org/repos/asf/poi/site/src/documentation
-->
Fetching 'https://svn.apache.org/repos/asf/poi/site/src/documentation' at -1 into 'F:\jenkins\jenkins-slave\workspace\POI-DSL-Windows-1.8\src\documentation'

<-- Got one external: forrest.properties, svn url: https://svn.apache.org/repos/asf/poi/site/forrest.properties
-->
Fetching 'https://svn.apache.org/repos/asf/poi/site/forrest.properties' at -1 into 'F:\jenkins\jenkins-slave\workspace\POI-DSL-Windows-1.8\forrest.properties'
At revision 1854630

At revision 1854630

ERROR: Failed to parse svn info for external https://svn.apache.org/repos/asf/poi/site/src/documentation
at ./src\documentation
org.tmatesoft.svn.core.SVNException: svn: E155010: The node '<https://builds.apache.org/job/POI-DSL-Windows-1.8/ws/src\documentation'>
was not found
	at org.tmatesoft.svn.core.internal.wc.SVNErrorManager.error(SVNErrorManager.java:70)
	at org.tmatesoft.svn.core.internal.wc.SVNErrorManager.error(SVNErrorManager.java:57)
	at org.tmatesoft.svn.core.internal.wc2.ng.SvnNgGetInfo.nodeFound(SvnNgGetInfo.java:154)
	at org.tmatesoft.svn.core.internal.wc17.SVNWCContext.nodeWalkChildren(SVNWCContext.java:1578)
	at org.tmatesoft.svn.core.internal.wc2.ng.SvnNgGetInfo.run(SvnNgGetInfo.java:82)
	at org.tmatesoft.svn.core.internal.wc2.ng.SvnNgGetInfo.run(SvnNgGetInfo.java:45)
	at org.tmatesoft.svn.core.internal.wc2.ng.SvnNgOperationRunner.run(SvnNgOperationRunner.java:20)
	at org.tmatesoft.svn.core.internal.wc2.SvnOperationRunner.run(SvnOperationRunner.java:21)
	at org.tmatesoft.svn.core.wc2.SvnOperationFactory.run(SvnOperationFactory.java:1239)
	at org.tmatesoft.svn.core.wc2.SvnOperation.run(SvnOperation.java:294)
	at org.tmatesoft.svn.core.wc.SVNWCClient.doInfo(SVNWCClient.java:2497)
	at hudson.scm.SubversionSCM$BuildRevisionMapTask.invoke(SubversionSCM.java:1339)
	at hudson.scm.SubversionSCM$BuildRevisionMapTask.invoke(SubversionSCM.java:1289)
	at hudson.FilePath$FileCallableWrapper.call(FilePath.java:3086)
	at hudson.remoting.UserRequest.perform(UserRequest.java:212)
	at hudson.remoting.UserRequest.perform(UserRequest.java:54)
	at hudson.remoting.Request$2.run(Request.java:369)
	at hudson.remoting.InterceptingExecutorService$1.call(InterceptingExecutorService.java:72)
	at java.util.concurrent.FutureTask.run(Unknown Source)
	at java.util.concurrent.ThreadPoolExecutor.runWorker(Unknown Source)
	at java.util.concurrent.ThreadPoolExecutor$Worker.run(Unknown Source)
	at hudson.remoting.Engine$1.lambda$newThread$0(Engine.java:93)
	at java.lang.Thread.run(Unknown Source)
FATAL: null
java.lang.NullPointerException
	at hudson.scm.SubversionChangeLogBuilder.run(SubversionChangeLogBuilder.java:131)
	at hudson.scm.SubversionSCM.calcChangeLog(SubversionSCM.java:757)
	at hudson.scm.SubversionSCM.checkout(SubversionSCM.java:898)
	at hudson.scm.SCM.checkout(SCM.java:504)
	at hudson.model.AbstractProject.checkout(AbstractProject.java:1208)
	at hudson.model.AbstractBuild$AbstractBuildExecution.defaultCheckout(AbstractBuild.java:574)
	at jenkins.scm.SCMCheckoutStrategy.checkout(SCMCheckoutStrategy.java:86)
	at hudson.model.AbstractBuild$AbstractBuildExecution.run(AbstractBuild.java:499)
	at hudson.model.Run.execute(Run.java:1810)
	at hudson.model.FreeStyleBuild.run(FreeStyleBuild.java:43)
	at hudson.model.ResourceController.execute(ResourceController.java:97)
	at hudson.model.Executor.run(Executor.java:429)
Skipping publisher since build result is FAILURE
Archiving artifacts
[Fast Archiver] Compressed 220.64 MB of artifacts by 100.0% relative to #387
Skipping publisher since build result is FAILURE
Recording test results
ERROR: Step ‘Publish JUnit test result report’ failed: Test reports were found but none
of them are new. Did leafNodes run? 
For example, <https://builds.apache.org/job/POI-DSL-Windows-1.8/ws/build\excelant-test-results\TEST-org.apache.poi.ss.examples.formula.TestExcelAntUserDefinedFunction.xml>
is 5 days 8 hr old


---------------------------------------------------------------------
To unsubscribe, e-mail: dev-unsubscribe@poi.apache.org
For additional commands, e-mail: dev-help@poi.apache.org


Mime
View raw message