poi-dev mailing list archives

Site index · List index
Message view « Date » · « Thread »
Top « Date » · « Thread »
From Apache Jenkins Server <jenk...@builds.apache.org>
Subject Build failed in Jenkins: POI-DSL-old-Xerces #126
Date Sun, 10 Mar 2019 06:59:09 GMT
See <https://builds.apache.org/job/POI-DSL-old-Xerces/126/display/redirect?page=changes>

Changes:

[fanningpj] [bug-63240] make DocumentHelper.newDocumentBuilder non-synchronized]

[fanningpj] [bug-63240] make SAXHelper.newXMLReader non-synchronized]

[fanningpj] [bug-63240] make DocumentHelper.newDocumentBuilder non-synchronized]

[centic] Jenkins DSL: Add XMLBeans-JDK-12, still disabled, though
Print out where we get Ant from
Use new 'jenkins' target for XMLBeans and fetch compiler warnings and JUnit results

[centic] Update file-leak excludes for XMLBeans/jaxb

[centic] Close more file-handles in tests

[centic] Fix a regression test failure, toString() should never return null

------------------------------------------
[...truncated 105.90 KB...]
    [junit] Running org.apache.poi.hslf.record.TestInteractiveInfoAtom
    [junit] Tests run: 6, Failures: 0, Errors: 0, Skipped: 0, Time elapsed: 0.211 sec
    [junit] Running org.apache.poi.hslf.record.TestNotesAtom
    [junit] Tests run: 3, Failures: 0, Errors: 0, Skipped: 0, Time elapsed: 0.005 sec
    [junit] Running org.apache.poi.hslf.record.TestRecordContainer
    [junit] Tests run: 5, Failures: 0, Errors: 0, Skipped: 0, Time elapsed: 0.009 sec
    [junit] Running org.apache.poi.hslf.record.TestRecordTypes
    [junit] Tests run: 4, Failures: 0, Errors: 0, Skipped: 0, Time elapsed: 0.005 sec
    [junit] Running org.apache.poi.hslf.record.TestSlideAtom
    [junit] Tests run: 5, Failures: 0, Errors: 0, Skipped: 0, Time elapsed: 0.03 sec
    [junit] Running org.apache.poi.hslf.record.TestSlidePersistAtom
    [junit] Tests run: 3, Failures: 0, Errors: 0, Skipped: 0, Time elapsed: 0.003 sec
    [junit] Running org.apache.poi.hslf.record.TestSound
    [junit] Tests run: 1, Failures: 0, Errors: 0, Skipped: 0, Time elapsed: 0.004 sec
    [junit] Running org.apache.poi.hslf.record.TestStyleTextPropAtom
    [junit] Tests run: 20, Failures: 0, Errors: 0, Skipped: 0, Time elapsed: 0.021 sec
    [junit] Running org.apache.poi.hslf.record.TestTextBytesAtom
    [junit] Tests run: 5, Failures: 0, Errors: 0, Skipped: 0, Time elapsed: 0.007 sec
    [junit] Running org.apache.poi.hslf.record.TestTextCharsAtom
    [junit] Tests run: 6, Failures: 0, Errors: 0, Skipped: 0, Time elapsed: 0.006 sec
    [junit] Running org.apache.poi.hslf.record.TestTextHeaderAtom
    [junit] Tests run: 3, Failures: 0, Errors: 0, Skipped: 0, Time elapsed: 0.004 sec
    [junit] Running org.apache.poi.hslf.record.TestTextRulerAtom
    [junit] Tests run: 3, Failures: 0, Errors: 0, Skipped: 0, Time elapsed: 0.006 sec
    [junit] Running org.apache.poi.hslf.record.TestTextSpecInfoAtom
    [junit] Tests run: 3, Failures: 0, Errors: 0, Skipped: 0, Time elapsed: 0.011 sec
    [junit] Running org.apache.poi.hslf.record.TestTxInteractiveInfoAtom
    [junit] Tests run: 4, Failures: 0, Errors: 0, Skipped: 0, Time elapsed: 0.01 sec
    [junit] Running org.apache.poi.hslf.record.TestTxMasterStyleAtom
    [junit] Tests run: 1, Failures: 0, Errors: 0, Skipped: 0, Time elapsed: 0.003 sec
    [junit] Running org.apache.poi.hslf.record.TestUserEditAtom
    [junit] Tests run: 3, Failures: 0, Errors: 0, Skipped: 0, Time elapsed: 0.003 sec
    [junit] Running org.apache.poi.hslf.usermodel.TestAddingSlides
    [junit] Tests run: 5, Failures: 0, Errors: 0, Skipped: 0, Time elapsed: 0.038 sec
    [junit] Running org.apache.poi.hslf.usermodel.TestBackground
    [junit] Tests run: 3, Failures: 0, Errors: 0, Skipped: 0, Time elapsed: 0.013 sec
    [junit] Running org.apache.poi.hslf.usermodel.TestBugs
    [junit] Tests run: 41, Failures: 0, Errors: 0, Skipped: 0, Time elapsed: 0.735 sec
    [junit] Running org.apache.poi.hslf.usermodel.TestCounts
    [junit] Tests run: 2, Failures: 0, Errors: 0, Skipped: 0, Time elapsed: 0.003 sec
    [junit] Running org.apache.poi.hslf.usermodel.TestFontRendering
    [junit] Tests run: 1, Failures: 0, Errors: 0, Skipped: 1, Time elapsed: 0.004 sec
    [junit] Running org.apache.poi.hslf.usermodel.TestHSLFSlideShow
    [junit] Tests run: 8, Failures: 0, Errors: 0, Skipped: 0, Time elapsed: 0.019 sec
    [junit] Running org.apache.poi.hslf.usermodel.TestHSLFSlideShowFactory
    [junit] Tests run: 1, Failures: 0, Errors: 0, Skipped: 0, Time elapsed: 0.011 sec
    [junit] Running org.apache.poi.hslf.usermodel.TestMostRecentRecords
    [junit] Tests run: 3, Failures: 0, Errors: 0, Skipped: 0, Time elapsed: 0.003 sec
    [junit] Running org.apache.poi.hslf.usermodel.TestNotesText
    [junit] Tests run: 2, Failures: 0, Errors: 0, Skipped: 0, Time elapsed: 0.002 sec
    [junit] Running org.apache.poi.hslf.usermodel.TestNumberedList
    [junit] Tests run: 1, Failures: 0, Errors: 0, Skipped: 0, Time elapsed: 0.002 sec
    [junit] Running org.apache.poi.hslf.usermodel.TestNumberedList2
    [junit] Tests run: 1, Failures: 0, Errors: 0, Skipped: 0, Time elapsed: 0.003 sec
    [junit] Running org.apache.poi.hslf.usermodel.TestNumberedList3
    [junit] Tests run: 1, Failures: 0, Errors: 0, Skipped: 0, Time elapsed: 0.002 sec
    [junit] Running org.apache.poi.hslf.usermodel.TestPicture
    [junit] Tests run: 4, Failures: 0, Errors: 0, Skipped: 1, Time elapsed: 0.045 sec
    [junit] Running org.apache.poi.hslf.usermodel.TestPictures
    [junit] Tests run: 11, Failures: 0, Errors: 0, Skipped: 1, Time elapsed: 0.084 sec
    [junit] Running org.apache.poi.hslf.usermodel.TestReOrderingSlides
    [junit] Tests run: 5, Failures: 0, Errors: 0, Skipped: 0, Time elapsed: 0.022 sec
    [junit] Running org.apache.poi.hslf.usermodel.TestRecordSetup
    [junit] Tests run: 1, Failures: 0, Errors: 0, Skipped: 0, Time elapsed: 0.002 sec
    [junit] Running org.apache.poi.hslf.usermodel.TestRichTextRun
    [junit] Tests run: 11, Failures: 0, Errors: 0, Skipped: 0, Time elapsed: 0.172 sec
    [junit] Running org.apache.poi.hslf.usermodel.TestSheetText
    [junit] Tests run: 1, Failures: 0, Errors: 0, Skipped: 0, Time elapsed: 0.003 sec
    [junit] Running org.apache.poi.hslf.usermodel.TestSlideOrdering
    [junit] Tests run: 3, Failures: 0, Errors: 0, Skipped: 0, Time elapsed: 0.009 sec
    [junit] Running org.apache.poi.hslf.usermodel.TestSoundData
    [junit] Tests run: 1, Failures: 0, Errors: 0, Skipped: 0, Time elapsed: 0.003 sec
    [junit] Running org.apache.poi.hslf.usermodel.TestTable
    [junit] Tests run: 3, Failures: 0, Errors: 0, Skipped: 0, Time elapsed: 0.026 sec
    [junit] Running org.apache.poi.hslf.usermodel.TestTextRun
    [junit] Tests run: 14, Failures: 0, Errors: 0, Skipped: 0, Time elapsed: 0.036 sec
    [junit] Running org.apache.poi.hslf.usermodel.TestTextShape
    [junit] Tests run: 6, Failures: 0, Errors: 0, Skipped: 0, Time elapsed: 0.014 sec
    [junit] Running org.apache.poi.hslf.util.TestSystemTimeUtils
    [junit] Tests run: 4, Failures: 0, Errors: 0, Skipped: 0, Time elapsed: 0.005 sec
    [junit] Running org.apache.poi.hsmf.TestBasics
    [junit] Tests run: 9, Failures: 0, Errors: 0, Skipped: 0, Time elapsed: 0.017 sec
    [junit] Running org.apache.poi.hsmf.TestBlankFileRead
    [junit] Tests run: 7, Failures: 0, Errors: 0, Skipped: 0, Time elapsed: 0.006 sec
    [junit] Running org.apache.poi.hsmf.TestExtractEmbeddedMSG
    [junit] Tests run: 1, Failures: 0, Errors: 0, Skipped: 0, Time elapsed: 0.01 sec
    [junit] Running org.apache.poi.hsmf.TestFileWithAttachmentsRead
    [junit] Tests run: 4, Failures: 0, Errors: 0, Skipped: 0, Time elapsed: 0.014 sec
    [junit] Running org.apache.poi.hsmf.TestFixedSizedProperties
    [junit] Tests run: 7, Failures: 0, Errors: 0, Skipped: 0, Time elapsed: 0.206 sec
    [junit] Running org.apache.poi.hsmf.TestMessageSubmissionChunk
    [junit] Tests run: 2, Failures: 0, Errors: 0, Skipped: 0, Time elapsed: 0.005 sec
    [junit] Running org.apache.poi.hsmf.TestMessageSubmissionChunkY2KRead
    [junit] Tests run: 3, Failures: 0, Errors: 0, Skipped: 0, Time elapsed: 0.004 sec
    [junit] Running org.apache.poi.hsmf.TestOutlook30FileRead
    [junit] Tests run: 9, Failures: 0, Errors: 0, Skipped: 0, Time elapsed: 0.011 sec
    [junit] Running org.apache.poi.hsmf.TestSimpleFileRead
    [junit] Tests run: 9, Failures: 0, Errors: 0, Skipped: 0, Time elapsed: 0.089 sec
    [junit] Running org.apache.poi.hsmf.datatypes.TestChunkData
    [junit] Tests run: 6, Failures: 0, Errors: 0, Skipped: 0, Time elapsed: 0.007 sec
    [junit] Running org.apache.poi.hsmf.datatypes.TestMAPIProperty
    [junit] Tests run: 3, Failures: 0, Errors: 0, Skipped: 0, Time elapsed: 0.005 sec
    [junit] Running org.apache.poi.hsmf.datatypes.TestSorters
    [junit] Tests run: 2, Failures: 0, Errors: 0, Skipped: 0, Time elapsed: 0.002 sec
    [junit] Running org.apache.poi.hsmf.datatypes.TestTypes
    [junit] Tests run: 3, Failures: 0, Errors: 0, Skipped: 0, Time elapsed: 0.003 sec
    [junit] Running org.apache.poi.hsmf.extractor.TestOutlookTextExtractor
    [junit] Tests run: 8, Failures: 0, Errors: 0, Skipped: 0, Time elapsed: 0.264 sec
    [junit] Running org.apache.poi.hsmf.parsers.TestPOIFSChunkParser
    [junit] Tests run: 6, Failures: 0, Errors: 0, Skipped: 0, Time elapsed: 0.198 sec
    [junit] Running org.apache.poi.hssf.converter.TestExcelConverterSuite
    [junit] Tests run: 762, Failures: 0, Errors: 0, Skipped: 0, Time elapsed: 13.498 sec
    [junit] Running org.apache.poi.hssf.usermodel.TestHSSFChart
    [junit] Tests run: 7, Failures: 0, Errors: 0, Skipped: 0, Time elapsed: 0.125 sec
    [junit] Running org.apache.poi.hwmf.TestHwmfParsing
    [junit] Tests run: 7, Failures: 0, Errors: 0, Skipped: 5, Time elapsed: 0.084 sec
    [junit] Running org.apache.poi.hwpf.TestFieldsTables
    [junit] Tests run: 1, Failures: 0, Errors: 0, Skipped: 0, Time elapsed: 0.007 sec
    [junit] Running org.apache.poi.hwpf.TestHWPFPictures
    [junit] Tests run: 6, Failures: 0, Errors: 0, Skipped: 0, Time elapsed: 0.164 sec
    [junit] Running org.apache.poi.hwpf.TestHWPFRangeParts
    [junit] Tests run: 2, Failures: 0, Errors: 0, Skipped: 0, Time elapsed: 0.019 sec
    [junit] Running org.apache.poi.hwpf.converter.TestNumberFormatter
    [junit] Tests run: 2, Failures: 0, Errors: 0, Skipped: 0, Time elapsed: 0.176 sec
    [junit] Running org.apache.poi.hwpf.converter.TestWordToConverterSuite
    [junit] Tests run: 405, Failures: 0, Errors: 0, Skipped: 0, Time elapsed: 4.886 sec
    [junit] Running org.apache.poi.hwpf.converter.TestWordToFoConverter
    [junit] Tests run: 8, Failures: 0, Errors: 0, Skipped: 0, Time elapsed: 0.014 sec
    [junit] Running org.apache.poi.hwpf.converter.TestWordToHtmlConverter
    [junit] Tests run: 21, Failures: 0, Errors: 0, Skipped: 0, Time elapsed: 0.086 sec
    [junit] Running org.apache.poi.hwpf.converter.TestWordToTextConverter
    [junit] Tests run: 3, Failures: 0, Errors: 0, Skipped: 0, Time elapsed: 0.043 sec
    [junit] Running org.apache.poi.hwpf.dev.TestHWPFLister
    [junit] Tests run: 2, Failures: 0, Errors: 0, Skipped: 0, Time elapsed: 0.014 sec
    [junit] Running org.apache.poi.hwpf.extractor.TestDifferentRoutes
    [junit] Tests run: 2, Failures: 0, Errors: 0, Skipped: 0, Time elapsed: 0.004 sec
    [junit] Running org.apache.poi.hwpf.extractor.TestWordExtractor
    [junit] Tests run: 18, Failures: 0, Errors: 0, Skipped: 0, Time elapsed: 0.064 sec
    [junit] Running org.apache.poi.hwpf.extractor.TestWordExtractorBugs
    [junit] Tests run: 3, Failures: 0, Errors: 0, Skipped: 0, Time elapsed: 0.193 sec
    [junit] Running org.apache.poi.hwpf.model.TestBookmarksTables
    [junit] Tests run: 5, Failures: 0, Errors: 0, Skipped: 0, Time elapsed: 0.006 sec
    [junit] Running org.apache.poi.hwpf.model.TestCHPBinTable
    [junit] Tests run: 1, Failures: 0, Errors: 0, Skipped: 0, Time elapsed: 0.002 sec
    [junit] Running org.apache.poi.hwpf.model.TestDocumentProperties
    [junit] Tests run: 1, Failures: 0, Errors: 0, Skipped: 0, Time elapsed: 0.004 sec
    [junit] Running org.apache.poi.hwpf.model.TestFileInformationBlock
    [junit] Tests run: 1, Failures: 0, Errors: 0, Skipped: 0, Time elapsed: 0.002 sec
    [junit] Running org.apache.poi.hwpf.model.TestFontTable
    [junit] Tests run: 1, Failures: 0, Errors: 0, Skipped: 0, Time elapsed: 0.001 sec
    [junit] Running org.apache.poi.hwpf.model.TestListTables
    [junit] Tests run: 1, Failures: 0, Errors: 0, Skipped: 0, Time elapsed: 0.001 sec
    [junit] Running org.apache.poi.hwpf.model.TestNotesTables
    [junit] Tests run: 1, Failures: 0, Errors: 0, Skipped: 0, Time elapsed: 0.001 sec
    [junit] Running org.apache.poi.hwpf.model.TestPAPBinTable
    [junit] Tests run: 2, Failures: 0, Errors: 0, Skipped: 0, Time elapsed: 0.007 sec
    [junit] Running org.apache.poi.hwpf.model.TestPlexOfCps
    [junit] Tests run: 1, Failures: 0, Errors: 0, Skipped: 0, Time elapsed: 0.001 sec
    [junit] Running org.apache.poi.hwpf.model.TestRevisionMarkAuthorTable
    [junit] Tests run: 3, Failures: 0, Errors: 0, Skipped: 0, Time elapsed: 0.004 sec
    [junit] Running org.apache.poi.hwpf.model.TestSavedByTable
    [junit] Tests run: 1, Failures: 0, Errors: 0, Skipped: 0, Time elapsed: 0.012 sec
    [junit] Running org.apache.poi.hwpf.model.TestSectionTable
    [junit] Tests run: 1, Failures: 0, Errors: 0, Skipped: 0, Time elapsed: 0.002 sec
    [junit] Running org.apache.poi.hwpf.model.TestStyleSheet
    [junit] Tests run: 2, Failures: 0, Errors: 0, Skipped: 0, Time elapsed: 0.003 sec
    [junit] Running org.apache.poi.hwpf.model.TestTextPieceTable
    [junit] Tests run: 4, Failures: 0, Errors: 0, Skipped: 0, Time elapsed: 0.009 sec
    [junit] Running org.apache.poi.hwpf.sprm.TestSprms
    [junit] Tests run: 2, Failures: 0, Errors: 0, Skipped: 0, Time elapsed: 0.005 sec
    [junit] Running org.apache.poi.hwpf.usermodel.TestBorderCode
    [junit] Tests run: 1, Failures: 0, Errors: 0, Skipped: 0, Time elapsed: 0.001 sec
    [junit] Running org.apache.poi.hwpf.usermodel.TestBug46610
    [junit] Tests run: 3, Failures: 0, Errors: 0, Skipped: 0, Time elapsed: 0.006 sec
    [junit] Running org.apache.poi.hwpf.usermodel.TestBug47563
    [junit] Tests run: 1, Failures: 0, Errors: 0, Skipped: 0, Time elapsed: 0.02 sec
    [junit] Running org.apache.poi.hwpf.usermodel.TestBug49820
    [junit] Tests run: 1, Failures: 0, Errors: 0, Skipped: 0, Time elapsed: 0.001 sec
    [junit] Running org.apache.poi.hwpf.usermodel.TestBug50075
    [junit] Tests run: 1, Failures: 0, Errors: 0, Skipped: 0, Time elapsed: 0.002 sec
    [junit] Running org.apache.poi.hwpf.usermodel.TestBugs
    [junit] Tests run: 39, Failures: 0, Errors: 0, Skipped: 0, Time elapsed: 0.423 sec
    [junit] Running org.apache.poi.hwpf.usermodel.TestHWPFOldDocument
    [junit] Tests run: 14, Failures: 0, Errors: 0, Skipped: 0, Time elapsed: 0.063 sec
    [junit] Running org.apache.poi.hwpf.usermodel.TestHWPFWrite
    [junit] Tests run: 5, Failures: 0, Errors: 0, Skipped: 0, Time elapsed: 0.015 sec
    [junit] Running org.apache.poi.hwpf.usermodel.TestHeaderStories
    [junit] Tests run: 8, Failures: 0, Errors: 0, Skipped: 0, Time elapsed: 0.023 sec
    [junit] Running org.apache.poi.hwpf.usermodel.TestLists
    [junit] Tests run: 7, Failures: 0, Errors: 0, Skipped: 0, Time elapsed: 0.009 sec
    [junit] Running org.apache.poi.hwpf.usermodel.TestOfficeDrawings
    [junit] Tests run: 1, Failures: 0, Errors: 0, Skipped: 0, Time elapsed: 0.001 sec
    [junit] Running org.apache.poi.hwpf.usermodel.TestPictures
    [junit] Tests run: 16, Failures: 0, Errors: 0, Skipped: 2, Time elapsed: 0.025 sec
    [junit] Running org.apache.poi.hwpf.usermodel.TestProblems
    [junit] Tests run: 10, Failures: 0, Errors: 0, Skipped: 0, Time elapsed: 0.012 sec
    [junit] Running org.apache.poi.hwpf.usermodel.TestRange
    [junit] Tests run: 2, Failures: 0, Errors: 0, Skipped: 0, Time elapsed: 0.002 sec
    [junit] Running org.apache.poi.hwpf.usermodel.TestRangeDelete
    [junit] Tests run: 4, Failures: 0, Errors: 0, Skipped: 0, Time elapsed: 0.003 sec
    [junit] Running org.apache.poi.hwpf.usermodel.TestRangeInsertion
    [junit] Tests run: 3, Failures: 0, Errors: 0, Skipped: 0, Time elapsed: 0.002 sec
    [junit] Running org.apache.poi.hwpf.usermodel.TestRangeProperties
    [junit] Tests run: 5, Failures: 0, Errors: 0, Skipped: 0, Time elapsed: 0.005 sec
    [junit] Running org.apache.poi.hwpf.usermodel.TestRangeReplacement
    [junit] Tests run: 4, Failures: 0, Errors: 0, Skipped: 0, Time elapsed: 0.004 sec
    [junit] Running org.apache.poi.hwpf.usermodel.TestRangeSymbols
    [junit] Tests run: 2, Failures: 0, Errors: 0, Skipped: 0, Time elapsed: 0.002 sec
    [junit] Running org.apache.poi.hwpf.usermodel.TestTableRow
    [junit] Tests run: 2, Failures: 0, Errors: 0, Skipped: 0, Time elapsed: 0.002 sec

-test-scratchpad-write-testfile:

-test-ooxml-check:

-ooxml-lite-agent:
      [jar] Building jar: <https://builds.apache.org/job/POI-DSL-old-Xerces/ws/build/ooxml-lite-agent.jar>

test-ooxml:
[jacoco:coverage] Enhancing junit with coverage
    [junit] Running org.apache.poi.TestDetectAsOOXML
    [junit] Tests run: 3, Failures: 0, Errors: 0, Skipped: 0, Time elapsed: 0.706 sec
    [junit] Running org.apache.poi.TestEmbedded
    [junit] Tests run: 3, Failures: 0, Errors: 0, Skipped: 0, Time elapsed: 1.322 sec
    [junit] Running org.apache.poi.TestXMLPropertiesTextExtractor
    [junit] Tests run: 5, Failures: 0, Errors: 0, Skipped: 0, Time elapsed: 0.454 sec
    [junit] Running org.apache.poi.extractor.ooxml.TestExtractorFactory
    [junit] Tests run: 15, Failures: 0, Errors: 0, Skipped: 0, Time elapsed: 2.775 sec
    [junit] Running org.apache.poi.ooxml.TestPOIXMLDocument
    [junit] Tests run: 11, Failures: 0, Errors: 0, Skipped: 0, Time elapsed: 4.195 sec
    [junit] Running org.apache.poi.ooxml.TestPOIXMLProperties
    [junit] Tests run: 8, Failures: 0, Errors: 0, Skipped: 1, Time elapsed: 0.28 sec
    [junit] Running org.apache.poi.ooxml.util.TestDocumentHelper
    [junit] Tests run: 3, Failures: 0, Errors: 0, Skipped: 0, Time elapsed: 0.258 sec
    [junit] Running org.apache.poi.ooxml.util.TestSAXHelper
    [junit] Tests run: 2, Failures: 0, Errors: 1, Skipped: 0, Time elapsed: 0.022 sec

BUILD FAILED
<https://builds.apache.org/job/POI-DSL-old-Xerces/ws/build.xml>:1631: The following
error occurred while executing this line:
<https://builds.apache.org/job/POI-DSL-old-Xerces/ws/build.xml>:1597: The following
error occurred while executing this line:
<https://builds.apache.org/job/POI-DSL-old-Xerces/ws/build.xml>:1239: Tests failed

Total time: 4 minutes 37 seconds
Build step 'Invoke Ant' marked build as failure
Skipping publisher since build result is FAILURE
Archiving artifacts
[Fast Archiver] Compressed 59.99 MB of artifacts by 59.4% relative to #125
Skipping publisher since build result is FAILURE
Recording test results

---------------------------------------------------------------------
To unsubscribe, e-mail: dev-unsubscribe@poi.apache.org
For additional commands, e-mail: dev-help@poi.apache.org


Mime
View raw message