portals-commits mailing list archives

Site index · List index
Message view « Date » · « Thread »
Top « Date » · « Thread »
From Apache Jenkins Server <jenk...@builds.apache.org>
Subject Build failed in Jenkins: portals-jetspeed-2-applications-j2-admin-trunk » Jetspeed-2 Administration #155
Date Wed, 17 Dec 2014 02:47:45 GMT
See <https://builds.apache.org/job/portals-jetspeed-2-applications-j2-admin-trunk/org.apache.portals.jetspeed-2$j2-admin/155/changes>

Changes:

[woonsan] APA-67: ProxyContext package name change

------------------------------------------
maven-agent.jar already up to date
classworlds.jar already up to date
maven-interceptor.jar already up to date
maven2.1-interceptor.jar already up to date
<===[JENKINS REMOTING CAPACITY]===>   channel started
Executing Maven:  -B -f <https://builds.apache.org/job/portals-jetspeed-2-applications-j2-admin-trunk/org.apache.portals.jetspeed-2$j2-admin/ws/pom.xml>
-Dmaven.repo.local=/home/jenkins/jenkins-slave/maven-repositories/0 clean deploy
[INFO] Scanning for projects...
Downloading: http://repo1.maven.org/maven2/org/apache/maven/wagon/wagon-ftp/1.0-alpha-6/wagon-ftp-1.0-alpha-6.pom
806b downloaded  (wagon-ftp-1.0-alpha-6.pom)
Downloading: http://repo1.maven.org/maven2/org/apache/maven/wagon/wagon-ftp/1.0-alpha-6/wagon-ftp-1.0-alpha-6.jar
8K downloaded  (wagon-ftp-1.0-alpha-6.jar)
[INFO] ------------------------------------------------------------------------
[INFO] Building Jetspeed-2 Administration
[INFO]    task-segment: [clean, deploy]
[INFO] ------------------------------------------------------------------------
[INFO] [clean:clean {execution: default-clean}]
[INFO] Deleting file set: <https://builds.apache.org/job/portals-jetspeed-2-applications-j2-admin-trunk/org.apache.portals.jetspeed-2$j2-admin/ws/>
(included: [*.log], excluded: [])
[INFO] Setting property: classpath.resource.loader.class => 'org.codehaus.plexus.velocity.ContextClassLoaderResourceLoader'.
[INFO] Setting property: velocimacro.messages.on => 'false'.
[INFO] Setting property: resource.loader => 'classpath'.
[INFO] Setting property: resource.manager.logwhenfound => 'false'.
[INFO] [remote-resources:process {execution: default}]
Downloading: http://repo1.maven.org/maven2/org/apache/portals/pluto/pluto-container-api/2.0.3/pluto-container-api-2.0.3.pom
1K downloaded  (pluto-container-api-2.0.3.pom)
Downloading: http://repo1.maven.org/maven2/org/apache/portals/pluto/pluto/2.0.3/pluto-2.0.3.pom
18K downloaded  (pluto-2.0.3.pom)
[INFO] snapshot org.apache.portals.jetspeed-2:jetspeed-api:2.3.0-SNAPSHOT: checking for updates
from apache.snapshots
Downloading: http://repository.apache.org/snapshots/org/apache/portals/jetspeed-2/jetspeed-api/2.3.0-SNAPSHOT/jetspeed-api-2.3.0-20141202.001023-14.pom
1K downloaded  (jetspeed-api-2.3.0-20141202.001023-14.pom)
[INFO] snapshot org.apache.portals.jetspeed-2:jetspeed-2:2.3.0-SNAPSHOT: checking for updates
from apache.snapshots
Downloading: http://repository.apache.org/snapshots/org/apache/portals/jetspeed-2/jetspeed-2/2.3.0-SNAPSHOT/jetspeed-2-2.3.0-20141202.001023-14.pom
81K downloaded  (jetspeed-2-2.3.0-20141202.001023-14.pom)
[INFO] snapshot org.apache.portals.jetspeed-2:jetspeed-commons:2.3.0-SNAPSHOT: checking for
updates from apache.snapshots
Downloading: http://repository.apache.org/snapshots/org/apache/portals/jetspeed-2/jetspeed-commons/2.3.0-SNAPSHOT/jetspeed-commons-2.3.0-20141202.001023-14.pom
2K downloaded  (jetspeed-commons-2.3.0-20141202.001023-14.pom)
[INFO] snapshot org.apache.portals.jetspeed-2:jetspeed-locator:2.3.0-SNAPSHOT: checking for
updates from apache.snapshots
Downloading: http://repository.apache.org/snapshots/org/apache/portals/jetspeed-2/jetspeed-locator/2.3.0-SNAPSHOT/jetspeed-locator-2.3.0-20141202.001023-14.pom
2K downloaded  (jetspeed-locator-2.3.0-20141202.001023-14.pom)
[INFO] snapshot org.apache.portals.jetspeed-2:components:2.3.0-SNAPSHOT: checking for updates
from apache.snapshots
Downloading: http://repository.apache.org/snapshots/org/apache/portals/jetspeed-2/components/2.3.0-SNAPSHOT/components-2.3.0-20141202.001023-14.pom
2K downloaded  (components-2.3.0-20141202.001023-14.pom)
[INFO] snapshot org.apache.portals.applications:apa-gems:1.2-SNAPSHOT: checking for updates
from apache.snapshots
Downloading: http://repository.apache.org/snapshots/org/apache/portals/applications/apa-gems/1.2-SNAPSHOT/apa-gems-1.2-20140713.003042-3.pom
7K downloaded  (apa-gems-1.2-20140713.003042-3.pom)
Downloading: http://repo1.maven.org/maven2/org/springframework/spring-webmvc-portlet/3.2.9.RELEASE/spring-webmvc-portlet-3.2.9.RELEASE.pom
2K downloaded  (spring-webmvc-portlet-3.2.9.RELEASE.pom)
Downloading: http://repo1.maven.org/maven2/org/apache/portals/bridges/portals-bridges-frameworks/1.0.4/portals-bridges-frameworks-1.0.4.pom
3K downloaded  (portals-bridges-frameworks-1.0.4.pom)
[WARNING] *** CHECKSUM FAILED - Checksum failed on download: local = 'df1361970b77a559272c2013927013f0b5f7e41a';
remote = '1e72370ca47f066b39881143735bc5b46eefa2db' - RETRYING
Downloading: http://repo1.maven.org/maven2/org/apache/portals/bridges/portals-bridges-frameworks/1.0.4/portals-bridges-frameworks-1.0.4.pom
3K downloaded  (portals-bridges-frameworks-1.0.4.pom)
[WARNING] *** CHECKSUM FAILED - Checksum failed on download: local = 'df1361970b77a559272c2013927013f0b5f7e41a';
remote = '1e72370ca47f066b39881143735bc5b46eefa2db' - IGNORING
Downloading: http://repo1.maven.org/maven2/org/apache/portals/bridges/portals-bridges/1.0.4/portals-bridges-1.0.4.pom
24K downloaded  (portals-bridges-1.0.4.pom)
[WARNING] *** CHECKSUM FAILED - Checksum failed on download: local = '9412a74bdd8375281de80410ca835d3b71c14e7f';
remote = '70cab0a7ec1e1d30870d7f77cb54906f8453fd2f' - RETRYING
Downloading: http://repo1.maven.org/maven2/org/apache/portals/bridges/portals-bridges/1.0.4/portals-bridges-1.0.4.pom
24K downloaded  (portals-bridges-1.0.4.pom)
[WARNING] *** CHECKSUM FAILED - Checksum failed on download: local = '9412a74bdd8375281de80410ca835d3b71c14e7f';
remote = '70cab0a7ec1e1d30870d7f77cb54906f8453fd2f' - IGNORING
Downloading: http://www.bluesunrise.com/maven2/commons-validator/commons-validator/1.1.3/commons-validator-1.1.3.pom
[INFO] Unable to find resource 'commons-validator:commons-validator:pom:1.1.3' in repository
com.bluesunrise.m2 (http://www.bluesunrise.com/maven2)
Downloading: http://repo1.maven.org/maven2/commons-validator/commons-validator/1.1.3/commons-validator-1.1.3.pom
168b downloaded  (commons-validator-1.1.3.pom)
Downloading: http://www.bluesunrise.com/maven2/org/apache/portals/bridges/portals-bridges-common/1.0.4/portals-bridges-common-1.0.4.pom
[INFO] Unable to find resource 'org.apache.portals.bridges:portals-bridges-common:pom:1.0.4'
in repository com.bluesunrise.m2 (http://www.bluesunrise.com/maven2)
Downloading: http://repo1.maven.org/maven2/org/apache/portals/bridges/portals-bridges-common/1.0.4/portals-bridges-common-1.0.4.pom
2K downloaded  (portals-bridges-common-1.0.4.pom)
[WARNING] *** CHECKSUM FAILED - Checksum failed on download: local = '7c9e919c352f347a001885f7eb0da8df28790a65';
remote = 'fa61e182aa95c29c5f8a36223f95b15754156887' - RETRYING
Downloading: http://repo1.maven.org/maven2/org/apache/portals/bridges/portals-bridges-common/1.0.4/portals-bridges-common-1.0.4.pom
2K downloaded  (portals-bridges-common-1.0.4.pom)
[WARNING] *** CHECKSUM FAILED - Checksum failed on download: local = '7c9e919c352f347a001885f7eb0da8df28790a65';
remote = 'fa61e182aa95c29c5f8a36223f95b15754156887' - IGNORING
Downloading: http://www.bluesunrise.com/maven2/org/apache/portals/bridges/portals-bridges-velocity/1.0.4/portals-bridges-velocity-1.0.4.pom
[INFO] Unable to find resource 'org.apache.portals.bridges:portals-bridges-velocity:pom:1.0.4'
in repository com.bluesunrise.m2 (http://www.bluesunrise.com/maven2)
Downloading: http://repo1.maven.org/maven2/org/apache/portals/bridges/portals-bridges-velocity/1.0.4/portals-bridges-velocity-1.0.4.pom
3K downloaded  (portals-bridges-velocity-1.0.4.pom)
[WARNING] *** CHECKSUM FAILED - Checksum failed on download: local = '6d20ce375b39acfe25ed170a24873ce0b214286d';
remote = '9fe436836579ec8aada523aadf54e3edf7aa1f9f' - RETRYING
Downloading: http://repo1.maven.org/maven2/org/apache/portals/bridges/portals-bridges-velocity/1.0.4/portals-bridges-velocity-1.0.4.pom
3K downloaded  (portals-bridges-velocity-1.0.4.pom)
[WARNING] *** CHECKSUM FAILED - Checksum failed on download: local = '6d20ce375b39acfe25ed170a24873ce0b214286d';
remote = '9fe436836579ec8aada523aadf54e3edf7aa1f9f' - IGNORING
Downloading: http://repo1.maven.org/maven2/org/apache/portals/bridges/portals-bridges-portletfilter/1.0.4/portals-bridges-portletfilter-1.0.4.pom
2K downloaded  (portals-bridges-portletfilter-1.0.4.pom)
[WARNING] *** CHECKSUM FAILED - Checksum failed on download: local = 'ecc77280c4e9d38f636d7b1035ceafea9bcc5ccc';
remote = 'b06a7a12fda714dfa0a54310ef33f67886e113f2' - RETRYING
Downloading: http://repo1.maven.org/maven2/org/apache/portals/bridges/portals-bridges-portletfilter/1.0.4/portals-bridges-portletfilter-1.0.4.pom
2K downloaded  (portals-bridges-portletfilter-1.0.4.pom)
[WARNING] *** CHECKSUM FAILED - Checksum failed on download: local = 'ecc77280c4e9d38f636d7b1035ceafea9bcc5ccc';
remote = 'b06a7a12fda714dfa0a54310ef33f67886e113f2' - IGNORING
Downloading: http://repo1.maven.org/maven2/org/apache/wicket/wicket/1.4.17/wicket-1.4.17.pom
2K downloaded  (wicket-1.4.17.pom)
Downloading: http://repo1.maven.org/maven2/org/apache/wicket/wicket-parent/1.4.17/wicket-parent-1.4.17.pom
28K downloaded  (wicket-parent-1.4.17.pom)
Downloading: http://repo1.maven.org/maven2/org/apache/wicket/wicket-extensions/1.4.17/wicket-extensions-1.4.17.pom
1K downloaded  (wicket-extensions-1.4.17.pom)
[INFO] snapshot org.apache.portals.applications:apa-webcontent2-portlets:2.0-SNAPSHOT: checking
for updates from apache.snapshots
Downloading: http://repository.apache.org/snapshots/org/apache/portals/applications/apa-webcontent2-portlets/2.0-SNAPSHOT/apa-webcontent2-portlets-2.0-20141014.000625-14.pom
3K downloaded  (apa-webcontent2-portlets-2.0-20141014.000625-14.pom)
[INFO] snapshot org.apache.portals.applications:apa-webcontent2:2.0-SNAPSHOT: checking for
updates from apache.snapshots
Downloading: http://repository.apache.org/snapshots/org/apache/portals/applications/apa-webcontent2/2.0-SNAPSHOT/apa-webcontent2-2.0-20141014.000625-14.pom
10K downloaded  (apa-webcontent2-2.0-20141014.000625-14.pom)
[INFO] snapshot org.apache.portals.applications:apa-webcontent2-reverse-proxy:2.0-SNAPSHOT:
checking for updates from apache.snapshots
Downloading: http://repository.apache.org/snapshots/org/apache/portals/applications/apa-webcontent2-reverse-proxy/2.0-SNAPSHOT/apa-webcontent2-reverse-proxy-2.0-20141014.000625-14.pom
5K downloaded  (apa-webcontent2-reverse-proxy-2.0-20141014.000625-14.pom)
[INFO] snapshot org.apache.portals.applications:apa-webcontent2-content-rewriter:2.0-SNAPSHOT:
checking for updates from apache.snapshots
Downloading: http://repository.apache.org/snapshots/org/apache/portals/applications/apa-webcontent2-content-rewriter/2.0-SNAPSHOT/apa-webcontent2-content-rewriter-2.0-20141014.000625-14.pom
2K downloaded  (apa-webcontent2-content-rewriter-2.0-20141014.000625-14.pom)
Downloading: http://repo1.maven.org/maven2/org/apache/wicket/wicket/1.4.17/wicket-1.4.17.jar
Downloading: http://repository.apache.org/snapshots/org/apache/portals/jetspeed-2/jetspeed-api/2.3.0-SNAPSHOT/jetspeed-api-2.3.0-20141202.001023-14.jar
Downloading: http://repo1.maven.org/maven2/org/apache/portals/pluto/pluto-container-api/2.0.3/pluto-container-api-2.0.3.jar
Downloading: http://repository.apache.org/snapshots/org/apache/portals/applications/apa-gems/1.2-SNAPSHOT/apa-gems-1.2-20140713.003042-3.jar
Downloading: http://repo1.maven.org/maven2/org/springframework/spring-webmvc-portlet/3.2.9.RELEASE/spring-webmvc-portlet-3.2.9.RELEASE.jar
65K downloaded  (apa-gems-1.2-20140713.003042-3.jar)
Downloading: http://repo1.maven.org/maven2/org/apache/portals/bridges/portals-bridges-frameworks/1.0.4/portals-bridges-frameworks-1.0.4.jar
271K downloaded  (jetspeed-api-2.3.0-20141202.001023-14.jar)
38K downloaded  (pluto-container-api-2.0.3.jar)
Downloading: http://repository.apache.org/snapshots/org/apache/portals/applications/apa-webcontent2-portlets/2.0-SNAPSHOT/apa-webcontent2-portlets-2.0-20141014.000625-14.jar
183K downloaded  (spring-webmvc-portlet-3.2.9.RELEASE.jar)
30K downloaded  (portals-bridges-frameworks-1.0.4.jar)
[WARNING] *** CHECKSUM FAILED - Checksum failed on download: local = '07df4af7d2a51ee1fa3acffd5965f2a8cd3a154c';
remote = '0a4c41cedfffa7f1376b16242ab849da2ce0b346' - RETRYING
Downloading: http://repo1.maven.org/maven2/org/apache/portals/bridges/portals-bridges-frameworks/1.0.4/portals-bridges-frameworks-1.0.4.jar
Downloading: http://repository.apache.org/snapshots/org/apache/portals/jetspeed-2/jetspeed-commons/2.3.0-SNAPSHOT/jetspeed-commons-2.3.0-20141202.001023-14.jar
90K downloaded  (apa-webcontent2-portlets-2.0-20141014.000625-14.jar)
Downloading: http://repository.apache.org/snapshots/org/apache/portals/applications/apa-webcontent2-reverse-proxy/2.0-SNAPSHOT/apa-webcontent2-reverse-proxy-2.0-20141014.000625-14.jar
30K downloaded  (portals-bridges-frameworks-1.0.4.jar)
98K downloaded  (jetspeed-commons-2.3.0-20141202.001023-14.jar)
[WARNING] *** CHECKSUM FAILED - Checksum failed on download: local = '07df4af7d2a51ee1fa3acffd5965f2a8cd3a154c';
remote = '0a4c41cedfffa7f1376b16242ab849da2ce0b346' - IGNORING
Downloading: http://repo1.maven.org/maven2/org/apache/portals/bridges/portals-bridges-portletfilter/1.0.4/portals-bridges-portletfilter-1.0.4.jar
70K downloaded  (apa-webcontent2-reverse-proxy-2.0-20141014.000625-14.jar)
Downloading: http://repository.apache.org/snapshots/org/apache/portals/jetspeed-2/jetspeed-locator/2.3.0-SNAPSHOT/jetspeed-locator-2.3.0-20141202.001023-14.jar
Downloading: http://repository.apache.org/snapshots/org/apache/portals/applications/apa-webcontent2-content-rewriter/2.0-SNAPSHOT/apa-webcontent2-content-rewriter-2.0-20141014.000625-14.jar
15K downloaded  (portals-bridges-portletfilter-1.0.4.jar)
[WARNING] *** CHECKSUM FAILED - Checksum failed on download: local = 'b2126a32ed851b8d98ac871a506abc422fb0798a';
remote = 'c2f689001ddee4ce8d2e0906b5396d5bfb90076e' - RETRYING
Downloading: http://repo1.maven.org/maven2/org/apache/portals/bridges/portals-bridges-portletfilter/1.0.4/portals-bridges-portletfilter-1.0.4.jar
15K downloaded  (portals-bridges-portletfilter-1.0.4.jar)
[WARNING] *** CHECKSUM FAILED - Checksum failed on download: local = 'b2126a32ed851b8d98ac871a506abc422fb0798a';
remote = 'c2f689001ddee4ce8d2e0906b5396d5bfb90076e' - IGNORING
18K downloaded  (jetspeed-locator-2.3.0-20141202.001023-14.jar)
22K downloaded  (apa-webcontent2-content-rewriter-2.0-20141014.000625-14.jar)
1914K downloaded  (wicket-1.4.17.jar)
Downloading: http://repo1.maven.org/maven2/org/apache/wicket/wicket-extensions/1.4.17/wicket-extensions-1.4.17.jar
1152K downloaded  (wicket-extensions-1.4.17.jar)
[INFO] [resources:resources {execution: default-resources}]
[INFO] Using 'UTF-8' encoding to copy filtered resources.
[INFO] Copying 307 resources
[INFO] [compiler:compile {execution: default-compile}]
[INFO] Compiling 167 source files to <https://builds.apache.org/job/portals-jetspeed-2-applications-j2-admin-trunk/org.apache.portals.jetspeed-2$j2-admin/ws/target/classes>
[INFO] ------------------------------------------------------------------------
[ERROR] BUILD FAILURE
[INFO] ------------------------------------------------------------------------
[INFO] Compilation failure

<https://builds.apache.org/job/portals-jetspeed-2-applications-j2-admin-trunk/org.apache.portals.jetspeed-2$j2-admin/ws/src/main/java/org/apache/jetspeed/portlets/sso/SSOInitHttpRequestCommand.java>:[31,56]
error: cannot find symbol

could not parse error message:   symbol:   class ProxyContext
  location: package org.apache.portals.applications.webcontent2.proxy
<https://builds.apache.org/job/portals-jetspeed-2-applications-j2-admin-trunk/org.apache.portals.jetspeed-2$j2-admin/ws/src/main/java/org/apache/jetspeed/portlets/sso/SSOInitHttpRequestCommand.java>:41:
error: cannot find symbol
    protected HttpRequestBase createHttpRequest(final ProxyContext context) throws ReverseProxyException,
IOException
                                                      ^

could not parse error message:   symbol:   class ProxyContext
  location: class SSOInitHttpRequestCommand
<https://builds.apache.org/job/portals-jetspeed-2-applications-j2-admin-trunk/org.apache.portals.jetspeed-2$j2-admin/ws/src/main/java/org/apache/jetspeed/portlets/sso/SSOInitHttpRequestCommand.java>:60:
error: cannot find symbol
    private List<JetspeedSSOSiteCredentials> getJetspeedFormSSOSiteCredentials(final
ProxyContext context)
                                                                                     ^

could not parse error message:   symbol:   class ProxyContext
  location: class SSOInitHttpRequestCommand
<https://builds.apache.org/job/portals-jetspeed-2-applications-j2-admin-trunk/org.apache.portals.jetspeed-2$j2-admin/ws/src/main/java/org/apache/jetspeed/portlets/sso/JetspeedHttpClientContextBuilder.java>:32:
error: cannot find symbol
import org.apache.portals.applications.webcontent2.proxy.ProxyContext;
                                                        ^

could not parse error message:   symbol:   class ProxyContext
  location: package org.apache.portals.applications.webcontent2.proxy
<https://builds.apache.org/job/portals-jetspeed-2-applications-j2-admin-trunk/org.apache.portals.jetspeed-2$j2-admin/ws/src/main/java/org/apache/jetspeed/portlets/sso/JetspeedHttpClientContextBuilder.java>:44:
error: cannot find symbol
        ProxyContext proxyContext = ProxyContext.getCurrentProxyContext();
        ^

could not parse error message:   symbol:   class ProxyContext
  location: class JetspeedHttpClientContextBuilder
<https://builds.apache.org/job/portals-jetspeed-2-applications-j2-admin-trunk/org.apache.portals.jetspeed-2$j2-admin/ws/src/main/java/org/apache/jetspeed/portlets/sso/JetspeedHttpClientContextBuilder.java>:44:
error: cannot find symbol
        ProxyContext proxyContext = ProxyContext.getCurrentProxyContext();
                                    ^


[INFO] ------------------------------------------------------------------------
[INFO] For more information, run Maven with the -e switch
[INFO] ------------------------------------------------------------------------
[INFO] Total time: 19 seconds
[INFO] Finished at: Wed Dec 17 02:47:42 UTC 2014
[INFO] Final Memory: 42M/449M
[INFO] ------------------------------------------------------------------------
Waiting for Jenkins to finish collecting data

Mime
View raw message