portals-commits mailing list archives

Site index · List index
Message view « Date » · « Thread »
Top « Date » · « Thread »
From Apache Jenkins Server <jenk...@builds.apache.org>
Subject Build failed in Jenkins: portals-jetspeed-2-portal-trunk » Jetspeed-2 Serializer #160
Date Sun, 15 Mar 2015 00:19:04 GMT
See <https://builds.apache.org/job/portals-jetspeed-2-portal-trunk/org.apache.portals.jetspeed-2$jetspeed-serializer/160/>

------------------------------------------
[INFO] ------------------------------------------------------------------------
[INFO] Building Jetspeed-2 Serializer
[INFO]    task-segment: [clean, deploy]
[INFO] ------------------------------------------------------------------------
[INFO] [clean:clean {execution: default-clean}]
[INFO] Deleting file set: <https://builds.apache.org/job/portals-jetspeed-2-portal-trunk/org.apache.portals.jetspeed-2$jetspeed-serializer/ws/>
(included: [*.log], excluded: [])
[INFO] [remote-resources:process {execution: default}]
[INFO] [resources:resources {execution: default-resources}]
[INFO] Using 'UTF-8' encoding to copy filtered resources.
[INFO] skip non existing resourceDirectory <https://builds.apache.org/job/portals-jetspeed-2-portal-trunk/org.apache.portals.jetspeed-2$jetspeed-serializer/ws/src/main/resources>
[INFO] Copying 0 resource
[INFO] Copying 3 resources
[INFO] [compiler:compile {execution: default-compile}]
[INFO] Compiling 59 source files to <https://builds.apache.org/job/portals-jetspeed-2-portal-trunk/org.apache.portals.jetspeed-2$jetspeed-serializer/ws/target/classes>
[INFO] [resources:testResources {execution: default-testResources}]
[INFO] Using 'UTF-8' encoding to copy filtered resources.
[INFO] Copying 1 resource
[INFO] Copying 3 resources
[INFO] [jetspeed-unpack:unpack {execution: unpack-test-resources}]
[INFO] Skipping unpack
[INFO] [compiler:testCompile {execution: default-testCompile}]
[INFO] Compiling 2 source files to <https://builds.apache.org/job/portals-jetspeed-2-portal-trunk/org.apache.portals.jetspeed-2$jetspeed-serializer/ws/target/test-classes>
[INFO] [surefire:test {execution: default-test}]
[INFO] Tests are skipped.
[INFO] [jar:jar {execution: default-jar}]
[INFO] Building jar: <https://builds.apache.org/job/portals-jetspeed-2-portal-trunk/org.apache.portals.jetspeed-2$jetspeed-serializer/ws/target/jetspeed-serializer-2.3.0-SNAPSHOT.jar>
[INFO] Preparing source:jar
[WARNING] Removing: jar from forked lifecycle, to prevent recursive invocation.
[INFO] No goals needed for project - skipping
[INFO] [source:jar {execution: attach-sources}]
[INFO] Building jar: <https://builds.apache.org/job/portals-jetspeed-2-portal-trunk/org.apache.portals.jetspeed-2$jetspeed-serializer/ws/target/jetspeed-serializer-2.3.0-SNAPSHOT-sources.jar>
[INFO] [ianal:verify-legal-files {execution: default}]
[INFO] Checking legal files in: jetspeed-serializer-2.3.0-SNAPSHOT.jar
[INFO] Checking legal files in: jetspeed-serializer-2.3.0-SNAPSHOT-sources.jar
[INFO] [install:install {execution: default-install}]
[INFO] Installing <https://builds.apache.org/job/portals-jetspeed-2-portal-trunk/org.apache.portals.jetspeed-2$jetspeed-serializer/ws/target/jetspeed-serializer-2.3.0-SNAPSHOT.jar>
to /home/jenkins/jenkins-slave/maven-repositories/1/org/apache/portals/jetspeed-2/jetspeed-serializer/2.3.0-SNAPSHOT/jetspeed-serializer-2.3.0-SNAPSHOT.jar
[INFO] Installing <https://builds.apache.org/job/portals-jetspeed-2-portal-trunk/org.apache.portals.jetspeed-2$jetspeed-serializer/ws/target/jetspeed-serializer-2.3.0-SNAPSHOT-sources.jar>
to /home/jenkins/jenkins-slave/maven-repositories/1/org/apache/portals/jetspeed-2/jetspeed-serializer/2.3.0-SNAPSHOT/jetspeed-serializer-2.3.0-SNAPSHOT-sources.jar
[INFO] [deploy:deploy {execution: default-deploy}]
[INFO] Retrieving previous build number from apache.snapshots.https
[WARNING] *** CHECKSUM FAILED - Checksum failed on download: local = '20c7b731e167cfb75cd43330eb51c06bd8bd35ec';
remote = 'ae13295c36cd6434b8486097a2f70cf4fc40bb17' - RETRYING
[WARNING] *** CHECKSUM FAILED - Checksum failed on download: local = '20c7b731e167cfb75cd43330eb51c06bd8bd35ec';
remote = 'ae13295c36cd6434b8486097a2f70cf4fc40bb17' - IGNORING
Uploading: https://repository.apache.org/content/repositories/snapshots/org/apache/portals/jetspeed-2/jetspeed-serializer/2.3.0-SNAPSHOT/jetspeed-serializer-2.3.0-20150315.001142-21.jar
123K uploaded  (jetspeed-serializer-2.3.0-20150315.001142-21.jar)
[INFO] Retrieving previous metadata from apache.snapshots.https
[WARNING] *** CHECKSUM FAILED - Checksum failed on download: local = '20c7b731e167cfb75cd43330eb51c06bd8bd35ec';
remote = 'ae13295c36cd6434b8486097a2f70cf4fc40bb17' - RETRYING
[WARNING] *** CHECKSUM FAILED - Checksum failed on download: local = '20c7b731e167cfb75cd43330eb51c06bd8bd35ec';
remote = 'ae13295c36cd6434b8486097a2f70cf4fc40bb17' - IGNORING
[INFO] Uploading repository metadata for: 'snapshot org.apache.portals.jetspeed-2:jetspeed-serializer:2.3.0-SNAPSHOT'
[INFO] Retrieving previous metadata from apache.snapshots.https
[INFO] Uploading repository metadata for: 'artifact org.apache.portals.jetspeed-2:jetspeed-serializer'
[INFO] ------------------------------------------------------------------------
[ERROR] BUILD ERROR
[INFO] ------------------------------------------------------------------------
[INFO] Error installing artifact's metadata: Error while deploying metadata: Failed to transfer
file: https://repository.apache.org/content/repositories/snapshots/org/apache/portals/jetspeed-2/jetspeed-serializer/maven-metadata.xml.md5.
Return code is: 502

[INFO] ------------------------------------------------------------------------
[INFO] For more information, run Maven with the -e switch
[INFO] ------------------------------------------------------------------------
[INFO] Total time: 6 minutes 55 seconds
[INFO] Finished at: Sun Mar 15 00:18:01 UTC 2015
[INFO] Final Memory: 152M/784M
[INFO] ------------------------------------------------------------------------

Mime
View raw message