portals-jetspeed-dev mailing list archives

Site index · List index
Message view « Date » · « Thread »
Top « Date » · « Thread »
From Ate Douma <...@douma.nu>
Subject Re: [jira] Updated: (JS2-614) Jetspeed Deploy compliant with servlet spec 2.4
Date Sun, 26 Nov 2006 23:02:04 GMT
dee factorial wrote:
> This patch broke the build process.
Sorry about that.
I missed the new commons-lang dependency introduced by the patch.
The maven-1 build already had that on its dependency path so I didn't noticed it (I'm still
primarily using maven-1).
Should be fixed now.

Regards,

Ate
> 
> I'm trying to build the 2.1dev and I'm getting an error due to this patch.
> I've checked the source code for the JetspeedWebApplicationRewriter.java 
> but
> I can't seem to find where the errors are.
> any help in getting this going would be greatfull even if its just a 
> pointer
> in the right direction.
> 
> Thanks
> 
> resources:
> [INFO] Executed tasks
> [INFO] [compiler:compile]
> Compiling 7 source files to
> /home/deefactorial/J2/components/deploy-tool/target/classes
> [INFO]
> ------------------------------------------------------------------------
> [ERROR] BUILD FAILURE
> [INFO]
> ------------------------------------------------------------------------
> [INFO] Compilation failure
> 
> /home/deefactorial/J2/components/deploy-tool/src/java/org/apache/jetspeed/tools/deploy/JetspeedWebApplicationRewriter.java:[21,31]

> 
> package org.apache.commons.lang does not exist
> 
> /home/deefactorial/J2/components/deploy-tool/src/java/org/apache/jetspeed/tools/deploy/JetspeedWebApplicationRewriter.java:[228,15]

> 
> cannot find symbol
> symbol  : variable StringUtils
> location: class
> org.apache.jetspeed.tools.deploy.JetspeedWebApplicationRewriter
> 
> 
> [INFO]
> ------------------------------------------------------------------------
> [INFO] Trace
> org.apache.maven.BuildFailureException: Compilation failure
>        at org.apache.maven.lifecycle.DefaultLifecycleExecutor.executeGoals(
> DefaultLifecycleExecutor.java:555)
>        at
> org.apache.maven.lifecycle.DefaultLifecycleExecutor.executeGoalWithLifecycle 
> 
> (DefaultLifecycleExecutor.java:475)
>        at org.apache.maven.lifecycle.DefaultLifecycleExecutor.executeGoal(
> DefaultLifecycleExecutor.java:454)
>        at
> org.apache.maven.lifecycle.DefaultLifecycleExecutor.executeGoalAndHandleFailures 
> 
> (DefaultLifecycleExecutor.java:306)
>        at
> org.apache.maven.lifecycle.DefaultLifecycleExecutor.executeTaskSegments(
> DefaultLifecycleExecutor.java:273)
>        at org.apache.maven.lifecycle.DefaultLifecycleExecutor.execute(
> DefaultLifecycleExecutor.java:140)
>        at org.apache.maven.DefaultMaven.doExecute(DefaultMaven.java:322)
>        at org.apache.maven.DefaultMaven.execute(DefaultMaven.java:115)
>        at org.apache.maven.cli.MavenCli.main(MavenCli.java:256)
>        at sun.reflect.NativeMethodAccessorImpl.invoke0(Native Method)
>        at sun.reflect.NativeMethodAccessorImpl.invoke(
> NativeMethodAccessorImpl.java:39)
>        at sun.reflect.DelegatingMethodAccessorImpl.invoke(
> DelegatingMethodAccessorImpl.java:25)
>        at java.lang.reflect.Method.invoke(Method.java:585)
>        at org.codehaus.classworlds.Launcher.launchEnhanced(Launcher.java
> :315)
>        at org.codehaus.classworlds.Launcher.launch(Launcher.java:255)
>        at org.codehaus.classworlds.Launcher.mainWithExitCode(Launcher.java
> :430)
>        at org.codehaus.classworlds.Launcher.main(Launcher.java:375)
> Caused by: org.apache.maven.plugin.CompilationFailureException: Compilation
> failure
>        at org.apache.maven.plugin.AbstractCompilerMojo.execute(
> AbstractCompilerMojo.java:505)
>        at org.apache.maven.plugin.CompilerMojo.execute(CompilerMojo.java
> :111)
>        at org.apache.maven.plugin.DefaultPluginManager.executeMojo(
> DefaultPluginManager.java:412)
>        at org.apache.maven.lifecycle.DefaultLifecycleExecutor.executeGoals(
> DefaultLifecycleExecutor.java:534)
>        ... 16 more
> [INFO]
> ------------------------------------------------------------------------
> [INFO] Total time: 1 minute 14 seconds
> [INFO] Finished at: Sun Nov 26 20:06:14 UTC 2006
> [INFO] Final Memory: 22M/42M
> 


---------------------------------------------------------------------
To unsubscribe, e-mail: jetspeed-dev-unsubscribe@portals.apache.org
For additional commands, e-mail: jetspeed-dev-help@portals.apache.org


Mime
View raw message