qpid-dev mailing list archives

Site index · List index
Message view « Date » · « Thread »
Top « Date » · « Thread »
From "Rupert Smith" <rupertlssm...@googlemail.com>
Subject Re: [java]: compilation failure on M2 and trunk
Date Tue, 02 Oct 2007 08:41:05 GMT
You may need to refresh your local repository if you still have build
failures. Delete everything under repository/uk/co/thebadgerset and try
again. The build should pick up snapshots from sourceforge.

On 02/10/2007, Rupert Smith <rupertlssmith@googlemail.com> wrote:
>
> It is available through svn on sourceforge:
> https://junit-toolkit.svn.sourceforge.net/svnroot/junit-toolkit. Main
> page: http://sourceforge.net/projects/junit-toolkit/
>
> It is Apache licensed.
>
> I created a qpid account, on the sourceforge project, in case any qpid
> contributors need to edit the sources. If you have patches, please ask me
> and I will apply them for you or give you the log in details.
>
> It is a snapshot dependency because it has been undergoing a lot of
> improvements in order to provide support for qpid tests. It should be
> resolved to a concrete version for the M2 release (although not strictly
> necessary as it is a test dependency only). In fact I will put out a release
> right now, so that it can make it onto the maven central repo in the next
> few days.
>
> Rupert
>
> On 01/10/2007, Carl Trieloff <cctrieloff@redhat.com> wrote:
> >
> >
> > If there is no public source we should remove it as a dependency. None
> > of the links to source work.
> >
> > Carl.
> >
> > Rafael Schloming wrote:
> > > Correction, the useless web site is here, not where I listed below:
> > >
> > > http://www.thebadgerset.co.uk/junit-toolkit/
> > >
> > > --Rafael
> > >
> > > Rafael Schloming wrote:
> > >> I can't seem to find anything useful on google about
> > >> uk.co.thebadgerset.junit.extensions.TKTestRunner. The source isn't
> > >> available via google, and the instructions provided on
> > >> www.badgerset.co.uk for obtaining anonymous access to the source
> > >> don't actually work.
> > >>
> > >> So as far as I can tell Qpid has a SNAPSHOT dependency on a junit
> > >> test runner that does not have publicly available source. This is
> > >> quite frustrating as it is most difficult to fix the build given
> > >> these circumstances.
> > >>
> > >> How do we make this SNAPSHOT dependency go away? Could someone please
> > >> explain why it is there in the first place?
> > >>
> > >> --Rafael
> > >>
> > >> Rafael Schloming wrote:
> > >>> I'm still seeing this build failure on trunk.
> > >>>
> > >>> --Rafael
> > >>>
> > >>> Rupert Smith wrote:
> > >>>> Should be fixed very soon after it was able to occurr. Committing
> > to
> > >>>> multiple svn's in a non-atomic way was the cause. Let me know if
it
> > >>>> is not
> > >>>> fixed.
> > >>>>
> > >>>> On 28/09/2007, Gordon Sim <gsim@redhat.com> wrote:
> > >>>>> M2:
> > >>>>>
> > >>>>> [ERROR] BUILD FAILURE
> > >>>>> [INFO]
> > >>>>>
> > ------------------------------------------------------------------------
> > >>>>>
> > >>>>> [INFO] Compilation failure
> > >>>>> /usr/share/cruisecontrol- bin-2.6.1
> > >>>>>
> > /projects/qpid-M2/java/systests/src/main/java/org/apache/qpid/test/framework/distributedtesting/Coordinator.java:[142,8]
> > >>>>>
> > >>>>> cannot find symbol
> > >>>>> symbol : constructor
> > >>>>> TKTestRunner(java.lang.Integer,java.lang.Long,int[],int,int[],
> > >>>>> java.lang.String,java.lang.String,java.lang.String
> > >>>>> ,boolean,boolean,boolean)
> > >>>>> location: class uk.co.thebadgerset.junit.extensions.TKTestRunner
> > >>>>> /usr/share/cruisecontrol-bin-2.6.1
> > >>>>>
> > /projects/qpid-M2/java/systests/src/main/java/org/apache/qpid/test/framework/distributedtesting/Coordinator.java:[395,16]
> >
> > >>>>>
> > >>>>> cannot find symbol
> > >>>>> symbol : variable currentTestClassName
> > >>>>> location: class
> > >>>>> org.apache.qpid.test.framework.distributedtesting.Coordinator
> > >>>>>
> > >>>>> Trunk:
> > >>>>>
> > >>>>> [ERROR] BUILD FAILURE
> > >>>>> [INFO]
> > >>>>>
> > ------------------------------------------------------------------------
> > >>>>>
> > >>>>> [INFO] Compilation failure
> > >>>>>
> > >>>>>
> > >>>>>
> > /home/gordon/qpid/trunk/qpid/java/systests/src/main/java/org/apache/qpid/test/framework/distributedtesting/Coordinator.java:[158,8]
> >
> > >>>>>
> > >>>>> cannot find symbol
> > >>>>> symbol  : constructor
> > >>>>> TKTestRunner(java.lang.Integer,java.lang.Long,int[],int,int[],
> > >>>>> java.lang.String,java.lang.String,java.lang.String,boolean)
> > >>>>> location: class uk.co.thebadgerset.junit.extensions.TKTestRunner
> > >>>>>
> > >>>>>
> > >>>>
> >
> >
>

Mime
  • Unnamed multipart/alternative (inline, None, 0 bytes)
View raw message