qpid-dev mailing list archives

Site index · List index
Message view « Date » · « Thread »
Top « Date » · « Thread »
From "Rupert Smith" <rupertlssm...@googlemail.com>
Subject Re: [java]: compilation failure on M2 and trunk
Date Tue, 02 Oct 2007 09:44:22 GMT
Sorry, didn't realize you were complaining about failure on trunk. I will
update all refs to junit-toolkit* on the trunk poms so that the build passes
there. I think the issue is that trunk got pinned to a non-SNAPSHOT version
(0.5), but test code must have been merged down, that depends upon the
newest SNAPSHOT.

Yet another reason for not forking the tests...

On 01/10/2007, Rafael Schloming <rafaels@redhat.com> wrote:
>
> I can't seem to find anything useful on google about
> uk.co.thebadgerset.junit.extensions.TKTestRunner. The source isn't
> available via google, and the instructions provided on
> www.badgerset.co.uk for obtaining anonymous access to the source don't
> actually work.
>
> So as far as I can tell Qpid has a SNAPSHOT dependency on a junit test
> runner that does not have publicly available source. This is quite
> frustrating as it is most difficult to fix the build given these
> circumstances.
>
> How do we make this SNAPSHOT dependency go away? Could someone please
> explain why it is there in the first place?
>
> --Rafael
>
> Rafael Schloming wrote:
> > I'm still seeing this build failure on trunk.
> >
> > --Rafael
> >
> > Rupert Smith wrote:
> >> Should be fixed very soon after it was able to occurr. Committing to
> >> multiple svn's in a non-atomic way was the cause. Let me know if it is
> >> not
> >> fixed.
> >>
> >> On 28/09/2007, Gordon Sim <gsim@redhat.com> wrote:
> >>> M2:
> >>>
> >>> [ERROR] BUILD FAILURE
> >>> [INFO]
> >>>
> ------------------------------------------------------------------------
> >>> [INFO] Compilation failure
> >>> /usr/share/cruisecontrol-bin-2.6.1
> >>>
> /projects/qpid-M2/java/systests/src/main/java/org/apache/qpid/test/framework/distributedtesting/Coordinator.java:[142,8]
> >>>
> >>> cannot find symbol
> >>> symbol : constructor
> >>> TKTestRunner(java.lang.Integer,java.lang.Long,int[],int,int[],
> >>> java.lang.String,java.lang.String,java.lang.String
> >>> ,boolean,boolean,boolean)
> >>> location: class uk.co.thebadgerset.junit.extensions.TKTestRunner
> >>> /usr/share/cruisecontrol-bin-2.6.1
> >>>
> /projects/qpid-M2/java/systests/src/main/java/org/apache/qpid/test/framework/distributedtesting/Coordinator.java:[395,16]
> >>>
> >>> cannot find symbol
> >>> symbol : variable currentTestClassName
> >>> location: class
> >>> org.apache.qpid.test.framework.distributedtesting.Coordinator
> >>>
> >>> Trunk:
> >>>
> >>> [ERROR] BUILD FAILURE
> >>> [INFO]
> >>>
> ------------------------------------------------------------------------
> >>> [INFO] Compilation failure
> >>>
> >>>
> >>>
> /home/gordon/qpid/trunk/qpid/java/systests/src/main/java/org/apache/qpid/test/framework/distributedtesting/Coordinator.java:[158,8]
> >>>
> >>> cannot find symbol
> >>> symbol  : constructor
> >>> TKTestRunner(java.lang.Integer,java.lang.Long,int[],int,int[],
> >>> java.lang.String,java.lang.String,java.lang.String,boolean)
> >>> location: class uk.co.thebadgerset.junit.extensions.TKTestRunner
> >>>
> >>>
> >>
>

Mime
  • Unnamed multipart/alternative (inline, None, 0 bytes)
View raw message