On 08/18/2011 01:13 PM, Alan Conway wrote: > On 08/18/2011 05:02 AM, Gordon Sim wrote: >> On 08/17/2011 11:01 PM, Alan Conway wrote: >>> I'm getting a load of unit test failures from unit_tests in make check >>> from the current trunk: r1158873 >>> >>> There are a load of failures like these: >>> >>> unknown location(0): fatal error in "testSessionManagerSetFlowControl": >>> std::exception: Connection closed >>> unknown location(0): fatal error in "testGetThenSubscribe": >>> std::exception: Connection closed >>> unknown location(0): fatal error in "testSessionIsValid": >>> std::exception: Connection closed >>> unknown location(0): fatal error in "testExpirationNotAltered": >>> std::exception: Connection closed >>> unknown location(0): fatal error in "testGetConnectionFromSession": >>> std::exception: Connection closed >>> >>> I'm building from a clean checkout. Anyone else seeing this? >> >> No, latest (r1158934) passed everything on a clean build for me. >> > > Was this on fedora or rhel5? fedora 12 --------------------------------------------------------------------- Apache Qpid - AMQP Messaging Implementation Project: http://qpid.apache.org Use/Interact: mailto:dev-subscribe@qpid.apache.org