qpid-dev mailing list archives

Site index · List index
Message view « Date » · « Thread »
Top « Date » · « Thread »
From Steve Huston <shus...@riverace.com>
Subject Fwd: FAILED (b=16, w=8): qpid-cpp - trunk - Nightly
Date Fri, 11 Sep 2015 01:22:32 GMT
Do these compile errors look familiar to anyone? They started on Tuesday night.

Steve Huston
(sent from my iPhone - please excuse brevity and typos)

Begin forwarded message:

From: CDash <cdash@riverace.com<mailto:cdash@riverace.com>>
Date: September 10, 2015 at 9:21:08 PM EDT
To: <cdash@riverace.com<mailto:cdash@riverace.com>>
Subject: FAILED (b=16, w=8): qpid-cpp - trunk - Nightly
Reply-To: <noreply@riverace.com<mailto:noreply@riverace.com>>

A submission to CDash for the project qpid-cpp has build errors and build warnings.
You have been identified as one of the authors who have checked in changes that are part of
this submission or you are listed in the default contact list.

Details on the submission can be found at http://www.riverace.com/CDash-1.4.2/buildSummary.php?buildid=5611

Project: qpid-cpp
Site: Riverace: RHEL5
Build Name: trunk
Build Time: 2015-09-10T21:00:42 EDT
Type: Nightly
Errors:16
Warnings:8


*Error* (first 5)
src/qpid/broker/SelectorExpression.cpp line sourceline (http://www.riverace.com/CDash-1.4.2/viewBuildError.php?type=0&buildid=5611)
/.../cpp/src/qpid/broker/SelectorExpression.cpp:1052: error: ‘INT64_MAX’ was not declared
in this scope

src/qpid/broker/SelectorExpression.cpp line sourceline (http://www.riverace.com/CDash-1.4.2/viewBuildError.php?type=0&buildid=5611)
/.../cpp/src/qpid/broker/SelectorExpression.cpp:1056: error: ‘INT64_MAX’ was not declared
in this scope

src/qpid/broker/SelectorExpression.cpp line sourceline (http://www.riverace.com/CDash-1.4.2/viewBuildError.php?type=0&buildid=5611)
/.../cpp/src/qpid/broker/SelectorExpression.cpp:1056: error: ‘INT64_MIN’ was not declared
in this scope

make[2]: *** [src/CMakeFiles/qpidbroker.dir/qpid/broker/SelectorExpression.cpp.o] Error 1

[ 68%] Building CXX object src/CMakeFiles/qpidbroker.dir/qpid/broker/SelectorToken.cpp.o
[ 68%] Building CXX object src/CMakeFiles/qpidbroker.dir/qpid/broker/Selectmake[1]: *** [src/CMakeFiles/qpidbroker.dir/all]
Error 2

Scanning dependencies of target qmf2
[ 72%] Building CXX object src/CMakeFiles/qmf2.dir/qmf/Agent.cpp.o
[ 72%] Building CXX object src/CMakeFiles/qmf2.dir/qmf/AgentEvent.cpp.o
[ 73%] Building CXX o


*Warnings* (first 5)
include/qpid/messaging/Logger.h line 36 (http://www.riverace.com/CDash-1.4.2/viewBuildError.php?type=1&buildid=5611)
/.../cpp/include/qpid/messaging/Logger.h:36: Warning(801): Wrong constant name (corrected
to `Trace')

include/qpid/messaging/Logger.h line 36 (http://www.riverace.com/CDash-1.4.2/viewBuildError.php?type=1&buildid=5611)
/.../cpp/include/qpid/messaging/Logger.h:36: Warning(801): Wrong constant name (corrected
to `Debug')

include/qpid/messaging/Logger.h line 36 (http://www.riverace.com/CDash-1.4.2/viewBuildError.php?type=1&buildid=5611)
/.../cpp/include/qpid/messaging/Logger.h:36: Warning(801): Wrong constant name (corrected
to `Info')

include/qpid/messaging/Logger.h line 36 (http://www.riverace.com/CDash-1.4.2/viewBuildError.php?type=1&buildid=5611)
/.../cpp/include/qpid/messaging/Logger.h:36: Warning(801): Wrong constant name (corrected
to `Notice')

include/qpid/messaging/Logger.h line 36 (http://www.riverace.com/CDash-1.4.2/viewBuildError.php?type=1&buildid=5611)
/.../cpp/include/qpid/messaging/Logger.h:36: Warning(801): Wrong constant name (corrected
to `Warning')



-CDash on www.riverace.com<http://www.riverace.com>


Mime
  • Unnamed multipart/alternative (inline, None, 0 bytes)
View raw message