qpid-dev mailing list archives

Site index · List index
Message view « Date » · « Thread »
Top « Date » · « Thread »
From Robbie Gemmell <robbie.gemm...@gmail.com>
Subject Re: Build failed in Jenkins: Qpid-Java-Artefact-Release-6.0.x #16
Date Mon, 01 Feb 2016 10:37:46 GMT
On 29 January 2016 at 23:19, Apache Jenkins Server
<jenkins@builds.apache.org> wrote:
> See <https://builds.apache.org/job/Qpid-Java-Artefact-Release-6.0.x/16/changes>
>
> Changes:
>
> [kwall] QPID-6961: Use maven to generate Java Broker and (legacy) Java Client docbook
>
> Merged from trunk with command:
>
>
> svn merge -c 1722020,1722674,1722678,1722683,1722711,1725760 ^/qpid/java/trunk
>
> [kwall] QPID-7006 , QPID-7007 : Add operations to update BDB configuration, retrieve
statistics, clean log and perform checkpoint
>
> svn merge -c 1726176,1726249   ^/qpid/java/trunk
>
> [kwall] QPID-6955: BufferOverflowException downloading message content
>
> (Partial port of QPID-6953).
>
> Merged from trunk with command:
>
> svn merge -c 1720340  ^/qpid/java/trunk
>
> [orudyy] NO-JIRA: Fix test BDBHAVirtualHostNodeTest#testIntruderProtectionInManagementMode
failing due to illegitimate turning of permitted node into intruder
>
>          merged from trunk
>          svn merge -c 1727608  https://svn.apache.org/repos/asf/qpid/java/trunk
>
> [kwall] QPID-7019: [Java Broker] BDB JE turn on log file migration by default
>
> Merged with command:
> svn merge -c 1726245  ^/qpid/java/trunk
>
> [kwall] QPID-6994: AMQP connection close might fail to delete temporary queue
>
> Merged from trunk with command:
>
> svn merge -c 1724292,1724375 ^/qpid/java/trunk
>
> ------------------------------------------

<snip>

> At revision 1727662
> Unpacking http://archive.apache.org/dist/maven/binaries/apache-maven-3.0.5-bin.zip to
/jenkins/tools/hudson.tasks.Maven_MavenInstallation/Maven_3.0.5 on jenkins-ubuntu-1404-4gb-4af
> [6.0.x] $ /jenkins/tools/hudson.tasks.Maven_MavenInstallation/Maven_3.0.5/bin/mvn -f
./pom.xml clean package
> [INFO] Scanning for projects...
> [ERROR] The build could not read 1 project -> [Help 1]
> [ERROR]
> [ERROR]   The project org.apache.qpid:qpid-java-doc:6.1.0-SNAPSHOT (<https://builds.apache.org/job/Qpid-Java-Artefact-Release-6.0.x/ws/6.0.x/doc/pom.xml)>
has 1 error
> [ERROR]     Non-resolvable parent POM: Could not find artifact org.apache.qpid:qpid-java-build:pom:6.1.0-SNAPSHOT
and 'parent.relativePath' points at wrong local POM @ line 26, column 13 -> [Help 2]
> [ERROR]
> [ERROR] To see the full stack trace of the errors, re-run Maven with the -e switch.
> [ERROR] Re-run Maven using the -X switch to enable full debug logging.
> [ERROR]
> [ERROR] For more information about the errors and possible solutions, please read the
following articles:
> [ERROR] [Help 1] http://cwiki.apache.org/confluence/display/MAVEN/ProjectBuildingException
> [ERROR] [Help 2] http://cwiki.apache.org/confluence/display/MAVEN/UnresolvableModelException
> Build step 'Invoke top-level Maven targets' marked build as failure
> Archiving artifacts


Noticed this job failed. Possibly an issue with the merges? It seems
to be naming the failing module 6.1.0-SNAPSHOT.

Robbie

---------------------------------------------------------------------
To unsubscribe, e-mail: dev-unsubscribe@qpid.apache.org
For additional commands, e-mail: dev-help@qpid.apache.org


Mime
View raw message