rave-dev mailing list archives

Site index · List index
Message view « Date » · « Thread »
Top « Date » · « Thread »
From Matt Franklin <m.ben.frank...@gmail.com>
Subject Re: Build failed in Jenkins: rave-project-trunk #696
Date Tue, 08 Jan 2013 17:13:49 GMT
Master POM issue.  I will temporarily commit a fix to point back to 0.10.

On Mon, Jan 7, 2013 at 7:40 PM, Apache Jenkins Server
<jenkins@builds.apache.org> wrote:
> See <https://builds.apache.org/job/rave-project-trunk/696/changes>
>
> Changes:
>
> [mfranklin] [maven-release-plugin] prepare for next development iteration
>
> [mfranklin] [maven-release-plugin] prepare release 0.19
>
> [mfranklin] No need for goals.txt if it is empty
>
> ------------------------------------------
> Started by an SCM change
> Building remotely on ubuntu4 in workspace <https://builds.apache.org/job/rave-project-trunk/ws/>
> Updating http://svn.apache.org/repos/asf/rave/trunk
> U         UPGRADING
> U         rave-components/rave-mongodb/src/main/java/org/apache/rave/portal/repository/MongoTagOperations.java
> U         rave-components/rave-mongodb/src/main/java/org/apache/rave/portal/repository/impl/MongoTagTemplate.java
> U         rave-components/rave-mongodb/src/main/java/org/apache/rave/portal/model/conversion/impl/MongoDbWidgetConverter.java
> U         rave-components/rave-mongodb/src/main/java/org/apache/rave/portal/model/conversion/impl/TagImplConverter.java
> U         rave-components/rave-mongodb/pom.xml
> U         rave-components/rave-core/pom.xml
> U         rave-components/rave-jpa/pom.xml
> U         rave-components/rave-commons/pom.xml
> U         rave-components/rave-web/pom.xml
> U         rave-components/pom.xml
> U         rave-portal-dependencies/pom.xml
> U         rave-portal-resources/pom.xml
> U         CHANGELOG
> U         rave-providers/rave-opensocial-provider/rave-opensocial-client/pom.xml
> U         rave-providers/rave-opensocial-provider/pom.xml
> U         rave-providers/rave-opensocial-provider/rave-opensocial-server/rave-shindig/pom.xml
> U         rave-providers/rave-opensocial-provider/rave-opensocial-server/pom.xml
> U         rave-providers/rave-opensocial-provider/rave-opensocial-core/pom.xml
> U         rave-providers/rave-w3c-provider/pom.xml
> U         rave-providers/pom.xml
> U         pom.xml
> D         rave-custom-project-archetype/src/test/resources/projects/basic/goal.txt
> U         rave-custom-project-archetype/pom.xml
> U         rave-demo-gadgets/pom.xml
> U         rave-portal/pom.xml
> U         rave-integration-tests/rave-admin-tests/pom.xml
> U         rave-integration-tests/rave-core-tests/pom.xml
> U         rave-integration-tests/rave-newuser-tests/pom.xml
> U         rave-integration-tests/rave-default-account-tests/pom.xml
> U         rave-integration-tests/pom.xml
> At revision 1430105
> Parsing POMs
> Failed to transfer Could not find artifact org.apache.rave:rave-master:pom:0.19 in central
(http://repo.maven.apache.org/maven2)
> ERROR: Failed to parse POMs
> hudson.util.IOException2: remote file operation failed: <https://builds.apache.org/job/rave-project-trunk/ws/trunk>
at hudson.remoting.Channel@1edb344:ubuntu4
>         at hudson.FilePath.act(FilePath.java:848)
>         at hudson.FilePath.act(FilePath.java:825)
>         at hudson.maven.MavenModuleSetBuild$MavenModuleSetBuildExecution.parsePoms(MavenModuleSetBuild.java:862)
>         at hudson.maven.MavenModuleSetBuild$MavenModuleSetBuildExecution.doRun(MavenModuleSetBuild.java:620)
>         at hudson.model.AbstractBuild$AbstractBuildExecution.run(AbstractBuild.java:586)
>         at hudson.model.Run.execute(Run.java:1543)
>         at hudson.maven.MavenModuleSetBuild.run(MavenModuleSetBuild.java:477)
>         at hudson.model.ResourceController.execute(ResourceController.java:88)
>         at hudson.model.Executor.run(Executor.java:236)
> Caused by: hudson.remoting.ProxyException: hudson.maven.MavenModuleSetBuild$MavenExecutionException:
org.apache.maven.project.ProjectBuildingException: Some problems were encountered while processing
the POMs:
> [FATAL] Non-resolvable parent POM: Could not find artifact org.apache.rave:rave-master:pom:0.19
in central (http://repo.maven.apache.org/maven2) and 'parent.relativePath' points at wrong
local POM @ line 24, column 13
>
>         at hudson.maven.MavenModuleSetBuild$PomParser.invoke(MavenModuleSetBuild.java:1229)
>         at hudson.maven.MavenModuleSetBuild$PomParser.invoke(MavenModuleSetBuild.java:997)
>         at hudson.FilePath$FileCallableWrapper.call(FilePath.java:2309)
>         at hudson.remoting.UserRequest.perform(UserRequest.java:118)
>         at hudson.remoting.UserRequest.perform(UserRequest.java:48)
>         at hudson.remoting.Request$2.run(Request.java:326)
>         at hudson.remoting.InterceptingExecutorService$1.call(InterceptingExecutorService.java:72)
>         at java.util.concurrent.FutureTask$Sync.innerRun(FutureTask.java:334)
>         at java.util.concurrent.FutureTask.run(FutureTask.java:166)
>         at java.util.concurrent.ThreadPoolExecutor.runWorker(ThreadPoolExecutor.java:1110)
>         at java.util.concurrent.ThreadPoolExecutor$Worker.run(ThreadPoolExecutor.java:603)
>         at java.lang.Thread.run(Thread.java:679)
> Caused by: hudson.remoting.ProxyException: org.apache.maven.project.ProjectBuildingException:
Some problems were encountered while processing the POMs:
> [FATAL] Non-resolvable parent POM: Could not find artifact org.apache.rave:rave-master:pom:0.19
in central (http://repo.maven.apache.org/maven2) and 'parent.relativePath' points at wrong
local POM @ line 24, column 13
>
>         at org.apache.maven.project.DefaultProjectBuilder.build(DefaultProjectBuilder.java:363)
>         at hudson.maven.MavenEmbedder.buildProjects(MavenEmbedder.java:361)
>         at hudson.maven.MavenEmbedder.readProjects(MavenEmbedder.java:331)
>         at hudson.maven.MavenModuleSetBuild$PomParser.invoke(MavenModuleSetBuild.java:1179)
>         ... 11 more
> Skipping Cobertura coverage report as build was not UNSTABLE or better ...

Mime
View raw message