samza-dev mailing list archives

Site index · List index
Message view « Date » · « Thread »
Top « Date » · « Thread »
From Jeremiah Adams <JAd...@helixeducation.com>
Subject Re: Need Some Help w/ Gradle Build on OpenJDK 11
Date Wed, 10 Oct 2018 13:57:57 GMT
Anyone have a few cycles to help me out with Apache Rat failing the build on OpenJDK 11?

Some things I’ve tried:

Bumped Gradle to 4.10.2 (required for Java11). Bumped the Rat version to 0.12. 



Jeremiah Adams
Software Engineer
www.helixeducation.com
Blog | Twitter | Facebook | LinkedIn

________________________________________
From: Jeremiah Adams <JAdams@helixeducation.com>
Sent: Tuesday, October 2, 2018 11:58 AM
To: dev@samza.apache.org
Subject: [POSSIBLE PHISHING] Need Some Help w/ Gradle Build on OpenJDK 11

I know very little about Gradle.  I got a response on the issue I opened regarding Gradle
builds failing on OpenJDK 11. I've since upgraded the Gradle version in gradle-wrapper.properties
to 4.10.2. Build now gets past the java11 issue but is dying on the Apache rat task.  The
build/plugin can't find a stylesheet.  I've had no luck chasing this down, can anyone point
me in the right direction?

Output from build:

jeremiah:samza jeremiah$ gradle --stacktrace clean build
> Task :rat FAILED

FAILURE: Build failed with an exception.

* Where:
Script '/Users/jeremiah/projects/open_source/samza/gradle/rat.gradle' line: 90

* What went wrong:
Execution failed for task ':rat'.
> stylesheet /Users/jeremiah/.gradle/daemon/4.10.2/gradle/resources/rat-output-to-html.xsl
doesn't exist.

* Try:
Run with --info or --debug option to get more log output. Run with --scan to get full insights.

* Exception is:
org.gradle.api.tasks.TaskExecutionException: Execution failed for task ':rat'.
        at org.gradle.api.internal.tasks.execution.ExecuteActionsTaskExecuter.executeActions(ExecuteActionsTaskExecuter.java:110)
        at org.gradle.api.internal.tasks.execution.ExecuteActionsTaskExecuter.execute(ExecuteActionsTaskExecuter.java:77)
        at org.gradle.api.internal.tasks.execution.OutputDirectoryCreatingTaskExecuter.execute(OutputDirectoryCreatingTaskExecuter.java:51)
        at org.gradle.api.internal.tasks.execution.SkipUpToDateTaskExecuter.execute(SkipUpToDateTaskExecuter.java:59)
        at org.gradle.api.internal.tasks.execution.ResolveTaskOutputCachingStateExecuter.execute(ResolveTaskOutputCachingStateExecuter.java:54)
        at org.gradle.api.internal.tasks.execution.ValidatingTaskExecuter.execute(ValidatingTaskExecuter.java:59)
        at org.gradle.api.internal.tasks.execution.SkipEmptySourceFilesTaskExecuter.execute(SkipEmptySourceFilesTaskExecuter.java:101)
        at org.gradle.api.internal.tasks.execution.FinalizeInputFilePropertiesTaskExecuter.execute(FinalizeInputFilePropertiesTaskExecuter.java:44)
        at org.gradle.api.internal.tasks.execution.CleanupStaleOutputsExecuter.execute(CleanupStaleOutputsExecuter.java:91)
        at org.gradle.api.internal.tasks.execution.ResolveTaskArtifactStateTaskExecuter.execute(ResolveTaskArtifactStateTaskExecuter.java:62)
        at org.gradle.api.internal.tasks.execution.SkipTaskWithNoActionsExecuter.execute(SkipTaskWithNoActionsExecuter.java:59)
        at org.gradle.api.internal.tasks.execution.SkipOnlyIfTaskExecuter.execute(SkipOnlyIfTaskExecuter.java:54)
        at org.gradle.api.internal.tasks.execution.ExecuteAtMostOnceTaskExecuter.execute(ExecuteAtMostOnceTaskExecuter.java:43)
        at org.gradle.api.internal.tasks.execution.CatchExceptionTaskExecuter.execute(CatchExceptionTaskExecuter.java:34)
        at org.gradle.api.internal.tasks.execution.EventFiringTaskExecuter$1.run(EventFiringTaskExecuter.java:51)
        at org.gradle.internal.operations.DefaultBuildOperationExecutor$RunnableBuildOperationWorker.execute(DefaultBuildOperationExecutor.java:300)
        at org.gradle.internal.operations.DefaultBuildOperationExecutor$RunnableBuildOperationWorker.execute(DefaultBuildOperationExecutor.java:292)
        at org.gradle.internal.operations.DefaultBuildOperationExecutor.execute(DefaultBuildOperationExecutor.java:174)
        at org.gradle.internal.operations.DefaultBuildOperationExecutor.run(DefaultBuildOperationExecutor.java:90)
        at org.gradle.internal.operations.DelegatingBuildOperationExecutor.run(DelegatingBuildOperationExecutor.java:31)
        at org.gradle.api.internal.tasks.execution.EventFiringTaskExecuter.execute(EventFiringTaskExecuter.java:46)
        at org.gradle.execution.taskgraph.LocalTaskInfoExecutor.execute(LocalTaskInfoExecutor.java:42)
        at org.gradle.execution.taskgraph.DefaultTaskExecutionGraph$BuildOperationAwareWorkItemExecutor.execute(DefaultTaskExecutionGraph.java:277)
        at org.gradle.execution.taskgraph.DefaultTaskExecutionGraph$BuildOperationAwareWorkItemExecutor.execute(DefaultTaskExecutionGraph.java:262)
        at org.gradle.execution.taskgraph.DefaultTaskPlanExecutor$ExecutorWorker$1.execute(DefaultTaskPlanExecutor.java:135)
        at org.gradle.execution.taskgraph.DefaultTaskPlanExecutor$ExecutorWorker$1.execute(DefaultTaskPlanExecutor.java:130)
        at org.gradle.execution.taskgraph.DefaultTaskPlanExecutor$ExecutorWorker.execute(DefaultTaskPlanExecutor.java:200)
        at org.gradle.execution.taskgraph.DefaultTaskPlanExecutor$ExecutorWorker.executeWithWork(DefaultTaskPlanExecutor.java:191)
        at org.gradle.execution.taskgraph.DefaultTaskPlanExecutor$ExecutorWorker.run(DefaultTaskPlanExecutor.java:130)
        at org.gradle.internal.concurrent.ExecutorPolicy$CatchAndRecordFailures.onExecute(ExecutorPolicy.java:63)
        at org.gradle.internal.concurrent.ManagedExecutorImpl$1.run(ManagedExecutorImpl.java:46)
        at org.gradle.internal.concurrent.ThreadFactoryImpl$ManagedThreadRunnable.run(ThreadFactoryImpl.java:55)
Caused by: : stylesheet /Users/jeremiah/.gradle/daemon/4.10.2/gradle/resources/rat-output-to-html.xsl
doesn't exist.
        at org.apache.tools.ant.taskdefs.XSLTProcess.handleError(XSLTProcess.java:1430)
        at org.apache.tools.ant.taskdefs.XSLTProcess.execute(XSLTProcess.java:413)
        at org.apache.tools.ant.UnknownElement.execute(UnknownElement.java:293)
        at java.base/jdk.internal.reflect.NativeMethodAccessorImpl.invoke0(Native Method)
        at java.base/jdk.internal.reflect.NativeMethodAccessorImpl.invoke(NativeMethodAccessorImpl.java:62)
        at java.base/jdk.internal.reflect.DelegatingMethodAccessorImpl.invoke(DelegatingMethodAccessorImpl.java:43)
        at org.apache.tools.ant.dispatch.DispatchUtils.execute(DispatchUtils.java:106)
        at org.gradle.api.internal.project.ant.BasicAntBuilder.nodeCompleted(BasicAntBuilder.java:78)
        at jdk.internal.reflect.GeneratedMethodAccessor795.invoke(Unknown Source)
        at java.base/jdk.internal.reflect.DelegatingMethodAccessorImpl.invoke(DelegatingMethodAccessorImpl.java:43)
        at org.gradle.internal.metaobject.BeanDynamicObject$MetaClassAdapter.invokeMethod(BeanDynamicObject.java:479)
        at org.gradle.internal.metaobject.BeanDynamicObject.tryInvokeMethod(BeanDynamicObject.java:191)
        at org.gradle.internal.metaobject.AbstractDynamicObject.invokeMethod(AbstractDynamicObject.java:160)
        at org.gradle.api.internal.project.antbuilder.AntBuilderDelegate.nodeCompleted(AntBuilderDelegate.java:118)
        at RatTask$_generateHtmlReport_closure4.doCall(/Users/jeremiah/projects/open_source/samza/gradle/rat.gradle:90)
        at java.base/jdk.internal.reflect.NativeMethodAccessorImpl.invoke0(Native Method)
        at java.base/jdk.internal.reflect.NativeMethodAccessorImpl.invoke(NativeMethodAccessorImpl.java:62)
        at java.base/jdk.internal.reflect.DelegatingMethodAccessorImpl.invoke(DelegatingMethodAccessorImpl.java:43)
        at org.gradle.api.internal.ClosureBackedAction.execute(ClosureBackedAction.java:71)
        at org.gradle.api.internal.ClosureBackedAction.execute(ClosureBackedAction.java:53)
        at org.gradle.api.internal.project.antbuilder.DefaultIsolatedAntBuilder$2.execute(DefaultIsolatedAntBuilder.java:152)
        at org.gradle.api.internal.project.antbuilder.DefaultIsolatedAntBuilder$2.execute(DefaultIsolatedAntBuilder.java:134)
        at org.gradle.api.internal.project.antbuilder.ClassPathToClassLoaderCache.withCachedClassLoader(ClassPathToClassLoaderCache.java:134)
        at org.gradle.api.internal.project.antbuilder.DefaultIsolatedAntBuilder.execute(DefaultIsolatedAntBuilder.java:128)
        at org.gradle.api.internal.project.IsolatedAntBuilder$execute$0.call(Unknown Source)
        at RatTask.generateHtmlReport(/Users/jeremiah/projects/open_source/samza/gradle/rat.gradle:89)
        at RatTask.rat(/Users/jeremiah/projects/open_source/samza/gradle/rat.gradle:106)
        at java.base/jdk.internal.reflect.NativeMethodAccessorImpl.invoke0(Native Method)
        at java.base/jdk.internal.reflect.NativeMethodAccessorImpl.invoke(NativeMethodAccessorImpl.java:62)
        at java.base/jdk.internal.reflect.DelegatingMethodAccessorImpl.invoke(DelegatingMethodAccessorImpl.java:43)
        at org.gradle.internal.reflect.JavaMethod.invoke(JavaMethod.java:73)
        at org.gradle.api.internal.project.taskfactory.StandardTaskAction.doExecute(StandardTaskAction.java:46)
        at org.gradle.api.internal.project.taskfactory.StandardTaskAction.execute(StandardTaskAction.java:39)
        at org.gradle.api.internal.project.taskfactory.StandardTaskAction.execute(StandardTaskAction.java:26)
        at org.gradle.api.internal.AbstractTask$TaskActionWrapper.execute(AbstractTask.java:801)
        at org.gradle.api.internal.AbstractTask$TaskActionWrapper.execute(AbstractTask.java:768)
        at org.gradle.api.internal.tasks.execution.ExecuteActionsTaskExecuter$1.run(ExecuteActionsTaskExecuter.java:131)
        at org.gradle.internal.operations.DefaultBuildOperationExecutor$RunnableBuildOperationWorker.execute(DefaultBuildOperationExecutor.java:300)
        at org.gradle.internal.operations.DefaultBuildOperationExecutor$RunnableBuildOperationWorker.execute(DefaultBuildOperationExecutor.java:292)
        at org.gradle.internal.operations.DefaultBuildOperationExecutor.execute(DefaultBuildOperationExecutor.java:174)
        at org.gradle.internal.operations.DefaultBuildOperationExecutor.run(DefaultBuildOperationExecutor.java:90)
        at org.gradle.internal.operations.DelegatingBuildOperationExecutor.run(DelegatingBuildOperationExecutor.java:31)
        at org.gradle.api.internal.tasks.execution.ExecuteActionsTaskExecuter.executeAction(ExecuteActionsTaskExecuter.java:120)
        at org.gradle.api.internal.tasks.execution.ExecuteActionsTaskExecuter.executeActions(ExecuteActionsTaskExecuter.java:99)
        ... 31 more


* Get more help at https://url.emailprotection.link/?aEIQGIzVT9D4f4diZLBEyMfMWb_Uw9z8ph6LHcrAPoOs~

Deprecated Gradle features were used in this build, making it incompatible with Gradle 5.0.
Use '--warning-mode all' to show the individual deprecation warnings.
See https://url.emailprotection.link/?aIi_JNGuQuS0ZnZdm0kEE-YRCZ2tHs9m5iKcDuL5rVAQTjCY4KIKlyYHbk0bS-oDDGW84Il96WyxIpnjXgYyt29mQZZrkSiwJlt5lMy6MrQq73_2gdSg4HrfeDxrWfl4C

BUILD FAILED in 1s
20 actionable tasks: 1 executed, 19 up-to-date

Mime
View raw message