sentry-commits mailing list archives

Site index · List index
Message view « Date » · « Thread »
Top « Date » · « Thread »
From "Hadoop QA (JIRA)" <j...@apache.org>
Subject [jira] [Commented] (SENTRY-515) [Unit test failure] TestConnectionWithTicketTimeout.testConnectionAfterTicketTimeout
Date Fri, 20 Mar 2015 04:25:38 GMT

    [ https://issues.apache.org/jira/browse/SENTRY-515?page=com.atlassian.jira.plugin.system.issuetabpanels:comment-tabpanel&focusedCommentId=14370691#comment-14370691
] 

Hadoop QA commented on SENTRY-515:
----------------------------------

Here are the results of testing the latest attachment
https://issues.apache.org/jira/secure/attachment/12681106/SENTRY-515.2.patch against master.

{color:red}Overall:{color} -1 due to an error

{color:red}ERROR:{color} failed to apply patch (exit code 1):
The patch does not appear to apply with p0, p1, or p2



Console output: https://builds.apache.org/job/PreCommit-SENTRY-Build/511/console

This message is automatically generated.

> [Unit test failure] TestConnectionWithTicketTimeout.testConnectionAfterTicketTimeout
> ------------------------------------------------------------------------------------
>
>                 Key: SENTRY-515
>                 URL: https://issues.apache.org/jira/browse/SENTRY-515
>             Project: Sentry
>          Issue Type: Bug
>    Affects Versions: 1.5.0
>            Reporter: Sravya Tirukkovalur
>            Priority: Blocker
>             Fix For: 1.6.0
>
>         Attachments: SENTRY-515.2.patch, SENTRY-515.patch
>
>
> Making it a blocker as unit test failed:
> https://builds.apache.org/view/All/job/Sentry-jdk-1.7/lastBuild/org.apache.sentry$sentry-provider-db/testReport/org.apache.sentry.provider.db.service.thrift/TestConnectionWithTicketTimeout/testConnectionAfterTicketTimeout/
> {noformat}
> java.security.PrivilegedActionException: null
> 	at java.security.AccessController.doPrivileged(Native Method)
> 	at javax.security.auth.Subject.doAs(Subject.java:415)
> 	at org.apache.sentry.service.thrift.SentryServiceIntegrationBase.connectToSentryService(SentryServiceIntegrationBase.java:158)
> 	at org.apache.sentry.service.thrift.SentryServiceIntegrationBase.setup(SentryServiceIntegrationBase.java:92)
> 	at sun.reflect.NativeMethodAccessorImpl.invoke0(Native Method)
> 	at sun.reflect.NativeMethodAccessorImpl.invoke(NativeMethodAccessorImpl.java:57)
> 	at sun.reflect.DelegatingMethodAccessorImpl.invoke(DelegatingMethodAccessorImpl.java:43)
> 	at java.lang.reflect.Method.invoke(Method.java:606)
> 	at org.junit.runners.model.FrameworkMethod$1.runReflectiveCall(FrameworkMethod.java:44)
> 	at org.junit.internal.runners.model.ReflectiveCallable.run(ReflectiveCallable.java:15)
> 	at org.junit.runners.model.FrameworkMethod.invokeExplosively(FrameworkMethod.java:41)
> 	at org.junit.internal.runners.statements.RunBefores.evaluate(RunBefores.java:27)
> 	at org.junit.internal.runners.statements.RunAfters.evaluate(RunAfters.java:31)
> 	at org.junit.runners.ParentRunner.runLeaf(ParentRunner.java:263)
> 	at org.junit.runners.BlockJUnit4ClassRunner.runChild(BlockJUnit4ClassRunner.java:69)
> 	at org.junit.runners.BlockJUnit4ClassRunner.runChild(BlockJUnit4ClassRunner.java:48)
> 	at org.junit.runners.ParentRunner$3.run(ParentRunner.java:231)
> 	at org.junit.runners.ParentRunner$1.schedule(ParentRunner.java:60)
> 	at org.junit.runners.ParentRunner.runChildren(ParentRunner.java:229)
> 	at org.junit.runners.ParentRunner.access$000(ParentRunner.java:50)
> 	at org.junit.runners.ParentRunner$2.evaluate(ParentRunner.java:222)
> 	at org.junit.runners.ParentRunner.run(ParentRunner.java:292)
> 	at org.apache.maven.surefire.junit4.JUnit4Provider.execute(JUnit4Provider.java:264)
> 	at org.apache.maven.surefire.junit4.JUnit4Provider.executeTestSet(JUnit4Provider.java:153)
> 	at org.apache.maven.surefire.junit4.JUnit4Provider.invoke(JUnit4Provider.java:124)
> 	at org.apache.maven.surefire.booter.ForkedBooter.invokeProviderInSameClassLoader(ForkedBooter.java:200)
> 	at org.apache.maven.surefire.booter.ForkedBooter.runSuitesInProcess(ForkedBooter.java:153)
> 	at org.apache.maven.surefire.booter.ForkedBooter.main(ForkedBooter.java:103)
> Caused by: java.io.IOException: Transport exception while opening transport: GSS initiate
failed
> 	at org.apache.sentry.provider.db.service.thrift.SentryPolicyServiceClient.<init>(SentryPolicyServiceClient.java:156)
> 	at org.apache.sentry.service.thrift.SentryServiceClientFactory.create(SentryServiceClientFactory.java:26)
> 	at org.apache.sentry.service.thrift.SentryServiceIntegrationBase$1.run(SentryServiceIntegrationBase.java:161)
> 	at org.apache.sentry.service.thrift.SentryServiceIntegrationBase$1.run(SentryServiceIntegrationBase.java:158)
> 	at java.security.AccessController.doPrivileged(Native Method)
> 	at javax.security.auth.Subject.doAs(Subject.java:415)
> 	at org.apache.sentry.service.thrift.SentryServiceIntegrationBase.connectToSentryService(SentryServiceIntegrationBase.java:158)
> 	at org.apache.sentry.service.thrift.SentryServiceIntegrationBase.setup(SentryServiceIntegrationBase.java:92)
> 	at sun.reflect.NativeMethodAccessorImpl.invoke0(Native Method)
> 	at sun.reflect.NativeMethodAccessorImpl.invoke(NativeMethodAccessorImpl.java:57)
> 	at sun.reflect.DelegatingMethodAccessorImpl.invoke(DelegatingMethodAccessorImpl.java:43)
> 	at java.lang.reflect.Method.invoke(Method.java:606)
> 	at org.junit.runners.model.FrameworkMethod$1.runReflectiveCall(FrameworkMethod.java:44)
> 	at org.junit.internal.runners.model.ReflectiveCallable.run(ReflectiveCallable.java:15)
> 	at org.junit.runners.model.FrameworkMethod.invokeExplosively(FrameworkMethod.java:41)
> 	at org.junit.internal.runners.statements.RunBefores.evaluate(RunBefores.java:27)
> 	at org.junit.internal.runners.statements.RunAfters.evaluate(RunAfters.java:31)
> 	at org.junit.runners.ParentRunner.runLeaf(ParentRunner.java:263)
> 	at org.junit.runners.BlockJUnit4ClassRunner.runChild(BlockJUnit4ClassRunner.java:69)
> 	at org.junit.runners.BlockJUnit4ClassRunner.runChild(BlockJUnit4ClassRunner.java:48)
> 	at org.junit.runners.ParentRunner$3.run(ParentRunner.java:231)
> 	at org.junit.runners.ParentRunner$1.schedule(ParentRunner.java:60)
> 	at org.junit.runners.ParentRunner.runChildren(ParentRunner.java:229)
> 	at org.junit.runners.ParentRunner.access$000(ParentRunner.java:50)
> 	at org.junit.runners.ParentRunner$2.evaluate(ParentRunner.java:222)
> 	at org.junit.runners.ParentRunner.run(ParentRunner.java:292)
> 	at org.apache.maven.surefire.junit4.JUnit4Provider.execute(JUnit4Provider.java:264)
> 	at org.apache.maven.surefire.junit4.JUnit4Provider.executeTestSet(JUnit4Provider.java:153)
> 	at org.apache.maven.surefire.junit4.JUnit4Provider.invoke(JUnit4Provider.java:124)
> 	at org.apache.maven.surefire.booter.ForkedBooter.invokeProviderInSameClassLoader(ForkedBooter.java:200)
> 	at org.apache.maven.surefire.booter.ForkedBooter.runSuitesInProcess(ForkedBooter.java:153)
> 	at org.apache.maven.surefire.booter.ForkedBooter.main(ForkedBooter.java:103)
> Caused by: org.apache.thrift.transport.TTransportException: GSS initiate failed
> 	at org.apache.thrift.transport.TSaslTransport.sendAndThrowMessage(TSaslTransport.java:221)
> 	at org.apache.thrift.transport.TSaslTransport.open(TSaslTransport.java:297)
> 	at org.apache.thrift.transport.TSaslClientTransport.open(TSaslClientTransport.java:1)
> 	at org.apache.sentry.provider.db.service.thrift.SentryPolicyServiceClient$UgiSaslClientTransport.baseOpen(SentryPolicyServiceClient.java:118)
> 	at org.apache.sentry.provider.db.service.thrift.SentryPolicyServiceClient$UgiSaslClientTransport.open(SentryPolicyServiceClient.java:96)
> 	at org.apache.sentry.provider.db.service.thrift.SentryPolicyServiceClient.<init>(SentryPolicyServiceClient.java:154)
> 	at org.apache.sentry.service.thrift.SentryServiceClientFactory.create(SentryServiceClientFactory.java:26)
> 	at org.apache.sentry.service.thrift.SentryServiceIntegrationBase$1.run(SentryServiceIntegrationBase.java:161)
> 	at org.apache.sentry.service.thrift.SentryServiceIntegrationBase$1.run(SentryServiceIntegrationBase.java:158)
> 	at java.security.AccessController.doPrivileged(Native Method)
> 	at javax.security.auth.Subject.doAs(Subject.java:415)
> 	at org.apache.sentry.service.thrift.SentryServiceIntegrationBase.connectToSentryService(SentryServiceIntegrationBase.java:158)
> 	at org.apache.sentry.service.thrift.SentryServiceIntegrationBase.setup(SentryServiceIntegrationBase.java:92)
> 	at sun.reflect.NativeMethodAccessorImpl.invoke0(Native Method)
> 	at sun.reflect.NativeMethodAccessorImpl.invoke(NativeMethodAccessorImpl.java:57)
> 	at sun.reflect.DelegatingMethodAccessorImpl.invoke(DelegatingMethodAccessorImpl.java:43)
> 	at java.lang.reflect.Method.invoke(Method.java:606)
> 	at org.junit.runners.model.FrameworkMethod$1.runReflectiveCall(FrameworkMethod.java:44)
> 	at org.junit.internal.runners.model.ReflectiveCallable.run(ReflectiveCallable.java:15)
> 	at org.junit.runners.model.FrameworkMethod.invokeExplosively(FrameworkMethod.java:41)
> 	at org.junit.internal.runners.statements.RunBefores.evaluate(RunBefores.java:27)
> 	at org.junit.internal.runners.statements.RunAfters.evaluate(RunAfters.java:31)
> 	at org.junit.runners.ParentRunner.runLeaf(ParentRunner.java:263)
> 	at org.junit.runners.BlockJUnit4ClassRunner.runChild(BlockJUnit4ClassRunner.java:69)
> 	at org.junit.runners.BlockJUnit4ClassRunner.runChild(BlockJUnit4ClassRunner.java:48)
> 	at org.junit.runners.ParentRunner$3.run(ParentRunner.java:231)
> 	at org.junit.runners.ParentRunner$1.schedule(ParentRunner.java:60)
> 	at org.junit.runners.ParentRunner.runChildren(ParentRunner.java:229)
> 	at org.junit.runners.ParentRunner.access$000(ParentRunner.java:50)
> 	at org.junit.runners.ParentRunner$2.evaluate(ParentRunner.java:222)
> 	at org.junit.runners.ParentRunner.run(ParentRunner.java:292)
> 	at org.apache.maven.surefire.junit4.JUnit4Provider.execute(JUnit4Provider.java:264)
> 	at org.apache.maven.surefire.junit4.JUnit4Provider.executeTestSet(JUnit4Provider.java:153)
> 	at org.apache.maven.surefire.junit4.JUnit4Provider.invoke(JUnit4Provider.java:124)
> 	at org.apache.maven.surefire.booter.ForkedBooter.invokeProviderInSameClassLoader(ForkedBooter.java:200)
> 	at org.apache.maven.surefire.booter.ForkedBooter.runSuitesInProcess(ForkedBooter.java:153)
> 	at org.apache.maven.surefire.booter.ForkedBooter.main(ForkedBooter.java:103)
> {noformat}



--
This message was sent by Atlassian JIRA
(v6.3.4#6332)

Mime
View raw message