servicemix-commits mailing list archives

Site index · List index
Message view « Date » · « Thread »
Top « Date » · « Thread »
From Apache Hudson Server <hud...@hudson.zones.apache.org>
Subject Build failed in Hudson: ServiceMix-Features #179
Date Thu, 31 Dec 2009 22:27:05 GMT
See <http://hudson.zones.apache.org/hudson/job/ServiceMix-Features/179/changes>

Changes:

[jbonofre] Upgrade the JBI components version set and add servicemix-exec component.

------------------------------------------
[...truncated 25410 lines...]
	at org.codehaus.plexus.DefaultPlexusContainer.lookup(DefaultPlexusContainer.java:331)
	... 35 more
Caused by: org.codehaus.plexus.personality.plexus.lifecycle.phase.PhaseExecutionException:
Error composing component
	at org.codehaus.plexus.personality.plexus.lifecycle.phase.CompositionPhase.execute(CompositionPhase.java:33)
	at org.codehaus.plexus.lifecycle.AbstractLifecycleHandler.start(AbstractLifecycleHandler.java:101)
	at org.codehaus.plexus.component.manager.AbstractComponentManager.startComponentLifecycle(AbstractComponentManager.java:105)
	... 38 more
Caused by: org.codehaus.plexus.component.composition.CompositionException: Composition failed
of field jarArchiver in object of type org.apache.servicemix.maven.plugin.jbi.GenerateServiceAssemblyMojo
because the requirement ComponentRequirement{role='org.codehaus.plexus.archive.Archive', roleHint='jar',
fieldName='jarArchiver'} was missing
	at org.codehaus.plexus.component.composition.FieldComponentComposer.assignRequirementToField(FieldComponentComposer.java:154)
	at org.codehaus.plexus.component.composition.FieldComponentComposer.assembleComponent(FieldComponentComposer.java:73)
	at org.codehaus.plexus.component.composition.DefaultComponentComposerManager.assembleComponent(DefaultComponentComposerManager.java:68)
	at org.codehaus.plexus.DefaultPlexusContainer.composeComponent(DefaultPlexusContainer.java:1486)
	at org.codehaus.plexus.personality.plexus.lifecycle.phase.CompositionPhase.execute(CompositionPhase.java:29)
	... 40 more
Caused by: org.codehaus.plexus.component.repository.exception.ComponentLookupException: Component
descriptor cannot be found in the component repository: org.codehaus.plexus.archive.Archivejar.
	at org.codehaus.plexus.DefaultPlexusContainer.lookup(DefaultPlexusContainer.java:323)
	at org.codehaus.plexus.DefaultPlexusContainer.lookup(DefaultPlexusContainer.java:312)
	at org.codehaus.plexus.component.composition.FieldComponentComposer.assignRequirementToField(FieldComponentComposer.java:129)
	... 44 more
[INFO] ------------------------------------------------------------------------
[INFO] Error for project: ServiceMix :: Samples :: WSDL first :: SA (during install)
[INFO] ------------------------------------------------------------------------
[INFO] Internal error in the plugin manager executing goal 'org.apache.servicemix.tooling:jbi-maven-plugin:4.2:jbi-service-assembly':
Unable to find the mojo 'jbi-service-assembly' (or one of its required components) in the
plugin 'org.apache.servicemix.tooling:jbi-maven-plugin'
Component descriptor cannot be found in the component repository: org.codehaus.plexus.archive.Archivejar.
[INFO] ------------------------------------------------------------------------
[INFO] Trace
org.apache.maven.lifecycle.LifecycleExecutionException: Internal error in the plugin manager
executing goal 'org.apache.servicemix.tooling:jbi-maven-plugin:4.2:jbi-service-assembly':
Unable to find the mojo 'jbi-service-assembly' (or one of its required components) in the
plugin 'org.apache.servicemix.tooling:jbi-maven-plugin'
	at org.apache.maven.lifecycle.DefaultLifecycleExecutor.executeGoals(DefaultLifecycleExecutor.java:698)
	at org.apache.maven.lifecycle.DefaultLifecycleExecutor.executeGoalWithLifecycle(DefaultLifecycleExecutor.java:556)
	at org.apache.maven.lifecycle.DefaultLifecycleExecutor.executeGoal(DefaultLifecycleExecutor.java:535)
	at org.apache.maven.lifecycle.DefaultLifecycleExecutor.executeGoalAndHandleFailures(DefaultLifecycleExecutor.java:387)
	at org.apache.maven.lifecycle.DefaultLifecycleExecutor.executeTaskSegments(DefaultLifecycleExecutor.java:348)
	at org.apache.maven.lifecycle.DefaultLifecycleExecutor.execute(DefaultLifecycleExecutor.java:180)
	at org.apache.maven.lifecycle.LifecycleExecutorInterceptor.execute(LifecycleExecutorInterceptor.java:65)
	at org.apache.maven.DefaultMaven.doExecute(DefaultMaven.java:328)
	at org.apache.maven.DefaultMaven.execute(DefaultMaven.java:138)
	at org.apache.maven.cli.MavenCli.main(MavenCli.java:362)
	at sun.reflect.NativeMethodAccessorImpl.invoke0(Native Method)
	at sun.reflect.NativeMethodAccessorImpl.invoke(NativeMethodAccessorImpl.java:39)
	at sun.reflect.DelegatingMethodAccessorImpl.invoke(DelegatingMethodAccessorImpl.java:25)
	at java.lang.reflect.Method.invoke(Method.java:585)
	at org.codehaus.classworlds.Launcher.launchEnhanced(Launcher.java:315)
	at org.codehaus.classworlds.Launcher.launch(Launcher.java:255)
	at hudson.maven.agent.Main.launch(Main.java:165)
	at hudson.maven.MavenBuilder.call(MavenBuilder.java:159)
	at hudson.maven.MavenModuleSetBuild$Builder.call(MavenModuleSetBuild.java:688)
	at hudson.maven.MavenModuleSetBuild$Builder.call(MavenModuleSetBuild.java:632)
	at hudson.remoting.UserRequest.perform(UserRequest.java:104)
	at hudson.remoting.UserRequest.perform(UserRequest.java:48)
	at hudson.remoting.Request$2.run(Request.java:236)
	at java.util.concurrent.Executors$RunnableAdapter.call(Executors.java:417)
	at java.util.concurrent.FutureTask$Sync.innerRun(FutureTask.java:269)
	at java.util.concurrent.FutureTask.run(FutureTask.java:123)
	at java.util.concurrent.ThreadPoolExecutor$Worker.runTask(ThreadPoolExecutor.java:650)
	at java.util.concurrent.ThreadPoolExecutor$Worker.run(ThreadPoolExecutor.java:675)
	at java.lang.Thread.run(Thread.java:595)
Caused by: org.apache.maven.plugin.PluginManagerException: Unable to find the mojo 'jbi-service-assembly'
(or one of its required components) in the plugin 'org.apache.servicemix.tooling:jbi-maven-plugin'
	at org.apache.maven.plugin.DefaultPluginManager.getConfiguredMojo(DefaultPluginManager.java:674)
	at org.apache.maven.plugin.DefaultPluginManager.executeMojo(DefaultPluginManager.java:468)
	at hudson.maven.agent.PluginManagerInterceptor.executeMojo(PluginManagerInterceptor.java:182)
	at org.apache.maven.lifecycle.DefaultLifecycleExecutor.executeGoals(DefaultLifecycleExecutor.java:694)
	... 28 more
Caused by: org.codehaus.plexus.component.repository.exception.ComponentLookupException: Unable
to lookup component 'org.apache.maven.plugin.Mojoorg.apache.servicemix.tooling:jbi-maven-plugin:4.2:jbi-service-assembly',
it could not be started
	at org.codehaus.plexus.DefaultPlexusContainer.lookup(DefaultPlexusContainer.java:339)
	at org.codehaus.plexus.DefaultPlexusContainer.lookup(DefaultPlexusContainer.java:440)
	at hudson.maven.agent.ContainerFilter.lookup(ContainerFilter.java:89)
	at hudson.maven.agent.PluginManagerInterceptor$1$1.lookup(PluginManagerInterceptor.java:95)
	at org.apache.maven.plugin.DefaultPluginManager.getConfiguredMojo(DefaultPluginManager.java:652)
	... 31 more
Caused by: org.codehaus.plexus.component.repository.exception.ComponentLifecycleException:
Error starting component
	at org.codehaus.plexus.component.manager.AbstractComponentManager.startComponentLifecycle(AbstractComponentManager.java:109)
	at org.codehaus.plexus.component.manager.AbstractComponentManager.createComponentInstance(AbstractComponentManager.java:95)
	at org.codehaus.plexus.component.manager.PerLookupComponentManager.getComponent(PerLookupComponentManager.java:48)
	at org.codehaus.plexus.DefaultPlexusContainer.lookup(DefaultPlexusContainer.java:331)
	... 35 more
Caused by: org.codehaus.plexus.personality.plexus.lifecycle.phase.PhaseExecutionException:
Error composing component
	at org.codehaus.plexus.personality.plexus.lifecycle.phase.CompositionPhase.execute(CompositionPhase.java:33)
	at org.codehaus.plexus.lifecycle.AbstractLifecycleHandler.start(AbstractLifecycleHandler.java:101)
	at org.codehaus.plexus.component.manager.AbstractComponentManager.startComponentLifecycle(AbstractComponentManager.java:105)
	... 38 more
Caused by: org.codehaus.plexus.component.composition.CompositionException: Composition failed
of field jarArchiver in object of type org.apache.servicemix.maven.plugin.jbi.GenerateServiceAssemblyMojo
because the requirement ComponentRequirement{role='org.codehaus.plexus.archive.Archive', roleHint='jar',
fieldName='jarArchiver'} was missing
	at org.codehaus.plexus.component.composition.FieldComponentComposer.assignRequirementToField(FieldComponentComposer.java:154)
	at org.codehaus.plexus.component.composition.FieldComponentComposer.assembleComponent(FieldComponentComposer.java:73)
	at org.codehaus.plexus.component.composition.DefaultComponentComposerManager.assembleComponent(DefaultComponentComposerManager.java:68)
	at org.codehaus.plexus.DefaultPlexusContainer.composeComponent(DefaultPlexusContainer.java:1486)
	at org.codehaus.plexus.personality.plexus.lifecycle.phase.CompositionPhase.execute(CompositionPhase.java:29)
	... 40 more
Caused by: org.codehaus.plexus.component.repository.exception.ComponentLookupException: Component
descriptor cannot be found in the component repository: org.codehaus.plexus.archive.Archivejar.
	at org.codehaus.plexus.DefaultPlexusContainer.lookup(DefaultPlexusContainer.java:323)
	at org.codehaus.plexus.DefaultPlexusContainer.lookup(DefaultPlexusContainer.java:312)
	at org.codehaus.plexus.component.composition.FieldComponentComposer.assignRequirementToField(FieldComponentComposer.java:129)
	... 44 more
[INFO] ------------------------------------------------------------------------
[INFO] Error for project: ServiceMix :: Samples :: WSDL first :: SA (during install)
[INFO] ------------------------------------------------------------------------
[INFO] Internal error in the plugin manager executing goal 'org.apache.servicemix.tooling:jbi-maven-plugin:4.2:jbi-service-assembly':
Unable to find the mojo 'jbi-service-assembly' (or one of its required components) in the
plugin 'org.apache.servicemix.tooling:jbi-maven-plugin'
Component descriptor cannot be found in the component repository: org.codehaus.plexus.archive.Archivejar.
[INFO] ------------------------------------------------------------------------
[INFO] Trace
org.apache.maven.lifecycle.LifecycleExecutionException: Internal error in the plugin manager
executing goal 'org.apache.servicemix.tooling:jbi-maven-plugin:4.2:jbi-service-assembly':
Unable to find the mojo 'jbi-service-assembly' (or one of its required components) in the
plugin 'org.apache.servicemix.tooling:jbi-maven-plugin'
	at org.apache.maven.lifecycle.DefaultLifecycleExecutor.executeGoals(DefaultLifecycleExecutor.java:698)
	at org.apache.maven.lifecycle.DefaultLifecycleExecutor.executeGoalWithLifecycle(DefaultLifecycleExecutor.java:556)
	at org.apache.maven.lifecycle.DefaultLifecycleExecutor.executeGoal(DefaultLifecycleExecutor.java:535)
	at org.apache.maven.lifecycle.DefaultLifecycleExecutor.executeGoalAndHandleFailures(DefaultLifecycleExecutor.java:387)
	at org.apache.maven.lifecycle.DefaultLifecycleExecutor.executeTaskSegments(DefaultLifecycleExecutor.java:348)
	at org.apache.maven.lifecycle.DefaultLifecycleExecutor.execute(DefaultLifecycleExecutor.java:180)
	at org.apache.maven.lifecycle.LifecycleExecutorInterceptor.execute(LifecycleExecutorInterceptor.java:65)
	at org.apache.maven.DefaultMaven.doExecute(DefaultMaven.java:328)
	at org.apache.maven.DefaultMaven.execute(DefaultMaven.java:138)
	at org.apache.maven.cli.MavenCli.main(MavenCli.java:362)
	at sun.reflect.NativeMethodAccessorImpl.invoke0(Native Method)
	at sun.reflect.NativeMethodAccessorImpl.invoke(NativeMethodAccessorImpl.java:39)
	at sun.reflect.DelegatingMethodAccessorImpl.invoke(DelegatingMethodAccessorImpl.java:25)
	at java.lang.reflect.Method.invoke(Method.java:585)
	at org.codehaus.classworlds.Launcher.launchEnhanced(Launcher.java:315)
	at org.codehaus.classworlds.Launcher.launch(Launcher.java:255)
	at hudson.maven.agent.Main.launch(Main.java:165)
	at hudson.maven.MavenBuilder.call(MavenBuilder.java:159)
	at hudson.maven.MavenModuleSetBuild$Builder.call(MavenModuleSetBuild.java:688)
	at hudson.maven.MavenModuleSetBuild$Builder.call(MavenModuleSetBuild.java:632)
	at hudson.remoting.UserRequest.perform(UserRequest.java:104)
	at hudson.remoting.UserRequest.perform(UserRequest.java:48)
	at hudson.remoting.Request$2.run(Request.java:236)
	at java.util.concurrent.Executors$RunnableAdapter.call(Executors.java:417)
	at java.util.concurrent.FutureTask$Sync.innerRun(FutureTask.java:269)
	at java.util.concurrent.FutureTask.run(FutureTask.java:123)
	at java.util.concurrent.ThreadPoolExecutor$Worker.runTask(ThreadPoolExecutor.java:650)
	at java.util.concurrent.ThreadPoolExecutor$Worker.run(ThreadPoolExecutor.java:675)
	at java.lang.Thread.run(Thread.java:595)
Caused by: org.apache.maven.plugin.PluginManagerException: Unable to find the mojo 'jbi-service-assembly'
(or one of its required components) in the plugin 'org.apache.servicemix.tooling:jbi-maven-plugin'
	at org.apache.maven.plugin.DefaultPluginManager.getConfiguredMojo(DefaultPluginManager.java:674)
	at org.apache.maven.plugin.DefaultPluginManager.executeMojo(DefaultPluginManager.java:468)
	at hudson.maven.agent.PluginManagerInterceptor.executeMojo(PluginManagerInterceptor.java:182)
	at org.apache.maven.lifecycle.DefaultLifecycleExecutor.executeGoals(DefaultLifecycleExecutor.java:694)
	... 28 more
Caused by: org.codehaus.plexus.component.repository.exception.ComponentLookupException: Unable
to lookup component 'org.apache.maven.plugin.Mojoorg.apache.servicemix.tooling:jbi-maven-plugin:4.2:jbi-service-assembly',
it could not be started
	at org.codehaus.plexus.DefaultPlexusContainer.lookup(DefaultPlexusContainer.java:339)
	at org.codehaus.plexus.DefaultPlexusContainer.lookup(DefaultPlexusContainer.java:440)
	at hudson.maven.agent.ContainerFilter.lookup(ContainerFilter.java:89)
	at hudson.maven.agent.PluginManagerInterceptor$1$1.lookup(PluginManagerInterceptor.java:95)
	at org.apache.maven.plugin.DefaultPluginManager.getConfiguredMojo(DefaultPluginManager.java:652)
	... 31 more
Caused by: org.codehaus.plexus.component.repository.exception.ComponentLifecycleException:
Error starting component
	at org.codehaus.plexus.component.manager.AbstractComponentManager.startComponentLifecycle(AbstractComponentManager.java:109)
	at org.codehaus.plexus.component.manager.AbstractComponentManager.createComponentInstance(AbstractComponentManager.java:95)
	at org.codehaus.plexus.component.manager.PerLookupComponentManager.getComponent(PerLookupComponentManager.java:48)
	at org.codehaus.plexus.DefaultPlexusContainer.lookup(DefaultPlexusContainer.java:331)
	... 35 more
Caused by: org.codehaus.plexus.personality.plexus.lifecycle.phase.PhaseExecutionException:
Error composing component
	at org.codehaus.plexus.personality.plexus.lifecycle.phase.CompositionPhase.execute(CompositionPhase.java:33)
	at org.codehaus.plexus.lifecycle.AbstractLifecycleHandler.start(AbstractLifecycleHandler.java:101)
	at org.codehaus.plexus.component.manager.AbstractComponentManager.startComponentLifecycle(AbstractComponentManager.java:105)
	... 38 more
Caused by: org.codehaus.plexus.component.composition.CompositionException: Composition failed
of field jarArchiver in object of type org.apache.servicemix.maven.plugin.jbi.GenerateServiceAssemblyMojo
because the requirement ComponentRequirement{role='org.codehaus.plexus.archive.Archive', roleHint='jar',
fieldName='jarArchiver'} was missing
	at org.codehaus.plexus.component.composition.FieldComponentComposer.assignRequirementToField(FieldComponentComposer.java:154)
	at org.codehaus.plexus.component.composition.FieldComponentComposer.assembleComponent(FieldComponentComposer.java:73)
	at org.codehaus.plexus.component.composition.DefaultComponentComposerManager.assembleComponent(DefaultComponentComposerManager.java:68)
	at org.codehaus.plexus.DefaultPlexusContainer.composeComponent(DefaultPlexusContainer.java:1486)
	at org.codehaus.plexus.personality.plexus.lifecycle.phase.CompositionPhase.execute(CompositionPhase.java:29)
	... 40 more
Caused by: org.codehaus.plexus.component.repository.exception.ComponentLookupException: Component
descriptor cannot be found in the component repository: org.codehaus.plexus.archive.Archivejar.
	at org.codehaus.plexus.DefaultPlexusContainer.lookup(DefaultPlexusContainer.java:323)
	at org.codehaus.plexus.DefaultPlexusContainer.lookup(DefaultPlexusContainer.java:312)
	at org.codehaus.plexus.component.composition.FieldComponentComposer.assignRequirementToField(FieldComponentComposer.java:129)
	... 44 more
[INFO] ------------------------------------------------------------------------
[INFO] Error for project: ServiceMix :: Samples :: Loan Broker :: SA (during install)
[INFO] ------------------------------------------------------------------------
[INFO] Internal error in the plugin manager executing goal 'org.apache.servicemix.tooling:jbi-maven-plugin:4.2:jbi-service-assembly':
Unable to find the mojo 'jbi-service-assembly' (or one of its required components) in the
plugin 'org.apache.servicemix.tooling:jbi-maven-plugin'
Component descriptor cannot be found in the component repository: org.codehaus.plexus.archive.Archivejar.
[INFO] ------------------------------------------------------------------------
[INFO] Trace
org.apache.maven.lifecycle.LifecycleExecutionException: Internal error in the plugin manager
executing goal 'org.apache.servicemix.tooling:jbi-maven-plugin:4.2:jbi-service-assembly':
Unable to find the mojo 'jbi-service-assembly' (or one of its required components) in the
plugin 'org.apache.servicemix.tooling:jbi-maven-plugin'
	at org.apache.maven.lifecycle.DefaultLifecycleExecutor.executeGoals(DefaultLifecycleExecutor.java:698)
	at org.apache.maven.lifecycle.DefaultLifecycleExecutor.executeGoalWithLifecycle(DefaultLifecycleExecutor.java:556)
	at org.apache.maven.lifecycle.DefaultLifecycleExecutor.executeGoal(DefaultLifecycleExecutor.java:535)
	at org.apache.maven.lifecycle.DefaultLifecycleExecutor.executeGoalAndHandleFailures(DefaultLifecycleExecutor.java:387)
	at org.apache.maven.lifecycle.DefaultLifecycleExecutor.executeTaskSegments(DefaultLifecycleExecutor.java:348)
	at org.apache.maven.lifecycle.DefaultLifecycleExecutor.execute(DefaultLifecycleExecutor.java:180)
	at org.apache.maven.lifecycle.LifecycleExecutorInterceptor.execute(LifecycleExecutorInterceptor.java:65)
	at org.apache.maven.DefaultMaven.doExecute(DefaultMaven.java:328)
	at org.apache.maven.DefaultMaven.execute(DefaultMaven.java:138)
	at org.apache.maven.cli.MavenCli.main(MavenCli.java:362)
	at sun.reflect.NativeMethodAccessorImpl.invoke0(Native Method)
	at sun.reflect.NativeMethodAccessorImpl.invoke(NativeMethodAccessorImpl.java:39)
	at sun.reflect.DelegatingMethodAccessorImpl.invoke(DelegatingMethodAccessorImpl.java:25)
	at java.lang.reflect.Method.invoke(Method.java:585)
	at org.codehaus.classworlds.Launcher.launchEnhanced(Launcher.java:315)
	at org.codehaus.classworlds.Launcher.launch(Launcher.java:255)
	at hudson.maven.agent.Main.launch(Main.java:165)
	at hudson.maven.MavenBuilder.call(MavenBuilder.java:159)
	at hudson.maven.MavenModuleSetBuild$Builder.call(MavenModuleSetBuild.java:688)
	at hudson.maven.MavenModuleSetBuild$Builder.call(MavenModuleSetBuild.java:632)
	at hudson.remoting.UserRequest.perform(UserRequest.java:104)
	at hudson.remoting.UserRequest.perform(UserRequest.java:48)
	at hudson.remoting.Request$2.run(Request.java:236)
	at java.util.concurrent.Executors$RunnableAdapter.call(Executors.java:417)
	at java.util.concurrent.FutureTask$Sync.innerRun(FutureTask.java:269)
	at java.util.concurrent.FutureTask.run(FutureTask.java:123)
	at java.util.concurrent.ThreadPoolExecutor$Worker.runTask(ThreadPoolExecutor.java:650)
	at java.util.concurrent.ThreadPoolExecutor$Worker.run(ThreadPoolExecutor.java:675)
	at java.lang.Thread.run(Thread.java:595)
Caused by: org.apache.maven.plugin.PluginManagerException: Unable to find the mojo 'jbi-service-assembly'
(or one of its required components) in the plugin 'org.apache.servicemix.tooling:jbi-maven-plugin'
	at org.apache.maven.plugin.DefaultPluginManager.getConfiguredMojo(DefaultPluginManager.java:674)
	at org.apache.maven.plugin.DefaultPluginManager.executeMojo(DefaultPluginManager.java:468)
	at hudson.maven.agent.PluginManagerInterceptor.executeMojo(PluginManagerInterceptor.java:182)
	at org.apache.maven.lifecycle.DefaultLifecycleExecutor.executeGoals(DefaultLifecycleExecutor.java:694)
	... 28 more
Caused by: org.codehaus.plexus.component.repository.exception.ComponentLookupException: Unable
to lookup component 'org.apache.maven.plugin.Mojoorg.apache.servicemix.tooling:jbi-maven-plugin:4.2:jbi-service-assembly',
it could not be started
	at org.codehaus.plexus.DefaultPlexusContainer.lookup(DefaultPlexusContainer.java:339)
	at org.codehaus.plexus.DefaultPlexusContainer.lookup(DefaultPlexusContainer.java:440)
	at hudson.maven.agent.ContainerFilter.lookup(ContainerFilter.java:89)
	at hudson.maven.agent.PluginManagerInterceptor$1$1.lookup(PluginManagerInterceptor.java:95)
	at org.apache.maven.plugin.DefaultPluginManager.getConfiguredMojo(DefaultPluginManager.java:652)
	... 31 more
Caused by: org.codehaus.plexus.component.repository.exception.ComponentLifecycleException:
Error starting component
	at org.codehaus.plexus.component.manager.AbstractComponentManager.startComponentLifecycle(AbstractComponentManager.java:109)
	at org.codehaus.plexus.component.manager.AbstractComponentManager.createComponentInstance(AbstractComponentManager.java:95)
	at org.codehaus.plexus.component.manager.PerLookupComponentManager.getComponent(PerLookupComponentManager.java:48)
	at org.codehaus.plexus.DefaultPlexusContainer.lookup(DefaultPlexusContainer.java:331)
	... 35 more
Caused by: org.codehaus.plexus.personality.plexus.lifecycle.phase.PhaseExecutionException:
Error composing component
	at org.codehaus.plexus.personality.plexus.lifecycle.phase.CompositionPhase.execute(CompositionPhase.java:33)
	at org.codehaus.plexus.lifecycle.AbstractLifecycleHandler.start(AbstractLifecycleHandler.java:101)
	at org.codehaus.plexus.component.manager.AbstractComponentManager.startComponentLifecycle(AbstractComponentManager.java:105)
	... 38 more
Caused by: org.codehaus.plexus.component.composition.CompositionException: Composition failed
of field jarArchiver in object of type org.apache.servicemix.maven.plugin.jbi.GenerateServiceAssemblyMojo
because the requirement ComponentRequirement{role='org.codehaus.plexus.archive.Archive', roleHint='jar',
fieldName='jarArchiver'} was missing
	at org.codehaus.plexus.component.composition.FieldComponentComposer.assignRequirementToField(FieldComponentComposer.java:154)
	at org.codehaus.plexus.component.composition.FieldComponentComposer.assembleComponent(FieldComponentComposer.java:73)
	at org.codehaus.plexus.component.composition.DefaultComponentComposerManager.assembleComponent(DefaultComponentComposerManager.java:68)
	at org.codehaus.plexus.DefaultPlexusContainer.composeComponent(DefaultPlexusContainer.java:1486)
	at org.codehaus.plexus.personality.plexus.lifecycle.phase.CompositionPhase.execute(CompositionPhase.java:29)
	... 40 more
Caused by: org.codehaus.plexus.component.repository.exception.ComponentLookupException: Component
descriptor cannot be found in the component repository: org.codehaus.plexus.archive.Archivejar.
	at org.codehaus.plexus.DefaultPlexusContainer.lookup(DefaultPlexusContainer.java:323)
	at org.codehaus.plexus.DefaultPlexusContainer.lookup(DefaultPlexusContainer.java:312)
	at org.codehaus.plexus.component.composition.FieldComponentComposer.assignRequirementToField(FieldComponentComposer.java:129)
	... 44 more
[INFO] ------------------------------------------------------------------------
[INFO] BUILD ERRORS
[INFO] ------------------------------------------------------------------------
[INFO] Total time: 24 minutes 39 seconds
[INFO] Finished at: Thu Dec 31 22:32:15 UTC 2009
[INFO] Final Memory: 134M/220M
[INFO] ------------------------------------------------------------------------
Waiting for Hudson to finish collecting data
channel stopped
[locks-and-latches] Releasing all the locks
[locks-and-latches] All the locks released


Mime
View raw message