servicemix-commits mailing list archives

Site index · List index
Message view « Date » · « Thread »
Top « Date » · « Thread »
From Apache Hudson Server <hud...@hudson.zones.apache.org>
Subject Build failed in Hudson: ServiceMix-Components #305
Date Thu, 04 Mar 2010 00:29:03 GMT
See <http://hudson.zones.apache.org/hudson/job/ServiceMix-Components/305/changes>

Changes:

[jbonofre] [SMXCOMP-713] Threading problem.

------------------------------------------
[...truncated 85913 lines...]
[INFO] Installing <http://hudson.zones.apache.org/hudson/job/ServiceMix-Components/ws/components/pom.xml>
to <http://hudson.zones.apache.org/hudson/job/ServiceMix-Components/ws/.repository/org/apache/servicemix/all-components/1.0-SNAPSHOT/all-components-1.0-SNAPSHOT.pom>
[HUDSON] Archiving <http://hudson.zones.apache.org/hudson/job/ServiceMix-Components/ws/components/pom.xml>
to /export/home/hudson/hudson/jobs/ServiceMix-Components/modules/org.apache.servicemix$all-components/builds/2010-03-03_23-24-07/archive/org.apache.servicemix/all-components/1.0-SNAPSHOT/pom.xml
[HUDSON] Archiving <http://hudson.zones.apache.org/hudson/job/ServiceMix-Components/ws/.repository/org/apache/servicemix/all-components/1.0-SNAPSHOT/all-components-1.0-SNAPSHOT.pom>
to /export/home/hudson/hudson/jobs/ServiceMix-Components/modules/org.apache.servicemix$all-components/builds/2010-03-03_23-24-07/archive/org.apache.servicemix/all-components/1.0-SNAPSHOT/all-components-1.0-SNAPSHOT.pom
[INFO] 
[INFO] 
[INFO] ------------------------------------------------------------------------
[INFO] Reactor Summary:
[INFO] ------------------------------------------------------------------------
[INFO] ServiceMix :: Components POM .......................... SUCCESS [12.335s]
[INFO] ServiceMix :: Shared Libraries ........................ SUCCESS [0.301s]
[INFO] ServiceMix :: Common .................................. SUCCESS [18.261s]
[INFO] ServiceMix :: SOAP .................................... SUCCESS [6.894s]
[INFO] ServiceMix :: SOAP2 ................................... SUCCESS [7.916s]
[INFO] ServiceMix :: Shared .................................. SUCCESS [2.625s]
[INFO] ServiceMix :: Bean .................................... SUCCESS [20.877s]
[INFO] ServiceMix :: Camel ................................... SUCCESS [1:02.390s]
[INFO] ServiceMix :: CXF Service Engine ...................... SUCCESS [50.211s]
[INFO] ServiceMix :: Drools Service Engine ................... SUCCESS [8.087s]
[INFO] ServiceMix :: EIP ..................................... SUCCESS [15:24.969s]
[INFO] ServiceMix :: Exec .................................... SUCCESS [7.565s]
[INFO] ServiceMix :: JSR-181 Service Engine .................. SUCCESS [10.913s]
[INFO] ServiceMix :: OSWorkflow .............................. SUCCESS [5.156s]
[INFO] ServiceMix :: Quartz .................................. SUCCESS [8.016s]
[INFO] ServiceMix :: Saxon Service Engine .................... SUCCESS [8.470s]
[INFO] ServiceMix :: Scripting Service Engine ................ SUCCESS [9.046s]
[INFO] ServiceMix :: JSR-223 Scripting Service Engine ........ SUCCESS [12.257s]
[INFO] ServiceMix :: Validation .............................. SUCCESS [5.373s]
[INFO] ServiceMix :: WS-Notification Service Engine .......... SUCCESS [9:31.711s]
[INFO] ServiceMix :: CXF Binding Component ................... SUCCESS [23:17.526s]
[INFO] ServiceMix :: File .................................... SUCCESS [27.678s]
[INFO] ServiceMix :: FTP ..................................... SUCCESS [9.175s]
[INFO] ServiceMix :: HTTP .................................... SUCCESS [37.552s]
[INFO] ServiceMix :: JMS ..................................... FAILED [2:44.316s]
[INFO] ServiceMix :: Mail .................................... FAILED [0.773s]
[INFO] ServiceMix :: SMPP .................................... SUCCESS [9.552s]
[INFO] ServiceMix :: SNMP .................................... SUCCESS [46.965s]
[INFO] ServiceMix :: TrueZIP ................................. SUCCESS [6.108s]
[INFO] ServiceMix :: VFS ..................................... SUCCESS [3.256s]
[INFO] ServiceMix :: XMPP .................................... SUCCESS [4.601s]
[INFO] Apache ServiceMix All Components POM .................. SUCCESS [0.322s]
[INFO] ------------------------------------------------------------------------
[INFO] Error for project: ServiceMix :: JMS (during install)
[INFO] ------------------------------------------------------------------------
[INFO] Error while executing forked tests.; nested exception is org.apache.maven.surefire.booter.shade.org.codehaus.plexus.util.cli.CommandLineException:
Error while executing external command, process killed.

Process timeout out after 90 seconds
[INFO] ------------------------------------------------------------------------
[INFO] Trace
org.apache.maven.lifecycle.LifecycleExecutionException: Error while executing forked tests.;
nested exception is org.apache.maven.surefire.booter.shade.org.codehaus.plexus.util.cli.CommandLineException:
Error while executing external command, process killed.
	at org.apache.maven.lifecycle.DefaultLifecycleExecutor.executeGoals(DefaultLifecycleExecutor.java:719)
	at org.apache.maven.lifecycle.DefaultLifecycleExecutor.executeGoalWithLifecycle(DefaultLifecycleExecutor.java:556)
	at org.apache.maven.lifecycle.DefaultLifecycleExecutor.executeGoal(DefaultLifecycleExecutor.java:535)
	at org.apache.maven.lifecycle.DefaultLifecycleExecutor.executeGoalAndHandleFailures(DefaultLifecycleExecutor.java:387)
	at org.apache.maven.lifecycle.DefaultLifecycleExecutor.executeTaskSegments(DefaultLifecycleExecutor.java:348)
	at org.apache.maven.lifecycle.DefaultLifecycleExecutor.execute(DefaultLifecycleExecutor.java:180)
	at org.apache.maven.lifecycle.LifecycleExecutorInterceptor.execute(LifecycleExecutorInterceptor.java:65)
	at org.apache.maven.DefaultMaven.doExecute(DefaultMaven.java:328)
	at org.apache.maven.DefaultMaven.execute(DefaultMaven.java:138)
	at org.apache.maven.cli.MavenCli.main(MavenCli.java:362)
	at sun.reflect.NativeMethodAccessorImpl.invoke0(Native Method)
	at sun.reflect.NativeMethodAccessorImpl.invoke(NativeMethodAccessorImpl.java:39)
	at sun.reflect.DelegatingMethodAccessorImpl.invoke(DelegatingMethodAccessorImpl.java:25)
	at java.lang.reflect.Method.invoke(Method.java:592)
	at org.codehaus.classworlds.Launcher.launchEnhanced(Launcher.java:315)
	at org.codehaus.classworlds.Launcher.launch(Launcher.java:255)
	at hudson.maven.agent.Main.launch(Main.java:165)
	at hudson.maven.MavenBuilder.call(MavenBuilder.java:159)
	at hudson.maven.MavenModuleSetBuild$Builder.call(MavenModuleSetBuild.java:688)
	at hudson.maven.MavenModuleSetBuild$Builder.call(MavenModuleSetBuild.java:632)
	at hudson.remoting.UserRequest.perform(UserRequest.java:104)
	at hudson.remoting.UserRequest.perform(UserRequest.java:48)
	at hudson.remoting.Request$2.run(Request.java:236)
	at java.util.concurrent.Executors$RunnableAdapter.call(Executors.java:417)
	at java.util.concurrent.FutureTask$Sync.innerRun(FutureTask.java:269)
	at java.util.concurrent.FutureTask.run(FutureTask.java:123)
	at java.util.concurrent.ThreadPoolExecutor$Worker.runTask(ThreadPoolExecutor.java:651)
	at java.util.concurrent.ThreadPoolExecutor$Worker.run(ThreadPoolExecutor.java:676)
	at java.lang.Thread.run(Thread.java:595)
Caused by: org.apache.maven.plugin.MojoExecutionException: Error while executing forked tests.;
nested exception is org.apache.maven.surefire.booter.shade.org.codehaus.plexus.util.cli.CommandLineException:
Error while executing external command, process killed.
	at org.apache.maven.plugin.surefire.SurefirePlugin.execute(SurefirePlugin.java:541)
	at org.apache.maven.plugin.DefaultPluginManager.executeMojo(DefaultPluginManager.java:490)
	at hudson.maven.agent.PluginManagerInterceptor.executeMojo(PluginManagerInterceptor.java:182)
	at org.apache.maven.lifecycle.DefaultLifecycleExecutor.executeGoals(DefaultLifecycleExecutor.java:694)
	... 28 more
Caused by: org.apache.maven.surefire.booter.SurefireBooterForkException: Error while executing
forked tests.; nested exception is org.apache.maven.surefire.booter.shade.org.codehaus.plexus.util.cli.CommandLineException:
Error while executing external command, process killed.
	at org.apache.maven.surefire.booter.SurefireBooter.fork(SurefireBooter.java:677)
	at org.apache.maven.surefire.booter.SurefireBooter.forkSuite(SurefireBooter.java:493)
	at org.apache.maven.surefire.booter.SurefireBooter.runSuitesForkPerTestSet(SurefireBooter.java:412)
	at org.apache.maven.surefire.booter.SurefireBooter.run(SurefireBooter.java:249)
	at org.apache.maven.plugin.surefire.SurefirePlugin.execute(SurefirePlugin.java:537)
	... 31 more
Caused by: org.apache.maven.surefire.booter.shade.org.codehaus.plexus.util.cli.CommandLineException:
Error while executing external command, process killed.
	at org.apache.maven.surefire.booter.shade.org.codehaus.plexus.util.cli.CommandLineUtils.executeCommandLine(CommandLineUtils.java:198)
	at org.apache.maven.surefire.booter.shade.org.codehaus.plexus.util.cli.CommandLineUtils.executeCommandLine(CommandLineUtils.java:98)
	at org.apache.maven.surefire.booter.SurefireBooter.fork(SurefireBooter.java:673)
	... 35 more
Caused by: java.lang.InterruptedException: Process timeout out after 90 seconds
	at org.apache.maven.surefire.booter.shade.org.codehaus.plexus.util.cli.CommandLineUtils.executeCommandLine(CommandLineUtils.java:159)
	... 37 more
[INFO] ------------------------------------------------------------------------
[INFO] Error for project: ServiceMix :: Mail (during install)
[INFO] ------------------------------------------------------------------------
[INFO] Failed to resolve artifact.

GroupId: com.sun.mail
ArtifactId: all
Version: 1.4.3

Reason: Unable to download the artifact from any repository

  com.sun.mail:all:pom:1.4.3

from the specified remote repositories:
  central (http://repo1.maven.org/maven2),
  servicemix.m2 (http://svn.apache.org/repos/asf/servicemix/m2-repo/),
  codehaus (http://repository.codehaus.org),
  apache.snapshots (http://repository.apache.org/snapshots),
  apache.incubating (http://people.apache.org/repo/m2-incubating-repository)



[INFO] ------------------------------------------------------------------------
[INFO] Trace
org.apache.maven.lifecycle.LifecycleExecutionException: Unable to get dependency information:
Unable to read the metadata file for artifact 'javax.mail:mail:jar': Cannot find parent: com.sun.mail:all
for project: javax.mail:mail:jar:null for project javax.mail:mail:jar:null
  javax.mail:mail:jar:1.4.3

from the specified remote repositories:
  central (http://repo1.maven.org/maven2),
  servicemix.m2 (http://svn.apache.org/repos/asf/servicemix/m2-repo/),
  codehaus (http://repository.codehaus.org),
  apache.snapshots (http://repository.apache.org/snapshots),
  apache.incubating (http://people.apache.org/repo/m2-incubating-repository)

Path to dependency: 
	1) org.apache.servicemix:servicemix-mail:jbi-component:2010.01-SNAPSHOT


	at org.apache.maven.lifecycle.DefaultLifecycleExecutor.executeGoals(DefaultLifecycleExecutor.java:711)
	at org.apache.maven.lifecycle.DefaultLifecycleExecutor.executeGoalWithLifecycle(DefaultLifecycleExecutor.java:556)
	at org.apache.maven.lifecycle.DefaultLifecycleExecutor.executeGoal(DefaultLifecycleExecutor.java:535)
	at org.apache.maven.lifecycle.DefaultLifecycleExecutor.executeGoalAndHandleFailures(DefaultLifecycleExecutor.java:387)
	at org.apache.maven.lifecycle.DefaultLifecycleExecutor.executeTaskSegments(DefaultLifecycleExecutor.java:348)
	at org.apache.maven.lifecycle.DefaultLifecycleExecutor.execute(DefaultLifecycleExecutor.java:180)
	at org.apache.maven.lifecycle.LifecycleExecutorInterceptor.execute(LifecycleExecutorInterceptor.java:65)
	at org.apache.maven.DefaultMaven.doExecute(DefaultMaven.java:328)
	at org.apache.maven.DefaultMaven.execute(DefaultMaven.java:138)
	at org.apache.maven.cli.MavenCli.main(MavenCli.java:362)
	at sun.reflect.NativeMethodAccessorImpl.invoke0(Native Method)
	at sun.reflect.NativeMethodAccessorImpl.invoke(NativeMethodAccessorImpl.java:39)
	at sun.reflect.DelegatingMethodAccessorImpl.invoke(DelegatingMethodAccessorImpl.java:25)
	at java.lang.reflect.Method.invoke(Method.java:592)
	at org.codehaus.classworlds.Launcher.launchEnhanced(Launcher.java:315)
	at org.codehaus.classworlds.Launcher.launch(Launcher.java:255)
	at hudson.maven.agent.Main.launch(Main.java:165)
	at hudson.maven.MavenBuilder.call(MavenBuilder.java:159)
	at hudson.maven.MavenModuleSetBuild$Builder.call(MavenModuleSetBuild.java:688)
	at hudson.maven.MavenModuleSetBuild$Builder.call(MavenModuleSetBuild.java:632)
	at hudson.remoting.UserRequest.perform(UserRequest.java:104)
	at hudson.remoting.UserRequest.perform(UserRequest.java:48)
	at hudson.remoting.Request$2.run(Request.java:236)
	at java.util.concurrent.Executors$RunnableAdapter.call(Executors.java:417)
	at java.util.concurrent.FutureTask$Sync.innerRun(FutureTask.java:269)
	at java.util.concurrent.FutureTask.run(FutureTask.java:123)
	at java.util.concurrent.ThreadPoolExecutor$Worker.runTask(ThreadPoolExecutor.java:651)
	at java.util.concurrent.ThreadPoolExecutor$Worker.run(ThreadPoolExecutor.java:676)
	at java.lang.Thread.run(Thread.java:595)
Caused by: org.apache.maven.artifact.resolver.ArtifactResolutionException: Unable to get dependency
information: Unable to read the metadata file for artifact 'javax.mail:mail:jar': Cannot find
parent: com.sun.mail:all for project: javax.mail:mail:jar:null for project javax.mail:mail:jar:null
  javax.mail:mail:jar:1.4.3

from the specified remote repositories:
  central (http://repo1.maven.org/maven2),
  servicemix.m2 (http://svn.apache.org/repos/asf/servicemix/m2-repo/),
  codehaus (http://repository.codehaus.org),
  apache.snapshots (http://repository.apache.org/snapshots),
  apache.incubating (http://people.apache.org/repo/m2-incubating-repository)

Path to dependency: 
	1) org.apache.servicemix:servicemix-mail:jbi-component:2010.01-SNAPSHOT


	at org.apache.maven.artifact.resolver.DefaultArtifactCollector.recurse(DefaultArtifactCollector.java:430)
	at org.apache.maven.artifact.resolver.DefaultArtifactCollector.collect(DefaultArtifactCollector.java:74)
	at org.apache.maven.artifact.resolver.DefaultArtifactResolver.resolveTransitively(DefaultArtifactResolver.java:316)
	at org.apache.maven.artifact.resolver.DefaultArtifactResolver.resolveTransitively(DefaultArtifactResolver.java:304)
	at org.apache.maven.plugin.DefaultPluginManager.resolveTransitiveDependencies(DefaultPluginManager.java:1499)
	at org.apache.maven.plugin.DefaultPluginManager.executeMojo(DefaultPluginManager.java:442)
	at hudson.maven.agent.PluginManagerInterceptor.executeMojo(PluginManagerInterceptor.java:182)
	at org.apache.maven.lifecycle.DefaultLifecycleExecutor.executeGoals(DefaultLifecycleExecutor.java:694)
	... 28 more
Caused by: org.apache.maven.artifact.metadata.ArtifactMetadataRetrievalException: Unable to
read the metadata file for artifact 'javax.mail:mail:jar': Cannot find parent: com.sun.mail:all
for project: javax.mail:mail:jar:null for project javax.mail:mail:jar:null
	at org.apache.maven.project.artifact.MavenMetadataSource.retrieveRelocatedProject(MavenMetadataSource.java:200)
	at org.apache.maven.project.artifact.MavenMetadataSource.retrieveRelocatedArtifact(MavenMetadataSource.java:94)
	at org.apache.maven.artifact.resolver.DefaultArtifactCollector.recurse(DefaultArtifactCollector.java:387)
	... 35 more
Caused by: org.apache.maven.project.ProjectBuildingException: Cannot find parent: com.sun.mail:all
for project: javax.mail:mail:jar:null for project javax.mail:mail:jar:null
	at org.apache.maven.project.DefaultMavenProjectBuilder.assembleLineage(DefaultMavenProjectBuilder.java:1396)
	at org.apache.maven.project.DefaultMavenProjectBuilder.buildInternal(DefaultMavenProjectBuilder.java:823)
	at org.apache.maven.project.DefaultMavenProjectBuilder.buildFromRepository(DefaultMavenProjectBuilder.java:255)
	at org.apache.maven.project.artifact.MavenMetadataSource.retrieveRelocatedProject(MavenMetadataSource.java:163)
	... 37 more
Caused by: org.apache.maven.project.ProjectBuildingException: POM 'com.sun.mail:all' not found
in repository: Unable to download the artifact from any repository

  com.sun.mail:all:pom:1.4.3

from the specified remote repositories:
  central (http://repo1.maven.org/maven2),
  servicemix.m2 (http://svn.apache.org/repos/asf/servicemix/m2-repo/),
  codehaus (http://repository.codehaus.org),
  apache.snapshots (http://repository.apache.org/snapshots),
  apache.incubating (http://people.apache.org/repo/m2-incubating-repository)

 for project com.sun.mail:all
	at org.apache.maven.project.DefaultMavenProjectBuilder.findModelFromRepository(DefaultMavenProjectBuilder.java:605)
	at org.apache.maven.project.DefaultMavenProjectBuilder.assembleLineage(DefaultMavenProjectBuilder.java:1392)
	... 40 more
Caused by: org.apache.maven.artifact.resolver.ArtifactNotFoundException: Unable to download
the artifact from any repository

  com.sun.mail:all:pom:1.4.3

from the specified remote repositories:
  central (http://repo1.maven.org/maven2),
  servicemix.m2 (http://svn.apache.org/repos/asf/servicemix/m2-repo/),
  codehaus (http://repository.codehaus.org),
  apache.snapshots (http://repository.apache.org/snapshots),
  apache.incubating (http://people.apache.org/repo/m2-incubating-repository)


	at org.apache.maven.artifact.resolver.DefaultArtifactResolver.resolve(DefaultArtifactResolver.java:228)
	at org.apache.maven.artifact.resolver.DefaultArtifactResolver.resolve(DefaultArtifactResolver.java:90)
	at org.apache.maven.project.DefaultMavenProjectBuilder.findModelFromRepository(DefaultMavenProjectBuilder.java:558)
	... 41 more
Caused by: org.apache.maven.wagon.ResourceDoesNotExistException: Unable to download the artifact
from any repository
	at org.apache.maven.artifact.manager.DefaultWagonManager.getArtifact(DefaultWagonManager.java:404)
	at org.apache.maven.artifact.resolver.DefaultArtifactResolver.resolve(DefaultArtifactResolver.java:216)
	... 43 more
[INFO] ------------------------------------------------------------------------
[INFO] BUILD ERRORS
[INFO] ------------------------------------------------------------------------
[INFO] Total time: 63 minutes 45 seconds
[INFO] Finished at: Thu Mar 04 00:28:00 UTC 2010
[INFO] Final Memory: 106M/162M
[INFO] ------------------------------------------------------------------------
Sending e-mails to: commits@servicemix.apache.org
Sending e-mails to: commits@servicemix.apache.org
Sending e-mails to: commits@servicemix.apache.org
Sending e-mails to: commits@servicemix.apache.org
channel stopped
[locks-and-latches] Releasing all the locks
[locks-and-latches] All the locks released


Mime
View raw message