servicemix-commits mailing list archives

Site index · List index
Message view « Date » · « Thread »
Top « Date » · « Thread »
From Apache Hudson Server <hud...@hudson.zones.apache.org>
Subject Build failed in Hudson: ServiceMix-Features » Apache ServiceMix :: Assembly #208
Date Thu, 04 Mar 2010 01:24:15 GMT
See <http://hudson.zones.apache.org/hudson/job/ServiceMix-Features/org.apache.servicemix$apache-servicemix/208/changes>

Changes:

[jbonofre] Add bundles dependency required for the assembly build.

------------------------------------------
[...truncated 1059 lines...]
      mvn deploy:deploy-file -DgroupId=org.apache.servicemix.bundles -DartifactId=org.apache.servicemix.bundles.commons-pool
-Dversion=${activemq.commons-pool.version} -Dpackaging=jar -Dfile=/path/to/file -Durl=[url]
-DrepositoryId=[id]

  Path to dependency: 
  	1) org.apache.servicemix.examples:org.apache.servicemix.examples.itests.tests:jar:4.1.0-SNAPSHOT
  	2) org.apache.servicemix.bundles:org.apache.servicemix.bundles.commons-pool:jar:${activemq.commons-pool.version}

----------
1 required artifact is missing.

for artifact: 
  org.apache.servicemix.examples:org.apache.servicemix.examples.itests.tests:jar:4.1.0-SNAPSHOT

from the specified remote repositories:
  apache-snapshots (http://repository.apache.org/content/groups/snapshots-group),
  jboss (http://repository.jboss.org/maven2),
  ops4j (http://repository.ops4j.org/maven2),
  codehaus (http://repository.codehaus.org),
  servicemix-repo (http://svn.apache.org/repos/asf/servicemix/m2-repo/),
  central (http://repo1.maven.org/maven2),
  java.net.2 (http://download.java.net/maven/2),
  servicemix.m2 (http://svn.apache.org/repos/asf/servicemix/m2-repo/),
  java.net (http://download.java.net/maven/1/),
  apache.snapshots (http://repository.apache.org/snapshots),
  apache.incubating (http://people.apache.org/repo/m2-incubating-repository),
  servicemix (http://svn.apache.org/repos/asf/servicemix/m2-repo),
  spring-milestone (http://s3.amazonaws.com/maven.springframework.org/milestone)



[INFO] ------------------------------------------------------------------------
[INFO] Trace
org.apache.maven.lifecycle.LifecycleExecutionException: Failed to resolve dependencies for
one or more projects in the reactor. Reason: Missing:
----------
1) org.apache.servicemix.bundles:org.apache.servicemix.bundles.commons-pool:jar:${activemq.commons-pool.version}

  Try downloading the file manually from the project website.

  Then, install it using the command: 
      mvn install:install-file -DgroupId=org.apache.servicemix.bundles -DartifactId=org.apache.servicemix.bundles.commons-pool
-Dversion=${activemq.commons-pool.version} -Dpackaging=jar -Dfile=/path/to/file

  Alternatively, if you host your own repository you can deploy the file there: 
      mvn deploy:deploy-file -DgroupId=org.apache.servicemix.bundles -DartifactId=org.apache.servicemix.bundles.commons-pool
-Dversion=${activemq.commons-pool.version} -Dpackaging=jar -Dfile=/path/to/file -Durl=[url]
-DrepositoryId=[id]

  Path to dependency: 
  	1) org.apache.servicemix.examples:org.apache.servicemix.examples.itests.tests:jar:4.1.0-SNAPSHOT
  	2) org.apache.servicemix.bundles:org.apache.servicemix.bundles.commons-pool:jar:${activemq.commons-pool.version}

----------
1 required artifact is missing.

for artifact: 
  org.apache.servicemix.examples:org.apache.servicemix.examples.itests.tests:jar:4.1.0-SNAPSHOT

from the specified remote repositories:
  apache-snapshots (http://repository.apache.org/content/groups/snapshots-group),
  jboss (http://repository.jboss.org/maven2),
  ops4j (http://repository.ops4j.org/maven2),
  codehaus (http://repository.codehaus.org),
  servicemix-repo (http://svn.apache.org/repos/asf/servicemix/m2-repo/),
  central (http://repo1.maven.org/maven2),
  java.net.2 (http://download.java.net/maven/2),
  servicemix.m2 (http://svn.apache.org/repos/asf/servicemix/m2-repo/),
  java.net (http://download.java.net/maven/1/),
  apache.snapshots (http://repository.apache.org/snapshots),
  apache.incubating (http://people.apache.org/repo/m2-incubating-repository),
  servicemix (http://svn.apache.org/repos/asf/servicemix/m2-repo),
  spring-milestone (http://s3.amazonaws.com/maven.springframework.org/milestone)


	at org.apache.maven.lifecycle.DefaultLifecycleExecutor.executeGoals(DefaultLifecycleExecutor.java:719)
	at org.apache.maven.lifecycle.DefaultLifecycleExecutor.executeGoalWithLifecycle(DefaultLifecycleExecutor.java:556)
	at org.apache.maven.lifecycle.DefaultLifecycleExecutor.executeGoal(DefaultLifecycleExecutor.java:535)
	at org.apache.maven.lifecycle.DefaultLifecycleExecutor.executeGoalAndHandleFailures(DefaultLifecycleExecutor.java:387)
	at org.apache.maven.lifecycle.DefaultLifecycleExecutor.executeTaskSegments(DefaultLifecycleExecutor.java:348)
	at org.apache.maven.lifecycle.DefaultLifecycleExecutor.execute(DefaultLifecycleExecutor.java:180)
	at org.apache.maven.lifecycle.LifecycleExecutorInterceptor.execute(LifecycleExecutorInterceptor.java:65)
	at org.apache.maven.DefaultMaven.doExecute(DefaultMaven.java:328)
	at org.apache.maven.DefaultMaven.execute(DefaultMaven.java:138)
	at org.apache.maven.cli.MavenCli.main(MavenCli.java:362)
	at sun.reflect.NativeMethodAccessorImpl.invoke0(Native Method)
	at sun.reflect.NativeMethodAccessorImpl.invoke(NativeMethodAccessorImpl.java:39)
	at sun.reflect.DelegatingMethodAccessorImpl.invoke(DelegatingMethodAccessorImpl.java:25)
	at java.lang.reflect.Method.invoke(Method.java:592)
	at org.codehaus.classworlds.Launcher.launchEnhanced(Launcher.java:315)
	at org.codehaus.classworlds.Launcher.launch(Launcher.java:255)
	at hudson.maven.agent.Main.launch(Main.java:165)
	at hudson.maven.MavenBuilder.call(MavenBuilder.java:159)
	at hudson.maven.MavenModuleSetBuild$Builder.call(MavenModuleSetBuild.java:688)
	at hudson.maven.MavenModuleSetBuild$Builder.call(MavenModuleSetBuild.java:632)
	at hudson.remoting.UserRequest.perform(UserRequest.java:104)
	at hudson.remoting.UserRequest.perform(UserRequest.java:48)
	at hudson.remoting.Request$2.run(Request.java:236)
	at java.util.concurrent.Executors$RunnableAdapter.call(Executors.java:417)
	at java.util.concurrent.FutureTask$Sync.innerRun(FutureTask.java:269)
	at java.util.concurrent.FutureTask.run(FutureTask.java:123)
	at java.util.concurrent.ThreadPoolExecutor$Worker.runTask(ThreadPoolExecutor.java:651)
	at java.util.concurrent.ThreadPoolExecutor$Worker.run(ThreadPoolExecutor.java:676)
	at java.lang.Thread.run(Thread.java:595)
Caused by: org.apache.maven.plugin.MojoExecutionException: Failed to resolve dependencies
for one or more projects in the reactor. Reason: Missing:
----------
1) org.apache.servicemix.bundles:org.apache.servicemix.bundles.commons-pool:jar:${activemq.commons-pool.version}

  Try downloading the file manually from the project website.

  Then, install it using the command: 
      mvn install:install-file -DgroupId=org.apache.servicemix.bundles -DartifactId=org.apache.servicemix.bundles.commons-pool
-Dversion=${activemq.commons-pool.version} -Dpackaging=jar -Dfile=/path/to/file

  Alternatively, if you host your own repository you can deploy the file there: 
      mvn deploy:deploy-file -DgroupId=org.apache.servicemix.bundles -DartifactId=org.apache.servicemix.bundles.commons-pool
-Dversion=${activemq.commons-pool.version} -Dpackaging=jar -Dfile=/path/to/file -Durl=[url]
-DrepositoryId=[id]

  Path to dependency: 
  	1) org.apache.servicemix.examples:org.apache.servicemix.examples.itests.tests:jar:4.1.0-SNAPSHOT
  	2) org.apache.servicemix.bundles:org.apache.servicemix.bundles.commons-pool:jar:${activemq.commons-pool.version}

----------
1 required artifact is missing.

for artifact: 
  org.apache.servicemix.examples:org.apache.servicemix.examples.itests.tests:jar:4.1.0-SNAPSHOT

from the specified remote repositories:
  apache-snapshots (http://repository.apache.org/content/groups/snapshots-group),
  jboss (http://repository.jboss.org/maven2),
  ops4j (http://repository.ops4j.org/maven2),
  codehaus (http://repository.codehaus.org),
  servicemix-repo (http://svn.apache.org/repos/asf/servicemix/m2-repo/),
  central (http://repo1.maven.org/maven2),
  java.net.2 (http://download.java.net/maven/2),
  servicemix.m2 (http://svn.apache.org/repos/asf/servicemix/m2-repo/),
  java.net (http://download.java.net/maven/1/),
  apache.snapshots (http://repository.apache.org/snapshots),
  apache.incubating (http://people.apache.org/repo/m2-incubating-repository),
  servicemix (http://svn.apache.org/repos/asf/servicemix/m2-repo),
  spring-milestone (http://s3.amazonaws.com/maven.springframework.org/milestone)


	at org.apache.maven.plugin.resources.remote.ProcessRemoteResourcesMojo.resolveProjectArtifacts(ProcessRemoteResourcesMojo.java:702)
	at org.apache.maven.plugin.resources.remote.ProcessRemoteResourcesMojo.getProjects(ProcessRemoteResourcesMojo.java:602)
	at org.apache.maven.plugin.resources.remote.ProcessRemoteResourcesMojo.configureVelocityContext(ProcessRemoteResourcesMojo.java:969)
	at org.apache.maven.plugin.resources.remote.ProcessRemoteResourcesMojo.execute(ProcessRemoteResourcesMojo.java:492)
	at org.apache.maven.plugin.DefaultPluginManager.executeMojo(DefaultPluginManager.java:490)
	at hudson.maven.agent.PluginManagerInterceptor.executeMojo(PluginManagerInterceptor.java:182)
	at org.apache.maven.lifecycle.DefaultLifecycleExecutor.executeGoals(DefaultLifecycleExecutor.java:694)
	... 28 more
Caused by: org.apache.maven.artifact.resolver.MultipleArtifactsNotFoundException: Missing:
----------
1) org.apache.servicemix.bundles:org.apache.servicemix.bundles.commons-pool:jar:${activemq.commons-pool.version}

  Try downloading the file manually from the project website.

  Then, install it using the command: 
      mvn install:install-file -DgroupId=org.apache.servicemix.bundles -DartifactId=org.apache.servicemix.bundles.commons-pool
-Dversion=${activemq.commons-pool.version} -Dpackaging=jar -Dfile=/path/to/file

  Alternatively, if you host your own repository you can deploy the file there: 
      mvn deploy:deploy-file -DgroupId=org.apache.servicemix.bundles -DartifactId=org.apache.servicemix.bundles.commons-pool
-Dversion=${activemq.commons-pool.version} -Dpackaging=jar -Dfile=/path/to/file -Durl=[url]
-DrepositoryId=[id]

  Path to dependency: 
  	1) org.apache.servicemix.examples:org.apache.servicemix.examples.itests.tests:jar:4.1.0-SNAPSHOT
  	2) org.apache.servicemix.bundles:org.apache.servicemix.bundles.commons-pool:jar:${activemq.commons-pool.version}

----------
1 required artifact is missing.

for artifact: 
  org.apache.servicemix.examples:org.apache.servicemix.examples.itests.tests:jar:4.1.0-SNAPSHOT

from the specified remote repositories:
  apache-snapshots (http://repository.apache.org/content/groups/snapshots-group),
  jboss (http://repository.jboss.org/maven2),
  ops4j (http://repository.ops4j.org/maven2),
  codehaus (http://repository.codehaus.org),
  servicemix-repo (http://svn.apache.org/repos/asf/servicemix/m2-repo/),
  central (http://repo1.maven.org/maven2),
  java.net.2 (http://download.java.net/maven/2),
  servicemix.m2 (http://svn.apache.org/repos/asf/servicemix/m2-repo/),
  java.net (http://download.java.net/maven/1/),
  apache.snapshots (http://repository.apache.org/snapshots),
  apache.incubating (http://people.apache.org/repo/m2-incubating-repository),
  servicemix (http://svn.apache.org/repos/asf/servicemix/m2-repo),
  spring-milestone (http://s3.amazonaws.com/maven.springframework.org/milestone)


	at org.apache.maven.artifact.resolver.DefaultArtifactResolver.resolveTransitively(DefaultArtifactResolver.java:360)
	at org.apache.maven.artifact.resolver.DefaultArtifactResolver.resolveTransitively(DefaultArtifactResolver.java:304)
	at org.apache.maven.shared.artifact.resolver.DefaultProjectDependenciesResolver.resolve(DefaultProjectDependenciesResolver.java:140)
	at org.apache.maven.shared.artifact.resolver.DefaultProjectDependenciesResolver.resolve(DefaultProjectDependenciesResolver.java:187)
	at org.apache.maven.plugin.resources.remote.ProcessRemoteResourcesMojo.resolveProjectArtifacts(ProcessRemoteResourcesMojo.java:697)
	... 34 more
[INFO] ------------------------------------------------------------------------
[INFO] Error for project: Apache ServiceMix :: Assembly (during install)
[INFO] ------------------------------------------------------------------------
[INFO] Error populating repository

Embedded error: /home/hudson/hudson-slave/workspace/ServiceMix-Features/.repository/org/apache/servicemix/bundles/org.apache.servicemix.bundles.commons-pool/1.5.4_1/org.apache.servicemix.bundles.commons-pool-1.5.4_1.jar
(No such file or directory)
[INFO] ------------------------------------------------------------------------
[INFO] Trace
org.apache.maven.lifecycle.LifecycleExecutionException: Error populating repository
	at org.apache.maven.lifecycle.DefaultLifecycleExecutor.executeGoals(DefaultLifecycleExecutor.java:719)
	at org.apache.maven.lifecycle.DefaultLifecycleExecutor.executeGoalWithLifecycle(DefaultLifecycleExecutor.java:556)
	at org.apache.maven.lifecycle.DefaultLifecycleExecutor.executeGoal(DefaultLifecycleExecutor.java:535)
	at org.apache.maven.lifecycle.DefaultLifecycleExecutor.executeGoalAndHandleFailures(DefaultLifecycleExecutor.java:387)
	at org.apache.maven.lifecycle.DefaultLifecycleExecutor.executeTaskSegments(DefaultLifecycleExecutor.java:348)
	at org.apache.maven.lifecycle.DefaultLifecycleExecutor.execute(DefaultLifecycleExecutor.java:180)
	at org.apache.maven.lifecycle.LifecycleExecutorInterceptor.execute(LifecycleExecutorInterceptor.java:65)
	at org.apache.maven.DefaultMaven.doExecute(DefaultMaven.java:328)
	at org.apache.maven.DefaultMaven.execute(DefaultMaven.java:138)
	at org.apache.maven.cli.MavenCli.main(MavenCli.java:362)
	at sun.reflect.NativeMethodAccessorImpl.invoke0(Native Method)
	at sun.reflect.NativeMethodAccessorImpl.invoke(NativeMethodAccessorImpl.java:39)
	at sun.reflect.DelegatingMethodAccessorImpl.invoke(DelegatingMethodAccessorImpl.java:25)
	at java.lang.reflect.Method.invoke(Method.java:592)
	at org.codehaus.classworlds.Launcher.launchEnhanced(Launcher.java:315)
	at org.codehaus.classworlds.Launcher.launch(Launcher.java:255)
	at hudson.maven.agent.Main.launch(Main.java:165)
	at hudson.maven.MavenBuilder.call(MavenBuilder.java:159)
	at hudson.maven.MavenModuleSetBuild$Builder.call(MavenModuleSetBuild.java:688)
	at hudson.maven.MavenModuleSetBuild$Builder.call(MavenModuleSetBuild.java:632)
	at hudson.remoting.UserRequest.perform(UserRequest.java:104)
	at hudson.remoting.UserRequest.perform(UserRequest.java:48)
	at hudson.remoting.Request$2.run(Request.java:236)
	at java.util.concurrent.Executors$RunnableAdapter.call(Executors.java:417)
	at java.util.concurrent.FutureTask$Sync.innerRun(FutureTask.java:269)
	at java.util.concurrent.FutureTask.run(FutureTask.java:123)
	at java.util.concurrent.ThreadPoolExecutor$Worker.runTask(ThreadPoolExecutor.java:651)
	at java.util.concurrent.ThreadPoolExecutor$Worker.run(ThreadPoolExecutor.java:676)
	at java.lang.Thread.run(Thread.java:595)
Caused by: org.apache.maven.plugin.MojoExecutionException: Error populating repository
	at org.apache.felix.karaf.tooling.features.AddFeaturesToRepoMojo.execute(AddFeaturesToRepoMojo.java:132)
	at org.apache.maven.plugin.DefaultPluginManager.executeMojo(DefaultPluginManager.java:490)
	at hudson.maven.agent.PluginManagerInterceptor.executeMojo(PluginManagerInterceptor.java:182)
	at org.apache.maven.lifecycle.DefaultLifecycleExecutor.executeGoals(DefaultLifecycleExecutor.java:694)
	... 28 more
Caused by: java.io.FileNotFoundException: /home/hudson/hudson-slave/workspace/ServiceMix-Features/.repository/org/apache/servicemix/bundles/org.apache.servicemix.bundles.commons-pool/1.5.4_1/org.apache.servicemix.bundles.commons-pool-1.5.4_1.jar
(No such file or directory)
	at java.io.FileInputStream.open(Native Method)
	at java.io.FileInputStream.<init>(FileInputStream.java:106)
	at java.io.FileInputStream.<init>(FileInputStream.java:66)
	at sun.net.www.protocol.file.FileURLConnection.connect(FileURLConnection.java:70)
	at sun.net.www.protocol.file.FileURLConnection.getInputStream(FileURLConnection.java:161)
	at java.net.URL.openStream(URL.java:1007)
	at org.apache.felix.karaf.tooling.features.AddFeaturesToRepoMojo.execute(AddFeaturesToRepoMojo.java:120)
	... 31 more
[INFO] ------------------------------------------------------------------------
[INFO] BUILD ERRORS
[INFO] ------------------------------------------------------------------------
[INFO] Total time: 14 minutes 48 seconds
[INFO] Finished at: Thu Mar 04 01:23:53 UTC 2010
[INFO] Final Memory: 144M/207M
[INFO] ------------------------------------------------------------------------
Waiting for Hudson to finish collecting data


Mime
View raw message