servicemix-commits mailing list archives

Site index · List index
Message view « Date » · « Thread »
Top « Date » · « Thread »
From Apache Hudson Server <hud...@hudson.zones.apache.org>
Subject Build failed in Hudson: ServiceMix-Components #340
Date Thu, 27 May 2010 22:45:09 GMT
See <http://hudson.zones.apache.org/hudson/job/ServiceMix-Components/340/changes>

Changes:

[gertv] SMXCOMP-751: Ensure that multiple threads can safely use the JBI endpoint Producer

------------------------------------------
[...truncated 249696 lines...]
[INFO] Installing <http://hudson.zones.apache.org/hudson/job/ServiceMix-Components/ws/components/bindings/servicemix-xmpp/target/servicemix-xmpp-2010.02-SNAPSHOT-installer.zip>
to <http://hudson.zones.apache.org/hudson/job/ServiceMix-Components/ws/.repository/org/apache/servicemix/servicemix-xmpp/2010.02-SNAPSHOT/servicemix-xmpp-2010.02-SNAPSHOT-installer.zip>
[HUDSON] Archiving <http://hudson.zones.apache.org/hudson/job/ServiceMix-Components/ws/components/bindings/servicemix-xmpp/pom.xml>
to /export/home/hudson/hudson/jobs/ServiceMix-Components/modules/org.apache.servicemix$servicemix-xmpp/builds/2010-05-27_21-02-27/archive/org.apache.servicemix/servicemix-xmpp/2010.02-SNAPSHOT/pom.xml
[HUDSON] Archiving <http://hudson.zones.apache.org/hudson/job/ServiceMix-Components/ws/components/bindings/servicemix-xmpp/target/servicemix-xmpp-2010.02-SNAPSHOT.jar>
to /export/home/hudson/hudson/jobs/ServiceMix-Components/modules/org.apache.servicemix$servicemix-xmpp/builds/2010-05-27_21-02-27/archive/org.apache.servicemix/servicemix-xmpp/2010.02-SNAPSHOT/servicemix-xmpp-2010.02-SNAPSHOT.jar
[HUDSON] Archiving <http://hudson.zones.apache.org/hudson/job/ServiceMix-Components/ws/components/bindings/servicemix-xmpp/target/xbean/servicemix-xmpp.xsd>
to /export/home/hudson/hudson/jobs/ServiceMix-Components/modules/org.apache.servicemix$servicemix-xmpp/builds/2010-05-27_21-02-27/archive/org.apache.servicemix/servicemix-xmpp/2010.02-SNAPSHOT/servicemix-xmpp.xsd
[HUDSON] Archiving <http://hudson.zones.apache.org/hudson/job/ServiceMix-Components/ws/components/bindings/servicemix-xmpp/target/xbean/servicemix-xmpp.xsd.html>
to /export/home/hudson/hudson/jobs/ServiceMix-Components/modules/org.apache.servicemix$servicemix-xmpp/builds/2010-05-27_21-02-27/archive/org.apache.servicemix/servicemix-xmpp/2010.02-SNAPSHOT/servicemix-xmpp.xsd.html
[HUDSON] Archiving <http://hudson.zones.apache.org/hudson/job/ServiceMix-Components/ws/components/bindings/servicemix-xmpp/target/servicemix-xmpp-2010.02-SNAPSHOT-installer.zip>
to /export/home/hudson/hudson/jobs/ServiceMix-Components/modules/org.apache.servicemix$servicemix-xmpp/builds/2010-05-27_21-02-27/archive/org.apache.servicemix/servicemix-xmpp/2010.02-SNAPSHOT/servicemix-xmpp-2010.02-SNAPSHOT-installer.zip
[INFO] ------------------------------------------------------------------------
[INFO] Building Apache ServiceMix All Components POM
[INFO]    task-segment: [clean, install]
[INFO] ------------------------------------------------------------------------
[INFO] [clean:clean {execution: default-clean}]
[INFO] Deleting file set: <http://hudson.zones.apache.org/hudson/job/ServiceMix-Components/ws/components/target>
(included: [**], excluded: [])
[INFO] [remote-resources:process {execution: default}]
[INFO] [site:attach-descriptor {execution: default-attach-descriptor}]
[INFO] [install:install {execution: default-install}]
[INFO] Installing <http://hudson.zones.apache.org/hudson/job/ServiceMix-Components/ws/components/pom.xml>
to <http://hudson.zones.apache.org/hudson/job/ServiceMix-Components/ws/.repository/org/apache/servicemix/all-components/1.0-SNAPSHOT/all-components-1.0-SNAPSHOT.pom>
[HUDSON] Archiving <http://hudson.zones.apache.org/hudson/job/ServiceMix-Components/ws/components/pom.xml>
to /export/home/hudson/hudson/jobs/ServiceMix-Components/modules/org.apache.servicemix$all-components/builds/2010-05-27_21-02-25/archive/org.apache.servicemix/all-components/1.0-SNAPSHOT/pom.xml
[HUDSON] Archiving <http://hudson.zones.apache.org/hudson/job/ServiceMix-Components/ws/.repository/org/apache/servicemix/all-components/1.0-SNAPSHOT/all-components-1.0-SNAPSHOT.pom>
to /export/home/hudson/hudson/jobs/ServiceMix-Components/modules/org.apache.servicemix$all-components/builds/2010-05-27_21-02-25/archive/org.apache.servicemix/all-components/1.0-SNAPSHOT/all-components-1.0-SNAPSHOT.pom
[INFO] 
[INFO] 
[INFO] ------------------------------------------------------------------------
[INFO] Reactor Summary:
[INFO] ------------------------------------------------------------------------
[INFO] ServiceMix :: Components POM .......................... SUCCESS [11.187s]
[INFO] ServiceMix :: Shared Libraries ........................ SUCCESS [0.262s]
[INFO] ServiceMix :: Common .................................. SUCCESS [20.657s]
[INFO] ServiceMix :: SOAP .................................... SUCCESS [7.129s]
[INFO] ServiceMix :: SOAP2 ................................... SUCCESS [9.139s]
[INFO] ServiceMix :: Shared .................................. SUCCESS [16.244s]
[INFO] ServiceMix :: Bean .................................... FAILED [20.009s]
[INFO] ServiceMix :: Camel ................................... SUCCESS [1:14.973s]
[INFO] ServiceMix :: CXF Service Engine ...................... SUCCESS [1:06.140s]
[INFO] ServiceMix :: Drools Service Engine ................... SUCCESS [21.951s]
[INFO] ServiceMix :: EIP ..................................... SUCCESS [23:20.230s]
[INFO] ServiceMix :: Exec .................................... SUCCESS [24.530s]
[INFO] ServiceMix :: JSR-181 Service Engine .................. SUCCESS [23.770s]
[INFO] ServiceMix :: OSWorkflow .............................. SUCCESS [20.587s]
[INFO] ServiceMix :: Quartz .................................. SUCCESS [24.676s]
[INFO] ServiceMix :: Saxon Service Engine .................... SUCCESS [22.113s]
[INFO] ServiceMix :: Scripting Service Engine ................ SUCCESS [22.197s]
[INFO] ServiceMix :: JSR-223 Scripting Service Engine ........ SUCCESS [25.945s]
[INFO] ServiceMix :: Validation .............................. SUCCESS [20.440s]
[INFO] ServiceMix :: WS-Notification Service Engine .......... SUCCESS [14:33.780s]
[INFO] ServiceMix :: CXF Binding Component ................... SUCCESS [36:07.379s]
[INFO] ServiceMix :: File .................................... SUCCESS [45.184s]
[INFO] ServiceMix :: FTP ..................................... FAILED [15.392s]
[INFO] ServiceMix :: HTTP .................................... SUCCESS [54.521s]
[INFO] ServiceMix :: JMS ..................................... FAILED [3:09.983s]
[INFO] ServiceMix :: Mail .................................... SUCCESS [23.202s]
[INFO] ServiceMix :: SMPP .................................... SUCCESS [26.211s]
[INFO] ServiceMix :: SNMP .................................... SUCCESS [30.386s]
[INFO] ServiceMix :: TrueZIP ................................. SUCCESS [23.538s]
[INFO] ServiceMix :: VFS ..................................... SUCCESS [22.251s]
[INFO] ServiceMix :: XMPP .................................... SUCCESS [20.066s]
[INFO] Apache ServiceMix All Components POM .................. SUCCESS [0.166s]
[INFO] ------------------------------------------------------------------------
[INFO] Error for project: ServiceMix :: Bean (during install)
[INFO] ------------------------------------------------------------------------
[INFO] Compilation failure

<http://hudson.zones.apache.org/hudson/job/ServiceMix-Components/ws/components/engines/servicemix-bean/src/test/java/org/apache/servicemix/bean/support/ResolverUtilTest.java>:[19,42]
package org.apache.camel.util.ResolverUtil does not exist

<http://hudson.zones.apache.org/hudson/job/ServiceMix-Components/ws/components/engines/servicemix-bean/src/test/java/org/apache/servicemix/bean/support/ResolverUtilTest.java>:[35,8]
cannot find symbol
symbol  : class IsA
location: class org.apache.servicemix.bean.support.ResolverUtilTest

<http://hudson.zones.apache.org/hudson/job/ServiceMix-Components/ws/components/engines/servicemix-bean/src/test/java/org/apache/servicemix/bean/support/ResolverUtilTest.java>:[35,23]
cannot find symbol
symbol  : class IsA
location: class org.apache.servicemix.bean.support.ResolverUtilTest


[INFO] ------------------------------------------------------------------------
[INFO] Trace
org.apache.maven.BuildFailureException: Compilation failure
	at org.apache.maven.lifecycle.DefaultLifecycleExecutor.executeGoals(DefaultLifecycleExecutor.java:715)
	at org.apache.maven.lifecycle.DefaultLifecycleExecutor.executeGoalWithLifecycle(DefaultLifecycleExecutor.java:556)
	at org.apache.maven.lifecycle.DefaultLifecycleExecutor.executeGoal(DefaultLifecycleExecutor.java:535)
	at org.apache.maven.lifecycle.DefaultLifecycleExecutor.executeGoalAndHandleFailures(DefaultLifecycleExecutor.java:387)
	at org.apache.maven.lifecycle.DefaultLifecycleExecutor.executeTaskSegments(DefaultLifecycleExecutor.java:348)
	at org.apache.maven.lifecycle.DefaultLifecycleExecutor.execute(DefaultLifecycleExecutor.java:180)
	at org.apache.maven.lifecycle.LifecycleExecutorInterceptor.execute(LifecycleExecutorInterceptor.java:65)
	at org.apache.maven.DefaultMaven.doExecute(DefaultMaven.java:328)
	at org.apache.maven.DefaultMaven.execute(DefaultMaven.java:138)
	at org.apache.maven.cli.MavenCli.main(MavenCli.java:362)
	at sun.reflect.NativeMethodAccessorImpl.invoke0(Native Method)
	at sun.reflect.NativeMethodAccessorImpl.invoke(NativeMethodAccessorImpl.java:39)
	at sun.reflect.DelegatingMethodAccessorImpl.invoke(DelegatingMethodAccessorImpl.java:25)
	at java.lang.reflect.Method.invoke(Method.java:592)
	at org.codehaus.classworlds.Launcher.launchEnhanced(Launcher.java:315)
	at org.codehaus.classworlds.Launcher.launch(Launcher.java:255)
	at hudson.maven.agent.Main.launch(Main.java:165)
	at hudson.maven.MavenBuilder.call(MavenBuilder.java:159)
	at hudson.maven.MavenModuleSetBuild$Builder.call(MavenModuleSetBuild.java:688)
	at hudson.maven.MavenModuleSetBuild$Builder.call(MavenModuleSetBuild.java:632)
	at hudson.remoting.UserRequest.perform(UserRequest.java:114)
	at hudson.remoting.UserRequest.perform(UserRequest.java:48)
	at hudson.remoting.Request$2.run(Request.java:270)
	at java.util.concurrent.Executors$RunnableAdapter.call(Executors.java:417)
	at java.util.concurrent.FutureTask$Sync.innerRun(FutureTask.java:269)
	at java.util.concurrent.FutureTask.run(FutureTask.java:123)
	at java.util.concurrent.ThreadPoolExecutor$Worker.runTask(ThreadPoolExecutor.java:651)
	at java.util.concurrent.ThreadPoolExecutor$Worker.run(ThreadPoolExecutor.java:676)
	at java.lang.Thread.run(Thread.java:595)
Caused by: org.apache.maven.plugin.CompilationFailureException: Compilation failure
	at org.apache.maven.plugin.AbstractCompilerMojo.execute(AbstractCompilerMojo.java:516)
	at org.apache.maven.plugin.TestCompilerMojo.execute(TestCompilerMojo.java:102)
	at org.apache.maven.plugin.DefaultPluginManager.executeMojo(DefaultPluginManager.java:490)
	at hudson.maven.agent.PluginManagerInterceptor.executeMojo(PluginManagerInterceptor.java:182)
	at org.apache.maven.lifecycle.DefaultLifecycleExecutor.executeGoals(DefaultLifecycleExecutor.java:694)
	... 28 more
[INFO] ------------------------------------------------------------------------
[INFO] Error for project: ServiceMix :: FTP (during install)
[INFO] ------------------------------------------------------------------------
[INFO] Compilation failure

<http://hudson.zones.apache.org/hudson/job/ServiceMix-Components/ws/components/bindings/servicemix-ftp/src/test/java/org/apache/servicemix/ftp/AbstractFtpTestSupport.java>:[51,43]
package edu.emory.mathcs.backport.java.util does not exist

<http://hudson.zones.apache.org/hudson/job/ServiceMix-Components/ws/components/bindings/servicemix-ftp/src/test/java/org/apache/servicemix/ftp/AbstractFtpTestSupport.java>:[213,52]
cannot find symbol
symbol  : variable Arrays
location: class org.apache.servicemix.ftp.AbstractFtpTestSupport

<http://hudson.zones.apache.org/hudson/job/ServiceMix-Components/ws/components/bindings/servicemix-ftp/src/test/java/org/apache/servicemix/ftp/AbstractFtpTestSupport.java>:[218,41]
cannot find symbol
symbol  : variable Arrays
location: class org.apache.servicemix.ftp.AbstractFtpTestSupport

<http://hudson.zones.apache.org/hudson/job/ServiceMix-Components/ws/components/bindings/servicemix-ftp/src/test/java/org/apache/servicemix/ftp/AbstractFtpTestSupport.java>:[219,34]
cannot find symbol
symbol  : variable Arrays
location: class org.apache.servicemix.ftp.AbstractFtpTestSupport

<http://hudson.zones.apache.org/hudson/job/ServiceMix-Components/ws/components/bindings/servicemix-ftp/src/test/java/org/apache/servicemix/ftp/AbstractFtpTestSupport.java>:[219,59]
cannot find symbol
symbol  : variable Arrays
location: class org.apache.servicemix.ftp.AbstractFtpTestSupport


[INFO] ------------------------------------------------------------------------
[INFO] Trace
org.apache.maven.BuildFailureException: Compilation failure
	at org.apache.maven.lifecycle.DefaultLifecycleExecutor.executeGoals(DefaultLifecycleExecutor.java:715)
	at org.apache.maven.lifecycle.DefaultLifecycleExecutor.executeGoalWithLifecycle(DefaultLifecycleExecutor.java:556)
	at org.apache.maven.lifecycle.DefaultLifecycleExecutor.executeGoal(DefaultLifecycleExecutor.java:535)
	at org.apache.maven.lifecycle.DefaultLifecycleExecutor.executeGoalAndHandleFailures(DefaultLifecycleExecutor.java:387)
	at org.apache.maven.lifecycle.DefaultLifecycleExecutor.executeTaskSegments(DefaultLifecycleExecutor.java:348)
	at org.apache.maven.lifecycle.DefaultLifecycleExecutor.execute(DefaultLifecycleExecutor.java:180)
	at org.apache.maven.lifecycle.LifecycleExecutorInterceptor.execute(LifecycleExecutorInterceptor.java:65)
	at org.apache.maven.DefaultMaven.doExecute(DefaultMaven.java:328)
	at org.apache.maven.DefaultMaven.execute(DefaultMaven.java:138)
	at org.apache.maven.cli.MavenCli.main(MavenCli.java:362)
	at sun.reflect.NativeMethodAccessorImpl.invoke0(Native Method)
	at sun.reflect.NativeMethodAccessorImpl.invoke(NativeMethodAccessorImpl.java:39)
	at sun.reflect.DelegatingMethodAccessorImpl.invoke(DelegatingMethodAccessorImpl.java:25)
	at java.lang.reflect.Method.invoke(Method.java:592)
	at org.codehaus.classworlds.Launcher.launchEnhanced(Launcher.java:315)
	at org.codehaus.classworlds.Launcher.launch(Launcher.java:255)
	at hudson.maven.agent.Main.launch(Main.java:165)
	at hudson.maven.MavenBuilder.call(MavenBuilder.java:159)
	at hudson.maven.MavenModuleSetBuild$Builder.call(MavenModuleSetBuild.java:688)
	at hudson.maven.MavenModuleSetBuild$Builder.call(MavenModuleSetBuild.java:632)
	at hudson.remoting.UserRequest.perform(UserRequest.java:114)
	at hudson.remoting.UserRequest.perform(UserRequest.java:48)
	at hudson.remoting.Request$2.run(Request.java:270)
	at java.util.concurrent.Executors$RunnableAdapter.call(Executors.java:417)
	at java.util.concurrent.FutureTask$Sync.innerRun(FutureTask.java:269)
	at java.util.concurrent.FutureTask.run(FutureTask.java:123)
	at java.util.concurrent.ThreadPoolExecutor$Worker.runTask(ThreadPoolExecutor.java:651)
	at java.util.concurrent.ThreadPoolExecutor$Worker.run(ThreadPoolExecutor.java:676)
	at java.lang.Thread.run(Thread.java:595)
Caused by: org.apache.maven.plugin.CompilationFailureException: Compilation failure
	at org.apache.maven.plugin.AbstractCompilerMojo.execute(AbstractCompilerMojo.java:516)
	at org.apache.maven.plugin.TestCompilerMojo.execute(TestCompilerMojo.java:102)
	at org.apache.maven.plugin.DefaultPluginManager.executeMojo(DefaultPluginManager.java:490)
	at hudson.maven.agent.PluginManagerInterceptor.executeMojo(PluginManagerInterceptor.java:182)
	at org.apache.maven.lifecycle.DefaultLifecycleExecutor.executeGoals(DefaultLifecycleExecutor.java:694)
	... 28 more
[INFO] ------------------------------------------------------------------------
[INFO] Error for project: ServiceMix :: JMS (during install)
[INFO] ------------------------------------------------------------------------
[INFO] Error while executing forked tests.; nested exception is org.apache.maven.surefire.booter.shade.org.codehaus.plexus.util.cli.CommandLineException:
Error while executing external command, process killed.

Process timeout out after 90 seconds
[INFO] ------------------------------------------------------------------------
[INFO] Trace
org.apache.maven.lifecycle.LifecycleExecutionException: Error while executing forked tests.;
nested exception is org.apache.maven.surefire.booter.shade.org.codehaus.plexus.util.cli.CommandLineException:
Error while executing external command, process killed.
	at org.apache.maven.lifecycle.DefaultLifecycleExecutor.executeGoals(DefaultLifecycleExecutor.java:719)
	at org.apache.maven.lifecycle.DefaultLifecycleExecutor.executeGoalWithLifecycle(DefaultLifecycleExecutor.java:556)
	at org.apache.maven.lifecycle.DefaultLifecycleExecutor.executeGoal(DefaultLifecycleExecutor.java:535)
	at org.apache.maven.lifecycle.DefaultLifecycleExecutor.executeGoalAndHandleFailures(DefaultLifecycleExecutor.java:387)
	at org.apache.maven.lifecycle.DefaultLifecycleExecutor.executeTaskSegments(DefaultLifecycleExecutor.java:348)
	at org.apache.maven.lifecycle.DefaultLifecycleExecutor.execute(DefaultLifecycleExecutor.java:180)
	at org.apache.maven.lifecycle.LifecycleExecutorInterceptor.execute(LifecycleExecutorInterceptor.java:65)
	at org.apache.maven.DefaultMaven.doExecute(DefaultMaven.java:328)
	at org.apache.maven.DefaultMaven.execute(DefaultMaven.java:138)
	at org.apache.maven.cli.MavenCli.main(MavenCli.java:362)
	at sun.reflect.NativeMethodAccessorImpl.invoke0(Native Method)
	at sun.reflect.NativeMethodAccessorImpl.invoke(NativeMethodAccessorImpl.java:39)
	at sun.reflect.DelegatingMethodAccessorImpl.invoke(DelegatingMethodAccessorImpl.java:25)
	at java.lang.reflect.Method.invoke(Method.java:592)
	at org.codehaus.classworlds.Launcher.launchEnhanced(Launcher.java:315)
	at org.codehaus.classworlds.Launcher.launch(Launcher.java:255)
	at hudson.maven.agent.Main.launch(Main.java:165)
	at hudson.maven.MavenBuilder.call(MavenBuilder.java:159)
	at hudson.maven.MavenModuleSetBuild$Builder.call(MavenModuleSetBuild.java:688)
	at hudson.maven.MavenModuleSetBuild$Builder.call(MavenModuleSetBuild.java:632)
	at hudson.remoting.UserRequest.perform(UserRequest.java:114)
	at hudson.remoting.UserRequest.perform(UserRequest.java:48)
	at hudson.remoting.Request$2.run(Request.java:270)
	at java.util.concurrent.Executors$RunnableAdapter.call(Executors.java:417)
	at java.util.concurrent.FutureTask$Sync.innerRun(FutureTask.java:269)
	at java.util.concurrent.FutureTask.run(FutureTask.java:123)
	at java.util.concurrent.ThreadPoolExecutor$Worker.runTask(ThreadPoolExecutor.java:651)
	at java.util.concurrent.ThreadPoolExecutor$Worker.run(ThreadPoolExecutor.java:676)
	at java.lang.Thread.run(Thread.java:595)
Caused by: org.apache.maven.plugin.MojoExecutionException: Error while executing forked tests.;
nested exception is org.apache.maven.surefire.booter.shade.org.codehaus.plexus.util.cli.CommandLineException:
Error while executing external command, process killed.
	at org.apache.maven.plugin.surefire.SurefirePlugin.execute(SurefirePlugin.java:541)
	at org.apache.maven.plugin.DefaultPluginManager.executeMojo(DefaultPluginManager.java:490)
	at hudson.maven.agent.PluginManagerInterceptor.executeMojo(PluginManagerInterceptor.java:182)
	at org.apache.maven.lifecycle.DefaultLifecycleExecutor.executeGoals(DefaultLifecycleExecutor.java:694)
	... 28 more
Caused by: org.apache.maven.surefire.booter.SurefireBooterForkException: Error while executing
forked tests.; nested exception is org.apache.maven.surefire.booter.shade.org.codehaus.plexus.util.cli.CommandLineException:
Error while executing external command, process killed.
	at org.apache.maven.surefire.booter.SurefireBooter.fork(SurefireBooter.java:677)
	at org.apache.maven.surefire.booter.SurefireBooter.forkSuite(SurefireBooter.java:493)
	at org.apache.maven.surefire.booter.SurefireBooter.runSuitesForkPerTestSet(SurefireBooter.java:412)
	at org.apache.maven.surefire.booter.SurefireBooter.run(SurefireBooter.java:249)
	at org.apache.maven.plugin.surefire.SurefirePlugin.execute(SurefirePlugin.java:537)
	... 31 more
Caused by: org.apache.maven.surefire.booter.shade.org.codehaus.plexus.util.cli.CommandLineException:
Error while executing external command, process killed.
	at org.apache.maven.surefire.booter.shade.org.codehaus.plexus.util.cli.CommandLineUtils.executeCommandLine(CommandLineUtils.java:198)
	at org.apache.maven.surefire.booter.shade.org.codehaus.plexus.util.cli.CommandLineUtils.executeCommandLine(CommandLineUtils.java:98)
	at org.apache.maven.surefire.booter.SurefireBooter.fork(SurefireBooter.java:673)
	... 35 more
Caused by: java.lang.InterruptedException: Process timeout out after 90 seconds
	at org.apache.maven.surefire.booter.shade.org.codehaus.plexus.util.cli.CommandLineUtils.executeCommandLine(CommandLineUtils.java:159)
	... 37 more
[INFO] ------------------------------------------------------------------------
[INFO] BUILD ERRORS
[INFO] ------------------------------------------------------------------------
[INFO] Total time: 101 minutes 36 seconds
[INFO] Finished at: Thu May 27 22:44:11 UTC 2010
[INFO] Final Memory: 119M/216M
[INFO] ------------------------------------------------------------------------
Waiting for Hudson to finish collecting data
Sending e-mails to: commits@servicemix.apache.org
Sending e-mails to: commits@servicemix.apache.org
Sending e-mails to: commits@servicemix.apache.org
Sending e-mails to: commits@servicemix.apache.org
Sending e-mails to: commits@servicemix.apache.org
Sending e-mails to: commits@servicemix.apache.org
channel stopped
[locks-and-latches] Releasing all the locks
[locks-and-latches] All the locks released


Mime
View raw message