servicemix-commits mailing list archives

Site index · List index
Message view « Date » · « Thread »
Top « Date » · « Thread »
From Apache Hudson Server <hud...@hudson.zones.apache.org>
Subject Build failed in Hudson: ServiceMix-Plugins #23
Date Mon, 03 May 2010 08:25:42 GMT
See <http://hudson.zones.apache.org/hudson/job/ServiceMix-Plugins/23/changes>

Changes:

[gertv] Adding the docs-maven-plugin to the plugins build

------------------------------------------
[...truncated 105 lines...]
[INFO] Building Servicemix :: Build
[INFO]    task-segment: [clean, install]
[INFO] ------------------------------------------------------------------------
[INFO] [clean:clean {execution: default-clean}]
[INFO] Deleting file set: <http://hudson.zones.apache.org/hudson/job/ServiceMix-Plugins/ws/smx-plugins/servicemix-build/target>
(included: [**], excluded: [])
[INFO] [plugin:descriptor {execution: default-descriptor}]
[INFO] Using 'UTF-8' encoding to read mojo metadata.
[INFO] Applying mojo extractor for language: java
[INFO] Mojo extractor for language: java found 2 mojo descriptors.
[INFO] Applying mojo extractor for language: bsh
[INFO] Mojo extractor for language: bsh found 0 mojo descriptors.
[INFO] [dependency:copy {execution: copy-legal}]
[INFO] Configured Artifact: org.apache.servicemix.legal:legal:1.0:xml
[INFO] Copying legal-1.0.xml to <http://hudson.zones.apache.org/hudson/job/ServiceMix-Plugins/ws/smx-plugins/servicemix-build/target/legal/legal.xml>
[INFO] [remote-resources:process {execution: default}]
[INFO] [antrun:run {execution: legal-files}]
[INFO] Executing tasks
     [copy] Copying 1 file to <http://hudson.zones.apache.org/hudson/job/ServiceMix-Plugins/ws/smx-plugins/servicemix-build/target/legal/META-INF>
     [copy] Copying 1 file to <http://hudson.zones.apache.org/hudson/job/ServiceMix-Plugins/ws/smx-plugins/servicemix-build/target/legal/META-INF>
     [copy] Copying 1 file to <http://hudson.zones.apache.org/hudson/job/ServiceMix-Plugins/ws/smx-plugins/servicemix-build/target/classes/META-INF>
     [copy] Copying 1 file to <http://hudson.zones.apache.org/hudson/job/ServiceMix-Plugins/ws/smx-plugins/servicemix-build/target/classes/META-INF>
[INFO] Executed tasks
[INFO] Registering compile source root <http://hudson.zones.apache.org/hudson/job/ServiceMix-Plugins/ws/smx-plugins/servicemix-build/target/legal>
[INFO] [resources:resources {execution: default-resources}]
[INFO] Using 'UTF-8' encoding to copy filtered resources.
[INFO] Copying 8 resources
[INFO] Copying 3 resources
[INFO] [compiler:compile {execution: default-compile}]
[INFO] Compiling 2 source files to <http://hudson.zones.apache.org/hudson/job/ServiceMix-Plugins/ws/smx-plugins/servicemix-build/target/classes>
[INFO] [resources:testResources {execution: default-testResources}]
[INFO] Using 'UTF-8' encoding to copy filtered resources.
[INFO] skip non existing resourceDirectory <http://hudson.zones.apache.org/hudson/job/ServiceMix-Plugins/ws/smx-plugins/servicemix-build/src/test/resources>
[INFO] Copying 3 resources
[INFO] [compiler:testCompile {execution: default-testCompile}]
[INFO] No sources to compile
[INFO] [surefire:test {execution: default-test}]
[INFO] Surefire report directory: <http://hudson.zones.apache.org/hudson/job/ServiceMix-Plugins/ws/smx-plugins/servicemix-build/target/surefire-reports>

-------------------------------------------------------
 T E S T S
-------------------------------------------------------
There are no tests to run.

Results :

Tests run: 0, Failures: 0, Errors: 0, Skipped: 0

[HUDSON] Recording test results
[INFO] [jar:jar {execution: default-jar}]
[INFO] Building jar: <http://hudson.zones.apache.org/hudson/job/ServiceMix-Plugins/ws/smx-plugins/servicemix-build/target/servicemix-build-1.1-SNAPSHOT.jar>
[INFO] [plugin:addPluginArtifactMetadata {execution: default-addPluginArtifactMetadata}]
[INFO] [install:install {execution: default-install}]
[INFO] Installing <http://hudson.zones.apache.org/hudson/job/ServiceMix-Plugins/ws/smx-plugins/servicemix-build/target/servicemix-build-1.1-SNAPSHOT.jar>
to <http://hudson.zones.apache.org/hudson/job/ServiceMix-Plugins/ws/.repository/org/apache/servicemix/servicemix-build/1.1-SNAPSHOT/servicemix-build-1.1-SNAPSHOT.jar>
[HUDSON] Archiving <http://hudson.zones.apache.org/hudson/job/ServiceMix-Plugins/ws/smx-plugins/servicemix-build/pom.xml>
to /export/home/hudson/hudson/jobs/ServiceMix-Plugins/modules/org.apache.servicemix$servicemix-build/builds/2010-05-03_08-24-51/archive/org.apache.servicemix/servicemix-build/1.1-SNAPSHOT/pom.xml
[HUDSON] Archiving <http://hudson.zones.apache.org/hudson/job/ServiceMix-Plugins/ws/smx-plugins/servicemix-build/target/servicemix-build-1.1-SNAPSHOT.jar>
to /export/home/hudson/hudson/jobs/ServiceMix-Plugins/modules/org.apache.servicemix$servicemix-build/builds/2010-05-03_08-24-51/archive/org.apache.servicemix/servicemix-build/1.1-SNAPSHOT/servicemix-build-1.1-SNAPSHOT.jar
[INFO] ------------------------------------------------------------------------
[INFO] Building ServiceMix :: Checksum Plugin
[INFO]    task-segment: [clean, install]
[INFO] ------------------------------------------------------------------------
[INFO] [clean:clean {execution: default-clean}]
[INFO] Deleting file set: <http://hudson.zones.apache.org/hudson/job/ServiceMix-Plugins/ws/smx-plugins/checksum-maven-plugin/target>
(included: [**], excluded: [])
[INFO] [plugin:descriptor {execution: default-descriptor}]
[INFO] Using 'UTF-8' encoding to read mojo metadata.
[INFO] Applying mojo extractor for language: java
[INFO] Mojo extractor for language: java found 1 mojo descriptors.
[INFO] Applying mojo extractor for language: bsh
[INFO] Mojo extractor for language: bsh found 0 mojo descriptors.
[INFO] [dependency:copy {execution: copy-legal}]
[INFO] Configured Artifact: org.apache.servicemix.legal:legal:1.0:xml
[INFO] Copying legal-1.0.xml to <http://hudson.zones.apache.org/hudson/job/ServiceMix-Plugins/ws/smx-plugins/checksum-maven-plugin/target/legal/legal.xml>
[INFO] [remote-resources:process {execution: default}]
[INFO] [resources:resources {execution: default-resources}]
[INFO] Using 'UTF-8' encoding to copy filtered resources.
[INFO] skip non existing resourceDirectory <http://hudson.zones.apache.org/hudson/job/ServiceMix-Plugins/ws/smx-plugins/checksum-maven-plugin/src/main/resources>
[INFO] Copying 3 resources
[INFO] [compiler:compile {execution: default-compile}]
[INFO] Compiling 1 source file to <http://hudson.zones.apache.org/hudson/job/ServiceMix-Plugins/ws/smx-plugins/checksum-maven-plugin/target/classes>
[INFO] [resources:testResources {execution: default-testResources}]
[INFO] Using 'UTF-8' encoding to copy filtered resources.
[INFO] Copying 0 resource
[INFO] Copying 3 resources
[INFO] [compiler:testCompile {execution: default-testCompile}]
[INFO] Nothing to compile - all classes are up to date
[INFO] [surefire:test {execution: default-test}]
[INFO] Surefire report directory: <http://hudson.zones.apache.org/hudson/job/ServiceMix-Plugins/ws/smx-plugins/checksum-maven-plugin/target/surefire-reports>

-------------------------------------------------------
 T E S T S
-------------------------------------------------------
There are no tests to run.

Results :

Tests run: 0, Failures: 0, Errors: 0, Skipped: 0

[HUDSON] Recording test results
[INFO] [jar:jar {execution: default-jar}]
[INFO] Building jar: <http://hudson.zones.apache.org/hudson/job/ServiceMix-Plugins/ws/smx-plugins/checksum-maven-plugin/target/checksum-maven-plugin-1.2-SNAPSHOT.jar>
[INFO] [plugin:addPluginArtifactMetadata {execution: default-addPluginArtifactMetadata}]
[INFO] [install:install {execution: default-install}]
[INFO] Installing <http://hudson.zones.apache.org/hudson/job/ServiceMix-Plugins/ws/smx-plugins/checksum-maven-plugin/target/checksum-maven-plugin-1.2-SNAPSHOT.jar>
to <http://hudson.zones.apache.org/hudson/job/ServiceMix-Plugins/ws/.repository/org/apache/servicemix/tooling/checksum-maven-plugin/1.2-SNAPSHOT/checksum-maven-plugin-1.2-SNAPSHOT.jar>
[HUDSON] Archiving <http://hudson.zones.apache.org/hudson/job/ServiceMix-Plugins/ws/smx-plugins/checksum-maven-plugin/pom.xml>
to /export/home/hudson/hudson/jobs/ServiceMix-Plugins/modules/org.apache.servicemix.tooling$checksum-maven-plugin/builds/2010-05-03_08-24-51/archive/org.apache.servicemix.tooling/checksum-maven-plugin/1.2-SNAPSHOT/pom.xml
[HUDSON] Archiving <http://hudson.zones.apache.org/hudson/job/ServiceMix-Plugins/ws/smx-plugins/checksum-maven-plugin/target/checksum-maven-plugin-1.2-SNAPSHOT.jar>
to /export/home/hudson/hudson/jobs/ServiceMix-Plugins/modules/org.apache.servicemix.tooling$checksum-maven-plugin/builds/2010-05-03_08-24-51/archive/org.apache.servicemix.tooling/checksum-maven-plugin/1.2-SNAPSHOT/checksum-maven-plugin-1.2-SNAPSHOT.jar
[INFO] ------------------------------------------------------------------------
[INFO] Building ServiceMix :: Maven2 Depends plugin
[INFO]    task-segment: [clean, install]
[INFO] ------------------------------------------------------------------------
[INFO] [clean:clean {execution: default-clean}]
[INFO] Deleting file set: <http://hudson.zones.apache.org/hudson/job/ServiceMix-Plugins/ws/smx-plugins/depends-maven-plugin/target>
(included: [**], excluded: [])
[INFO] [plugin:descriptor {execution: default-descriptor}]
[INFO] Using 'UTF-8' encoding to read mojo metadata.
[INFO] Applying mojo extractor for language: java
[INFO] Mojo extractor for language: java found 1 mojo descriptors.
[INFO] Applying mojo extractor for language: bsh
[INFO] Mojo extractor for language: bsh found 0 mojo descriptors.
[INFO] [dependency:copy {execution: copy-legal}]
[INFO] Configured Artifact: org.apache.servicemix.legal:legal:1.0:xml
[INFO] Copying legal-1.0.xml to <http://hudson.zones.apache.org/hudson/job/ServiceMix-Plugins/ws/smx-plugins/depends-maven-plugin/target/legal/legal.xml>
[INFO] [remote-resources:process {execution: default}]
[INFO] [resources:resources {execution: default-resources}]
[INFO] Using 'UTF-8' encoding to copy filtered resources.
[INFO] skip non existing resourceDirectory <http://hudson.zones.apache.org/hudson/job/ServiceMix-Plugins/ws/smx-plugins/depends-maven-plugin/src/main/resources>
[INFO] Copying 3 resources
[INFO] [compiler:compile {execution: default-compile}]
[INFO] Compiling 1 source file to <http://hudson.zones.apache.org/hudson/job/ServiceMix-Plugins/ws/smx-plugins/depends-maven-plugin/target/classes>
[INFO] [resources:testResources {execution: default-testResources}]
[INFO] Using 'UTF-8' encoding to copy filtered resources.
[INFO] skip non existing resourceDirectory <http://hudson.zones.apache.org/hudson/job/ServiceMix-Plugins/ws/smx-plugins/depends-maven-plugin/src/test/resources>
[INFO] Copying 3 resources
[INFO] [compiler:testCompile {execution: default-testCompile}]
[INFO] No sources to compile
[INFO] [surefire:test {execution: default-test}]
[INFO] Surefire report directory: <http://hudson.zones.apache.org/hudson/job/ServiceMix-Plugins/ws/smx-plugins/depends-maven-plugin/target/surefire-reports>

-------------------------------------------------------
 T E S T S
-------------------------------------------------------
There are no tests to run.

Results :

Tests run: 0, Failures: 0, Errors: 0, Skipped: 0

[HUDSON] Recording test results
[INFO] [jar:jar {execution: default-jar}]
[INFO] Building jar: <http://hudson.zones.apache.org/hudson/job/ServiceMix-Plugins/ws/smx-plugins/depends-maven-plugin/target/depends-maven-plugin-1.3-SNAPSHOT.jar>
[INFO] [plugin:addPluginArtifactMetadata {execution: default-addPluginArtifactMetadata}]
[INFO] [install:install {execution: default-install}]
[INFO] Installing <http://hudson.zones.apache.org/hudson/job/ServiceMix-Plugins/ws/smx-plugins/depends-maven-plugin/target/depends-maven-plugin-1.3-SNAPSHOT.jar>
to <http://hudson.zones.apache.org/hudson/job/ServiceMix-Plugins/ws/.repository/org/apache/servicemix/tooling/depends-maven-plugin/1.3-SNAPSHOT/depends-maven-plugin-1.3-SNAPSHOT.jar>
[HUDSON] Archiving <http://hudson.zones.apache.org/hudson/job/ServiceMix-Plugins/ws/smx-plugins/depends-maven-plugin/pom.xml>
to /export/home/hudson/hudson/jobs/ServiceMix-Plugins/modules/org.apache.servicemix.tooling$depends-maven-plugin/builds/2010-05-03_08-24-51/archive/org.apache.servicemix.tooling/depends-maven-plugin/1.3-SNAPSHOT/pom.xml
[HUDSON] Archiving <http://hudson.zones.apache.org/hudson/job/ServiceMix-Plugins/ws/smx-plugins/depends-maven-plugin/target/depends-maven-plugin-1.3-SNAPSHOT.jar>
to /export/home/hudson/hudson/jobs/ServiceMix-Plugins/modules/org.apache.servicemix.tooling$depends-maven-plugin/builds/2010-05-03_08-24-51/archive/org.apache.servicemix.tooling/depends-maven-plugin/1.3-SNAPSHOT/depends-maven-plugin-1.3-SNAPSHOT.jar
[INFO] ------------------------------------------------------------------------
[INFO] Building ServiceMix :: Maven2 Documentation Helper Plugin
[INFO]    task-segment: [clean, install]
[INFO] ------------------------------------------------------------------------
[INFO] [clean:clean {execution: default-clean}]
Downloading: http://svn.apache.org/repos/asf/servicemix/m2-repo//junit/junit/4.7/junit-4.7.pom
[INFO] Unable to find resource 'junit:junit:pom:4.7' in repository servicemix.m2 (http://svn.apache.org/repos/asf/servicemix/m2-repo/)
Downloading: http://people.apache.org/repo/m2-incubating-repository/junit/junit/4.7/junit-4.7.pom
[INFO] Unable to find resource 'junit:junit:pom:4.7' in repository apache.incubating (http://people.apache.org/repo/m2-incubating-repository)
Downloading: http://repository.codehaus.org/junit/junit/4.7/junit-4.7.pom
[INFO] Unable to find resource 'junit:junit:pom:4.7' in repository codehaus (http://repository.codehaus.org)
Downloading: http://repo1.maven.org/maven2/junit/junit/4.7/junit-4.7.pom

[INFO] [plugin:descriptor {execution: default-descriptor}]
[INFO] Using 'UTF-8' encoding to read mojo metadata.
[INFO] Applying mojo extractor for language: java
[INFO] Mojo extractor for language: java found 2 mojo descriptors.
[INFO] Applying mojo extractor for language: bsh
[INFO] Mojo extractor for language: bsh found 0 mojo descriptors.
[INFO] [dependency:copy {execution: copy-legal}]
[INFO] Configured Artifact: org.apache.servicemix.legal:legal:1.0:xml
[INFO] Copying legal-1.0.xml to <http://hudson.zones.apache.org/hudson/job/ServiceMix-Plugins/ws/smx-plugins/docs-maven-plugin/target/legal/legal.xml>
Downloading: http://svn.apache.org/repos/asf/servicemix/m2-repo//junit/junit/4.7/junit-4.7.jar
[INFO] Unable to find resource 'junit:junit:jar:4.7' in repository servicemix.m2 (http://svn.apache.org/repos/asf/servicemix/m2-repo/)
Downloading: http://people.apache.org/repo/m2-incubating-repository/junit/junit/4.7/junit-4.7.jar
[INFO] Unable to find resource 'junit:junit:jar:4.7' in repository apache.incubating (http://people.apache.org/repo/m2-incubating-repository)
Downloading: http://repository.codehaus.org/junit/junit/4.7/junit-4.7.jar
[INFO] Unable to find resource 'junit:junit:jar:4.7' in repository codehaus (http://repository.codehaus.org)
Downloading: http://repo1.maven.org/maven2/junit/junit/4.7/junit-4.7.jar

[INFO] [remote-resources:process {execution: default}]
[INFO] [resources:resources {execution: default-resources}]
[INFO] Using 'UTF-8' encoding to copy filtered resources.
[INFO] skip non existing resourceDirectory <http://hudson.zones.apache.org/hudson/job/ServiceMix-Plugins/ws/smx-plugins/docs-maven-plugin/src/main/resources>
[INFO] Copying 3 resources
[INFO] [compiler:compile {execution: default-compile}]
[INFO] Compiling 4 source files to <http://hudson.zones.apache.org/hudson/job/ServiceMix-Plugins/ws/smx-plugins/docs-maven-plugin/target/classes>
[HUDSON] Archiving <http://hudson.zones.apache.org/hudson/job/ServiceMix-Plugins/ws/smx-plugins/docs-maven-plugin/pom.xml>
to /export/home/hudson/hudson/jobs/ServiceMix-Plugins/modules/org.apache.servicemix.tooling$docs-maven-plugin/builds/2010-05-03_08-24-51/archive/org.apache.servicemix.tooling/docs-maven-plugin/0.1-SNAPSHOT/pom.xml
[INFO] ------------------------------------------------------------------------
[ERROR] BUILD FAILURE
[INFO] ------------------------------------------------------------------------
[INFO] Compilation failure
<http://hudson.zones.apache.org/hudson/job/ServiceMix-Plugins/ws/smx-plugins/docs-maven-plugin/src/main/java/org/apache/servicemix/docs/SnippetMojo.java>:[56,17]
method does not override a method from its superclass


[INFO] ------------------------------------------------------------------------
[INFO] Trace
org.apache.maven.BuildFailureException: Compilation failure
<http://hudson.zones.apache.org/hudson/job/ServiceMix-Plugins/ws/smx-plugins/docs-maven-plugin/src/main/java/org/apache/servicemix/docs/SnippetMojo.java>:[56,17]
method does not override a method from its superclass


	at org.apache.maven.lifecycle.DefaultLifecycleExecutor.executeGoals(DefaultLifecycleExecutor.java:715)
	at org.apache.maven.lifecycle.DefaultLifecycleExecutor.executeGoalWithLifecycle(DefaultLifecycleExecutor.java:556)
	at org.apache.maven.lifecycle.DefaultLifecycleExecutor.executeGoal(DefaultLifecycleExecutor.java:535)
	at org.apache.maven.lifecycle.DefaultLifecycleExecutor.executeGoalAndHandleFailures(DefaultLifecycleExecutor.java:387)
	at org.apache.maven.lifecycle.DefaultLifecycleExecutor.executeTaskSegments(DefaultLifecycleExecutor.java:348)
	at org.apache.maven.lifecycle.DefaultLifecycleExecutor.execute(DefaultLifecycleExecutor.java:180)
	at org.apache.maven.lifecycle.LifecycleExecutorInterceptor.execute(LifecycleExecutorInterceptor.java:65)
	at org.apache.maven.DefaultMaven.doExecute(DefaultMaven.java:328)
	at org.apache.maven.DefaultMaven.execute(DefaultMaven.java:138)
	at org.apache.maven.cli.MavenCli.main(MavenCli.java:362)
	at sun.reflect.NativeMethodAccessorImpl.invoke0(Native Method)
	at sun.reflect.NativeMethodAccessorImpl.invoke(NativeMethodAccessorImpl.java:39)
	at sun.reflect.DelegatingMethodAccessorImpl.invoke(DelegatingMethodAccessorImpl.java:25)
	at java.lang.reflect.Method.invoke(Method.java:592)
	at org.codehaus.classworlds.Launcher.launchEnhanced(Launcher.java:315)
	at org.codehaus.classworlds.Launcher.launch(Launcher.java:255)
	at hudson.maven.agent.Main.launch(Main.java:165)
	at hudson.maven.MavenBuilder.call(MavenBuilder.java:159)
	at hudson.maven.MavenModuleSetBuild$Builder.call(MavenModuleSetBuild.java:688)
	at hudson.maven.MavenModuleSetBuild$Builder.call(MavenModuleSetBuild.java:632)
	at hudson.remoting.UserRequest.perform(UserRequest.java:104)
	at hudson.remoting.UserRequest.perform(UserRequest.java:48)
	at hudson.remoting.Request$2.run(Request.java:236)
	at java.util.concurrent.Executors$RunnableAdapter.call(Executors.java:417)
	at java.util.concurrent.FutureTask$Sync.innerRun(FutureTask.java:269)
	at java.util.concurrent.FutureTask.run(FutureTask.java:123)
	at java.util.concurrent.ThreadPoolExecutor$Worker.runTask(ThreadPoolExecutor.java:651)
	at java.util.concurrent.ThreadPoolExecutor$Worker.run(ThreadPoolExecutor.java:676)
	at java.lang.Thread.run(Thread.java:595)
Caused by: org.apache.maven.plugin.CompilationFailureException: Compilation failure
<http://hudson.zones.apache.org/hudson/job/ServiceMix-Plugins/ws/smx-plugins/docs-maven-plugin/src/main/java/org/apache/servicemix/docs/SnippetMojo.java>:[56,17]
method does not override a method from its superclass


	at org.apache.maven.plugin.AbstractCompilerMojo.execute(AbstractCompilerMojo.java:516)
	at org.apache.maven.plugin.CompilerMojo.execute(CompilerMojo.java:114)
	at org.apache.maven.plugin.DefaultPluginManager.executeMojo(DefaultPluginManager.java:490)
	at hudson.maven.agent.PluginManagerInterceptor.executeMojo(PluginManagerInterceptor.java:182)
	at org.apache.maven.lifecycle.DefaultLifecycleExecutor.executeGoals(DefaultLifecycleExecutor.java:694)
	... 28 more
[INFO] ------------------------------------------------------------------------
[INFO] Total time: 34 seconds
[INFO] Finished at: Mon May 03 08:25:37 UTC 2010
[INFO] Final Memory: 34M/87M
[INFO] ------------------------------------------------------------------------
Waiting for Hudson to finish collecting data
Sending e-mails to: commits@servicemix.apache.org
channel stopped


Mime
View raw message