servicemix-commits mailing list archives

Site index · List index
Message view « Date » · « Thread »
Top « Date » · « Thread »
From Apache Hudson Server <hud...@hudson.zones.apache.org>
Subject Build failed in Hudson: Servicemix-Archetypes #15
Date Mon, 14 Jun 2010 18:54:41 GMT
See <http://hudson.zones.apache.org/hudson/job/Servicemix-Archetypes/15/>

------------------------------------------
[...truncated 1972 lines...]
[INFO] [jar:jar {execution: default-jar}]
[INFO] Building jar: <http://hudson.zones.apache.org/hudson/job/Servicemix-Archetypes/ws/smx-achetypes/servicemix-osgi-cxf-code-first-archetype/target/servicemix-osgi-cxf-code-first-archetype-2010.01-SNAPSHOT.jar>
[INFO] [install:install {execution: default-install}]
[INFO] Installing <http://hudson.zones.apache.org/hudson/job/Servicemix-Archetypes/ws/smx-achetypes/servicemix-osgi-cxf-code-first-archetype/target/servicemix-osgi-cxf-code-first-archetype-2010.01-SNAPSHOT.jar>
to <http://hudson.zones.apache.org/hudson/job/Servicemix-Archetypes/ws/.repository/org/apache/servicemix/tooling/servicemix-osgi-cxf-code-first-archetype/2010.01-SNAPSHOT/servicemix-osgi-cxf-code-first-archetype-2010.01-SNAPSHOT.jar>
[HUDSON] Archiving <http://hudson.zones.apache.org/hudson/job/Servicemix-Archetypes/ws/smx-achetypes/servicemix-osgi-cxf-code-first-archetype/pom.xml>
to /export/home/hudson/hudson/jobs/Servicemix-Archetypes/modules/org.apache.servicemix.tooling$servicemix-osgi-cxf-code-first-archetype/builds/2010-06-14_18-52-15/archive/org.apache.servicemix.tooling/servicemix-osgi-cxf-code-first-archetype/2010.01-SNAPSHOT/pom.xml
[HUDSON] Archiving <http://hudson.zones.apache.org/hudson/job/Servicemix-Archetypes/ws/smx-achetypes/servicemix-osgi-cxf-code-first-archetype/target/servicemix-osgi-cxf-code-first-archetype-2010.01-SNAPSHOT.jar>
to /export/home/hudson/hudson/jobs/Servicemix-Archetypes/modules/org.apache.servicemix.tooling$servicemix-osgi-cxf-code-first-archetype/builds/2010-06-14_18-52-15/archive/org.apache.servicemix.tooling/servicemix-osgi-cxf-code-first-archetype/2010.01-SNAPSHOT/servicemix-osgi-cxf-code-first-archetype-2010.01-SNAPSHOT.jar
[INFO] ------------------------------------------------------------------------
[INFO] Building ServiceMix :: Archetypes :: CXFWSDLFirstOSGiServiceUnit
[INFO]    task-segment: [clean, install]
[INFO] ------------------------------------------------------------------------
[INFO] [clean:clean {execution: default-clean}]
[INFO] Deleting file set: <http://hudson.zones.apache.org/hudson/job/Servicemix-Archetypes/ws/smx-achetypes/servicemix-osgi-cxf-wsdl-first-archetype/target>
(included: [**], excluded: [])
[INFO] [remote-resources:process {execution: default}]
[INFO] [servicemix-build:copy {execution: default}]
[INFO] [resources:resources {execution: default-resources}]
[INFO] Using 'UTF-8' encoding to copy filtered resources.
[INFO] Copying 5 resources
[INFO] Copying 3 resources
[INFO] [res:resources {execution: default}]
[INFO] Using default encoding to copy filtered resources.
[INFO] Copying 5 resources
[INFO] [compiler:compile {execution: default-compile}]
[INFO] No sources to compile
[INFO] [resources:testResources {execution: default-testResources}]
[INFO] Using 'UTF-8' encoding to copy filtered resources.
[INFO] skip non existing resourceDirectory <http://hudson.zones.apache.org/hudson/job/Servicemix-Archetypes/ws/smx-achetypes/servicemix-osgi-cxf-wsdl-first-archetype/src/test/resources>
[INFO] Copying 3 resources
[INFO] [compiler:testCompile {execution: default-testCompile}]
[INFO] No sources to compile
[INFO] [surefire:test {execution: default-test}]
[INFO] Surefire report directory: <http://hudson.zones.apache.org/hudson/job/Servicemix-Archetypes/ws/smx-achetypes/servicemix-osgi-cxf-wsdl-first-archetype/target/surefire-reports>

-------------------------------------------------------
 T E S T S
-------------------------------------------------------
There are no tests to run.

Results :

Tests run: 0, Failures: 0, Errors: 0, Skipped: 0

[HUDSON] Recording test results
[INFO] [jar:jar {execution: default-jar}]
[INFO] Building jar: <http://hudson.zones.apache.org/hudson/job/Servicemix-Archetypes/ws/smx-achetypes/servicemix-osgi-cxf-wsdl-first-archetype/target/servicemix-osgi-cxf-wsdl-first-archetype-2010.01-SNAPSHOT.jar>
[INFO] [install:install {execution: default-install}]
[INFO] Installing <http://hudson.zones.apache.org/hudson/job/Servicemix-Archetypes/ws/smx-achetypes/servicemix-osgi-cxf-wsdl-first-archetype/target/servicemix-osgi-cxf-wsdl-first-archetype-2010.01-SNAPSHOT.jar>
to <http://hudson.zones.apache.org/hudson/job/Servicemix-Archetypes/ws/.repository/org/apache/servicemix/tooling/servicemix-osgi-cxf-wsdl-first-archetype/2010.01-SNAPSHOT/servicemix-osgi-cxf-wsdl-first-archetype-2010.01-SNAPSHOT.jar>
[HUDSON] Archiving <http://hudson.zones.apache.org/hudson/job/Servicemix-Archetypes/ws/smx-achetypes/servicemix-osgi-cxf-wsdl-first-archetype/pom.xml>
to /export/home/hudson/hudson/jobs/Servicemix-Archetypes/modules/org.apache.servicemix.tooling$servicemix-osgi-cxf-wsdl-first-archetype/builds/2010-06-14_18-52-15/archive/org.apache.servicemix.tooling/servicemix-osgi-cxf-wsdl-first-archetype/2010.01-SNAPSHOT/pom.xml
[HUDSON] Archiving <http://hudson.zones.apache.org/hudson/job/Servicemix-Archetypes/ws/smx-achetypes/servicemix-osgi-cxf-wsdl-first-archetype/target/servicemix-osgi-cxf-wsdl-first-archetype-2010.01-SNAPSHOT.jar>
to /export/home/hudson/hudson/jobs/Servicemix-Archetypes/modules/org.apache.servicemix.tooling$servicemix-osgi-cxf-wsdl-first-archetype/builds/2010-06-14_18-52-15/archive/org.apache.servicemix.tooling/servicemix-osgi-cxf-wsdl-first-archetype/2010.01-SNAPSHOT/servicemix-osgi-cxf-wsdl-first-archetype-2010.01-SNAPSHOT.jar
[INFO] ------------------------------------------------------------------------
[INFO] Building ServiceMix :: Archetypes :: ProjectRoot
[INFO]    task-segment: [clean, install]
[INFO] ------------------------------------------------------------------------
[INFO] [clean:clean {execution: default-clean}]
[INFO] Deleting file set: <http://hudson.zones.apache.org/hudson/job/Servicemix-Archetypes/ws/smx-achetypes/servicemix-project-root/target>
(included: [**], excluded: [])
[INFO] [remote-resources:process {execution: default}]
[INFO] [servicemix-build:copy {execution: default}]
[INFO] [resources:resources {execution: default-resources}]
[INFO] Using 'UTF-8' encoding to copy filtered resources.
[INFO] Copying 2 resources
[INFO] Copying 3 resources
[INFO] [res:resources {execution: default}]
[INFO] Using default encoding to copy filtered resources.
[INFO] Copying 2 resources
[INFO] [compiler:compile {execution: default-compile}]
[INFO] No sources to compile
[INFO] [resources:testResources {execution: default-testResources}]
[INFO] Using 'UTF-8' encoding to copy filtered resources.
[INFO] skip non existing resourceDirectory <http://hudson.zones.apache.org/hudson/job/Servicemix-Archetypes/ws/smx-achetypes/servicemix-project-root/src/test/resources>
[INFO] Copying 3 resources
[INFO] [compiler:testCompile {execution: default-testCompile}]
[INFO] No sources to compile
[INFO] [surefire:test {execution: default-test}]
[INFO] Surefire report directory: <http://hudson.zones.apache.org/hudson/job/Servicemix-Archetypes/ws/smx-achetypes/servicemix-project-root/target/surefire-reports>

-------------------------------------------------------
 T E S T S
-------------------------------------------------------
There are no tests to run.

Results :

Tests run: 0, Failures: 0, Errors: 0, Skipped: 0

[HUDSON] Recording test results
[INFO] [jar:jar {execution: default-jar}]
[INFO] Building jar: <http://hudson.zones.apache.org/hudson/job/Servicemix-Archetypes/ws/smx-achetypes/servicemix-project-root/target/servicemix-project-root-2010.01-SNAPSHOT.jar>
[INFO] [install:install {execution: default-install}]
[INFO] Installing <http://hudson.zones.apache.org/hudson/job/Servicemix-Archetypes/ws/smx-achetypes/servicemix-project-root/target/servicemix-project-root-2010.01-SNAPSHOT.jar>
to <http://hudson.zones.apache.org/hudson/job/Servicemix-Archetypes/ws/.repository/org/apache/servicemix/tooling/servicemix-project-root/2010.01-SNAPSHOT/servicemix-project-root-2010.01-SNAPSHOT.jar>
[HUDSON] Archiving <http://hudson.zones.apache.org/hudson/job/Servicemix-Archetypes/ws/smx-achetypes/servicemix-project-root/pom.xml>
to /export/home/hudson/hudson/jobs/Servicemix-Archetypes/modules/org.apache.servicemix.tooling$servicemix-project-root/builds/2010-06-14_18-52-15/archive/org.apache.servicemix.tooling/servicemix-project-root/2010.01-SNAPSHOT/pom.xml
[HUDSON] Archiving <http://hudson.zones.apache.org/hudson/job/Servicemix-Archetypes/ws/smx-achetypes/servicemix-project-root/target/servicemix-project-root-2010.01-SNAPSHOT.jar>
to /export/home/hudson/hudson/jobs/Servicemix-Archetypes/modules/org.apache.servicemix.tooling$servicemix-project-root/builds/2010-06-14_18-52-15/archive/org.apache.servicemix.tooling/servicemix-project-root/2010.01-SNAPSHOT/servicemix-project-root-2010.01-SNAPSHOT.jar
[INFO] ------------------------------------------------------------------------
[INFO] Building ServiceMix :: Archetypes :: ITests
[INFO]    task-segment: [clean, install]
[INFO] ------------------------------------------------------------------------
[INFO] [clean:clean {execution: default-clean}]
Downloading: http://svn.apache.org/repos/asf/servicemix/m2-repo//com/sun/mail/all/1.4.3/all-1.4.3.pom
[INFO] Unable to find resource 'com.sun.mail:all:pom:1.4.3' in repository servicemix.m2 (http://svn.apache.org/repos/asf/servicemix/m2-repo/)
Downloading: http://people.apache.org/repo/m2-incubating-repository/com/sun/mail/all/1.4.3/all-1.4.3.pom
[INFO] Unable to find resource 'com.sun.mail:all:pom:1.4.3' in repository apache.incubating
(http://people.apache.org/repo/m2-incubating-repository)
Downloading: http://repository.codehaus.org/com/sun/mail/all/1.4.3/all-1.4.3.pom
[INFO] Unable to find resource 'com.sun.mail:all:pom:1.4.3' in repository codehaus (http://repository.codehaus.org)
Downloading: http://repo1.maven.org/maven2/com/sun/mail/all/1.4.3/all-1.4.3.pom
[INFO] Unable to find resource 'com.sun.mail:all:pom:1.4.3' in repository central (http://repo1.maven.org/maven2)
[HUDSON] Archiving <http://hudson.zones.apache.org/hudson/job/Servicemix-Archetypes/ws/smx-achetypes/servicemix-archetypes-itests/pom.xml>
to /export/home/hudson/hudson/jobs/Servicemix-Archetypes/modules/org.apache.servicemix$servicemix-archetypes-itests/builds/2010-06-14_18-52-15/archive/org.apache.servicemix/servicemix-archetypes-itests/2010.01-SNAPSHOT/pom.xml
[INFO] ------------------------------------------------------------------------
[ERROR] BUILD ERROR
[INFO] ------------------------------------------------------------------------
[INFO] Failed to resolve artifact.

GroupId: com.sun.mail
ArtifactId: all
Version: 1.4.3

Reason: Unable to download the artifact from any repository

  com.sun.mail:all:pom:1.4.3

from the specified remote repositories:
  central (http://repo1.maven.org/maven2),
  servicemix.m2 (http://svn.apache.org/repos/asf/servicemix/m2-repo/),
  codehaus (http://repository.codehaus.org),
  apache.snapshots (http://repository.apache.org/snapshots),
  apache.incubating (http://people.apache.org/repo/m2-incubating-repository)



[INFO] ------------------------------------------------------------------------
[INFO] Trace
org.apache.maven.lifecycle.LifecycleExecutionException: Unable to get dependency information:
Unable to read the metadata file for artifact 'javax.mail:mail:jar': Cannot find parent: com.sun.mail:all
for project: javax.mail:mail:jar:null for project javax.mail:mail:jar:null
  javax.mail:mail:jar:1.4.3

from the specified remote repositories:
  central (http://repo1.maven.org/maven2),
  servicemix.m2 (http://svn.apache.org/repos/asf/servicemix/m2-repo/),
  codehaus (http://repository.codehaus.org),
  apache.snapshots (http://repository.apache.org/snapshots),
  apache.incubating (http://people.apache.org/repo/m2-incubating-repository)

Path to dependency: 
	1) org.apache.servicemix:servicemix-archetypes-itests:jar:2010.01-SNAPSHOT
	2) org.apache.servicemix:servicemix-mail:jar:2010.01


	at org.apache.maven.lifecycle.DefaultLifecycleExecutor.executeGoals(DefaultLifecycleExecutor.java:711)
	at org.apache.maven.lifecycle.DefaultLifecycleExecutor.executeGoalWithLifecycle(DefaultLifecycleExecutor.java:556)
	at org.apache.maven.lifecycle.DefaultLifecycleExecutor.executeGoal(DefaultLifecycleExecutor.java:535)
	at org.apache.maven.lifecycle.DefaultLifecycleExecutor.executeGoalAndHandleFailures(DefaultLifecycleExecutor.java:387)
	at org.apache.maven.lifecycle.DefaultLifecycleExecutor.executeTaskSegments(DefaultLifecycleExecutor.java:348)
	at org.apache.maven.lifecycle.DefaultLifecycleExecutor.execute(DefaultLifecycleExecutor.java:180)
	at org.apache.maven.lifecycle.LifecycleExecutorInterceptor.execute(LifecycleExecutorInterceptor.java:65)
	at org.apache.maven.DefaultMaven.doExecute(DefaultMaven.java:328)
	at org.apache.maven.DefaultMaven.execute(DefaultMaven.java:138)
	at org.apache.maven.cli.MavenCli.main(MavenCli.java:362)
	at sun.reflect.NativeMethodAccessorImpl.invoke0(Native Method)
	at sun.reflect.NativeMethodAccessorImpl.invoke(NativeMethodAccessorImpl.java:39)
	at sun.reflect.DelegatingMethodAccessorImpl.invoke(DelegatingMethodAccessorImpl.java:25)
	at java.lang.reflect.Method.invoke(Method.java:592)
	at org.codehaus.classworlds.Launcher.launchEnhanced(Launcher.java:315)
	at org.codehaus.classworlds.Launcher.launch(Launcher.java:255)
	at hudson.maven.agent.Main.launch(Main.java:165)
	at hudson.maven.MavenBuilder.call(MavenBuilder.java:159)
	at hudson.maven.MavenModuleSetBuild$Builder.call(MavenModuleSetBuild.java:688)
	at hudson.maven.MavenModuleSetBuild$Builder.call(MavenModuleSetBuild.java:632)
	at hudson.remoting.UserRequest.perform(UserRequest.java:114)
	at hudson.remoting.UserRequest.perform(UserRequest.java:48)
	at hudson.remoting.Request$2.run(Request.java:270)
	at java.util.concurrent.Executors$RunnableAdapter.call(Executors.java:417)
	at java.util.concurrent.FutureTask$Sync.innerRun(FutureTask.java:269)
	at java.util.concurrent.FutureTask.run(FutureTask.java:123)
	at java.util.concurrent.ThreadPoolExecutor$Worker.runTask(ThreadPoolExecutor.java:651)
	at java.util.concurrent.ThreadPoolExecutor$Worker.run(ThreadPoolExecutor.java:676)
	at java.lang.Thread.run(Thread.java:595)
Caused by: org.apache.maven.artifact.resolver.ArtifactResolutionException: Unable to get dependency
information: Unable to read the metadata file for artifact 'javax.mail:mail:jar': Cannot find
parent: com.sun.mail:all for project: javax.mail:mail:jar:null for project javax.mail:mail:jar:null
  javax.mail:mail:jar:1.4.3

from the specified remote repositories:
  central (http://repo1.maven.org/maven2),
  servicemix.m2 (http://svn.apache.org/repos/asf/servicemix/m2-repo/),
  codehaus (http://repository.codehaus.org),
  apache.snapshots (http://repository.apache.org/snapshots),
  apache.incubating (http://people.apache.org/repo/m2-incubating-repository)

Path to dependency: 
	1) org.apache.servicemix:servicemix-archetypes-itests:jar:2010.01-SNAPSHOT
	2) org.apache.servicemix:servicemix-mail:jar:2010.01


	at org.apache.maven.artifact.resolver.DefaultArtifactCollector.recurse(DefaultArtifactCollector.java:430)
	at org.apache.maven.artifact.resolver.DefaultArtifactCollector.recurse(DefaultArtifactCollector.java:435)
	at org.apache.maven.artifact.resolver.DefaultArtifactCollector.collect(DefaultArtifactCollector.java:74)
	at org.apache.maven.artifact.resolver.DefaultArtifactResolver.resolveTransitively(DefaultArtifactResolver.java:316)
	at org.apache.maven.artifact.resolver.DefaultArtifactResolver.resolveTransitively(DefaultArtifactResolver.java:304)
	at org.apache.maven.plugin.DefaultPluginManager.resolveTransitiveDependencies(DefaultPluginManager.java:1499)
	at org.apache.maven.plugin.DefaultPluginManager.executeMojo(DefaultPluginManager.java:442)
	at hudson.maven.agent.PluginManagerInterceptor.executeMojo(PluginManagerInterceptor.java:182)
	at org.apache.maven.lifecycle.DefaultLifecycleExecutor.executeGoals(DefaultLifecycleExecutor.java:694)
	... 28 more
Caused by: org.apache.maven.artifact.metadata.ArtifactMetadataRetrievalException: Unable to
read the metadata file for artifact 'javax.mail:mail:jar': Cannot find parent: com.sun.mail:all
for project: javax.mail:mail:jar:null for project javax.mail:mail:jar:null
	at org.apache.maven.project.artifact.MavenMetadataSource.retrieveRelocatedProject(MavenMetadataSource.java:200)
	at org.apache.maven.project.artifact.MavenMetadataSource.retrieveRelocatedArtifact(MavenMetadataSource.java:94)
	at org.apache.maven.artifact.resolver.DefaultArtifactCollector.recurse(DefaultArtifactCollector.java:387)
	... 36 more
Caused by: org.apache.maven.project.ProjectBuildingException: Cannot find parent: com.sun.mail:all
for project: javax.mail:mail:jar:null for project javax.mail:mail:jar:null
	at org.apache.maven.project.DefaultMavenProjectBuilder.assembleLineage(DefaultMavenProjectBuilder.java:1396)
	at org.apache.maven.project.DefaultMavenProjectBuilder.buildInternal(DefaultMavenProjectBuilder.java:823)
	at org.apache.maven.project.DefaultMavenProjectBuilder.buildFromRepository(DefaultMavenProjectBuilder.java:255)
	at org.apache.maven.project.artifact.MavenMetadataSource.retrieveRelocatedProject(MavenMetadataSource.java:163)
	... 38 more
Caused by: org.apache.maven.project.ProjectBuildingException: POM 'com.sun.mail:all' not found
in repository: Unable to download the artifact from any repository

  com.sun.mail:all:pom:1.4.3

from the specified remote repositories:
  central (http://repo1.maven.org/maven2),
  servicemix.m2 (http://svn.apache.org/repos/asf/servicemix/m2-repo/),
  codehaus (http://repository.codehaus.org),
  apache.snapshots (http://repository.apache.org/snapshots),
  apache.incubating (http://people.apache.org/repo/m2-incubating-repository)

 for project com.sun.mail:all
	at org.apache.maven.project.DefaultMavenProjectBuilder.findModelFromRepository(DefaultMavenProjectBuilder.java:605)
	at org.apache.maven.project.DefaultMavenProjectBuilder.assembleLineage(DefaultMavenProjectBuilder.java:1392)
	... 41 more
Caused by: org.apache.maven.artifact.resolver.ArtifactNotFoundException: Unable to download
the artifact from any repository

  com.sun.mail:all:pom:1.4.3

from the specified remote repositories:
  central (http://repo1.maven.org/maven2),
  servicemix.m2 (http://svn.apache.org/repos/asf/servicemix/m2-repo/),
  codehaus (http://repository.codehaus.org),
  apache.snapshots (http://repository.apache.org/snapshots),
  apache.incubating (http://people.apache.org/repo/m2-incubating-repository)


	at org.apache.maven.artifact.resolver.DefaultArtifactResolver.resolve(DefaultArtifactResolver.java:228)
	at org.apache.maven.artifact.resolver.DefaultArtifactResolver.resolve(DefaultArtifactResolver.java:90)
	at org.apache.maven.project.DefaultMavenProjectBuilder.findModelFromRepository(DefaultMavenProjectBuilder.java:558)
	... 42 more
Caused by: org.apache.maven.wagon.ResourceDoesNotExistException: Unable to download the artifact
from any repository
	at org.apache.maven.artifact.manager.DefaultWagonManager.getArtifact(DefaultWagonManager.java:404)
	at org.apache.maven.artifact.resolver.DefaultArtifactResolver.resolve(DefaultArtifactResolver.java:216)
	... 44 more
[INFO] ------------------------------------------------------------------------
[INFO] Total time: 1 minute 59 seconds
[INFO] Finished at: Mon Jun 14 18:54:26 UTC 2010
[INFO] Final Memory: 63M/118M
[INFO] ------------------------------------------------------------------------
channel stopped


Mime
View raw message